beam-commits mailing list archives

Site index · List index
Message view « Date » · « Thread »
Top « Date » · « Thread »
From Apache Jenkins Server <jenk...@builds.apache.org>
Subject Build failed in Jenkins: beam_PreCommit_Java_Cron #229
Date Wed, 15 Aug 2018 12:24:13 GMT
See <https://builds.apache.org/job/beam_PreCommit_Java_Cron/229/display/redirect?page=changes>

Changes:

[tha] [BEAM-5147] Java elasticsearch client support for reading entire

------------------------------------------
[...truncated 17.49 MB...]
    INFO: 2018-08-15T12:20:39.505Z: Autoscaling: Raised the number of workers to 0 based on
the rate of progress in the currently running step(s).
    Aug 15, 2018 12:20:51 PM org.apache.beam.runners.dataflow.util.MonitoringUtil$LoggingHandler
process
    INFO: 2018-08-15T12:20:50.209Z: Autoscaling: Raised the number of workers to 1 based on
the rate of progress in the currently running step(s).
    Aug 15, 2018 12:20:51 PM org.apache.beam.runners.dataflow.util.MonitoringUtil$LoggingHandler
process
    INFO: 2018-08-15T12:20:50.246Z: Autoscaling: Would further reduce the number of workers
but reached the minimum number allowed for the job.
    Aug 15, 2018 12:21:10 PM org.apache.beam.runners.dataflow.util.MonitoringUtil$LoggingHandler
process
    INFO: 2018-08-15T12:21:08.558Z: Workers have started successfully.
    Aug 15, 2018 12:21:10 PM org.apache.beam.runners.dataflow.util.MonitoringUtil$LoggingHandler
process
    INFO: 2018-08-15T12:21:08.588Z: Workers have started successfully.
    Aug 15, 2018 12:21:29 PM org.apache.beam.runners.dataflow.util.MonitoringUtil$LoggingHandler
process
    INFO: 2018-08-15T12:21:29.242Z: Executing operation WordCount.CountWords/Count.PerElement/Combine.perKey(Count)/GroupByKey/Close
    Aug 15, 2018 12:21:29 PM org.apache.beam.runners.dataflow.util.MonitoringUtil$LoggingHandler
process
    INFO: 2018-08-15T12:21:29.329Z: Executing operation WordCount.CountWords/Count.PerElement/Combine.perKey(Count)/GroupByKey/Read+WordCount.CountWords/Count.PerElement/Combine.perKey(Count)/Combine.GroupedValues+WordCount.CountWords/Count.PerElement/Combine.perKey(Count)/Combine.GroupedValues/Extract+MapElements/Map+WriteOneFilePerWindow/TextIO.Write/WriteFiles/WriteUnshardedBundlesToTempFiles/WriteUnshardedBundles+WriteOneFilePerWindow/TextIO.Write/WriteFiles/GatherTempFileResults/Add
void key/AddKeys/Map+WriteOneFilePerWindow/TextIO.Write/WriteFiles/GatherTempFileResults/Reshuffle/Window.Into()/Window.Assign+WriteOneFilePerWindow/TextIO.Write/WriteFiles/GatherTempFileResults/Reshuffle/GroupByKey/Reify+WriteOneFilePerWindow/TextIO.Write/WriteFiles/GatherTempFileResults/Reshuffle/GroupByKey/Write+WriteOneFilePerWindow/TextIO.Write/WriteFiles/WriteUnshardedBundlesToTempFiles/GroupUnwritten/Reify+WriteOneFilePerWindow/TextIO.Write/WriteFiles/WriteUnshardedBundlesToTempFiles/GroupUnwritten/Write

> Task :beam-runners-google-cloud-dataflow-java-examples-streaming:preCommit
    Aug 15, 2018 12:21:36 PM org.apache.beam.runners.dataflow.DataflowPipelineJob waitUntilFinish
    WARNING: No terminal state was returned. State value RUNNING
    Aug 15, 2018 12:21:36 PM org.apache.beam.runners.dataflow.TestDataflowRunner waitForStreamingJobTermination
    INFO: Dataflow job 2018-08-15_05_11_35-10795780200202926217 took longer than 600 seconds
to complete, cancelling.
    Aug 15, 2018 12:21:36 PM org.apache.beam.runners.dataflow.TestDataflowRunner run
    WARNING: Dataflow job 2018-08-15_05_11_35-10795780200202926217 did not output a success
or failure metric.

Gradle Test Executor 99 finished executing tests.

> Task :beam-runners-google-cloud-dataflow-java-examples-streaming:preCommit FAILED

org.apache.beam.examples.WordCountIT > testE2EWordCount FAILED
    java.lang.RuntimeException: Dataflow job 2018-08-15_05_11_35-10795780200202926217 terminated
in state UNKNOWN but did not return a failure reason.
        at org.apache.beam.runners.dataflow.TestDataflowRunner.run(TestDataflowRunner.java:134)
        at org.apache.beam.runners.dataflow.TestDataflowRunner.run(TestDataflowRunner.java:90)
        at org.apache.beam.runners.dataflow.TestDataflowRunner.run(TestDataflowRunner.java:55)
        at org.apache.beam.sdk.Pipeline.run(Pipeline.java:313)
        at org.apache.beam.sdk.Pipeline.run(Pipeline.java:299)
        at org.apache.beam.examples.WordCount.runWordCount(WordCount.java:185)
        at org.apache.beam.examples.WordCountIT.testE2EWordCount(WordCountIT.java:70)

1 test completed, 1 failed
Finished generating test XML results (0.005 secs) into: <https://builds.apache.org/job/beam_PreCommit_Java_Cron/ws/src/runners/google-cloud-dataflow-java/examples-streaming/build/test-results/preCommit>
Generating HTML test report...
Finished generating test html results (0.008 secs) into: <https://builds.apache.org/job/beam_PreCommit_Java_Cron/ws/src/runners/google-cloud-dataflow-java/examples-streaming/build/reports/tests/preCommit>
:beam-runners-google-cloud-dataflow-java-examples-streaming:preCommit (Thread[Task worker
for ':' Thread 11,5,main]) completed. Took 10 mins 31.874 secs.
:beam-runners-google-cloud-dataflow-java-examples-streaming:test (Thread[Task worker for ':'
Thread 11,5,main]) started.

> Task :beam-runners-google-cloud-dataflow-java-examples-streaming:test NO-SOURCE
Skipping task ':beam-runners-google-cloud-dataflow-java-examples-streaming:test' as it has
no source files and no previous output files.
:beam-runners-google-cloud-dataflow-java-examples-streaming:test (Thread[Task worker for ':'
Thread 11,5,main]) completed. Took 0.002 secs.
:beam-runners-google-cloud-dataflow-java-examples-streaming:check (Thread[Task worker for
':' Thread 11,5,main]) started.

> Task :beam-runners-google-cloud-dataflow-java-examples-streaming:check
Skipping task ':beam-runners-google-cloud-dataflow-java-examples-streaming:check' as it has
no actions.
:beam-runners-google-cloud-dataflow-java-examples-streaming:check (Thread[Task worker for
':' Thread 11,5,main]) completed. Took 0.0 secs.
:beam-runners-google-cloud-dataflow-java-examples-streaming:build (Thread[Task worker for
':' Thread 11,5,main]) started.

> Task :beam-runners-google-cloud-dataflow-java-examples-streaming:build
Skipping task ':beam-runners-google-cloud-dataflow-java-examples-streaming:build' as it has
no actions.
:beam-runners-google-cloud-dataflow-java-examples-streaming:build (Thread[Task worker for
':' Thread 11,5,main]) completed. Took 0.0 secs.
:beam-runners-google-cloud-dataflow-java-examples-streaming:buildDependents (Thread[Task worker
for ':' Thread 11,5,main]) started.

> Task :beam-runners-google-cloud-dataflow-java-examples-streaming:buildDependents
Caching disabled for task ':beam-runners-google-cloud-dataflow-java-examples-streaming:buildDependents':
Caching has not been enabled for the task
Task ':beam-runners-google-cloud-dataflow-java-examples-streaming:buildDependents' is not
up-to-date because:
  Task has not declared any outputs despite executing actions.
:beam-runners-google-cloud-dataflow-java-examples-streaming:buildDependents (Thread[Task worker
for ':' Thread 11,5,main]) completed. Took 0.0 secs.

> Task :beam-runners-google-cloud-dataflow-java-examples:preCommit
    Aug 15, 2018 12:21:44 PM org.apache.beam.runners.dataflow.util.MonitoringUtil$LoggingHandler
process
    INFO: 2018-08-15T12:21:42.613Z: Executing operation WriteOneFilePerWindow/TextIO.Write/WriteFiles/WriteUnshardedBundlesToTempFiles/GroupUnwritten/Close
    Aug 15, 2018 12:21:44 PM org.apache.beam.runners.dataflow.util.MonitoringUtil$LoggingHandler
process
    INFO: 2018-08-15T12:21:42.776Z: Executing operation WriteOneFilePerWindow/TextIO.Write/WriteFiles/WriteUnshardedBundlesToTempFiles/GroupUnwritten/Read+WriteOneFilePerWindow/TextIO.Write/WriteFiles/WriteUnshardedBundlesToTempFiles/GroupUnwritten/GroupByWindow+WriteOneFilePerWindow/TextIO.Write/WriteFiles/WriteUnshardedBundlesToTempFiles/WriteUnwritten+WriteOneFilePerWindow/TextIO.Write/WriteFiles/WriteUnshardedBundlesToTempFiles/DropShardNum+WriteOneFilePerWindow/TextIO.Write/WriteFiles/GatherTempFileResults/Add
void key/AddKeys/Map+WriteOneFilePerWindow/TextIO.Write/WriteFiles/GatherTempFileResults/Reshuffle/Window.Into()/Window.Assign+WriteOneFilePerWindow/TextIO.Write/WriteFiles/GatherTempFileResults/Reshuffle/GroupByKey/Reify+WriteOneFilePerWindow/TextIO.Write/WriteFiles/GatherTempFileResults/Reshuffle/GroupByKey/Write
    Aug 15, 2018 12:21:46 PM org.apache.beam.runners.dataflow.util.MonitoringUtil$LoggingHandler
process
    INFO: 2018-08-15T12:21:44.861Z: Executing operation WriteOneFilePerWindow/TextIO.Write/WriteFiles/GatherTempFileResults/Reshuffle/GroupByKey/Close
    Aug 15, 2018 12:21:46 PM org.apache.beam.runners.dataflow.util.MonitoringUtil$LoggingHandler
process
    INFO: 2018-08-15T12:21:45.058Z: Executing operation WriteOneFilePerWindow/TextIO.Write/WriteFiles/GatherTempFileResults/Reshuffle/GroupByKey/Read+WriteOneFilePerWindow/TextIO.Write/WriteFiles/GatherTempFileResults/Reshuffle/GroupByKey/GroupByWindow+WriteOneFilePerWindow/TextIO.Write/WriteFiles/GatherTempFileResults/Reshuffle/ExpandIterable+WriteOneFilePerWindow/TextIO.Write/WriteFiles/GatherTempFileResults/Drop
key/Values/Map+WriteOneFilePerWindow/TextIO.Write/WriteFiles/GatherTempFileResults/Gather
bundles+WriteOneFilePerWindow/TextIO.Write/WriteFiles/GatherTempFileResults/Reshuffle.ViaRandomKey/Pair
with random key+WriteOneFilePerWindow/TextIO.Write/WriteFiles/GatherTempFileResults/Reshuffle.ViaRandomKey/Reshuffle/Window.Into()/Window.Assign+WriteOneFilePerWindow/TextIO.Write/WriteFiles/GatherTempFileResults/Reshuffle.ViaRandomKey/Reshuffle/GroupByKey/Reify+WriteOneFilePerWindow/TextIO.Write/WriteFiles/GatherTempFileResults/Reshuffle.ViaRandomKey/Reshuffle/GroupByKey/Write
    Aug 15, 2018 12:21:49 PM org.apache.beam.runners.dataflow.util.MonitoringUtil$LoggingHandler
process
    INFO: 2018-08-15T12:21:48.393Z: Executing operation WriteOneFilePerWindow/TextIO.Write/WriteFiles/GatherTempFileResults/Reshuffle.ViaRandomKey/Reshuffle/GroupByKey/Close
    Aug 15, 2018 12:21:49 PM org.apache.beam.runners.dataflow.util.MonitoringUtil$LoggingHandler
process
    INFO: 2018-08-15T12:21:48.566Z: Executing operation WriteOneFilePerWindow/TextIO.Write/WriteFiles/GatherTempFileResults/Reshuffle.ViaRandomKey/Reshuffle/GroupByKey/Read+WriteOneFilePerWindow/TextIO.Write/WriteFiles/GatherTempFileResults/Reshuffle.ViaRandomKey/Reshuffle/GroupByKey/GroupByWindow+WriteOneFilePerWindow/TextIO.Write/WriteFiles/GatherTempFileResults/Reshuffle.ViaRandomKey/Reshuffle/ExpandIterable+WriteOneFilePerWindow/TextIO.Write/WriteFiles/GatherTempFileResults/Reshuffle.ViaRandomKey/Values/Values/Map+WriteOneFilePerWindow/TextIO.Write/WriteFiles/FinalizeTempFileBundles/Finalize+WriteOneFilePerWindow/TextIO.Write/WriteFiles/FinalizeTempFileBundles/Reshuffle.ViaRandomKey/Pair
with random key+WriteOneFilePerWindow/TextIO.Write/WriteFiles/FinalizeTempFileBundles/Reshuffle.ViaRandomKey/Reshuffle/Window.Into()/Window.Assign+WriteOneFilePerWindow/TextIO.Write/WriteFiles/FinalizeTempFileBundles/Reshuffle.ViaRandomKey/Reshuffle/GroupByKey/Reify+WriteOneFilePerWindow/TextIO.Write/WriteFiles/FinalizeTempFileBundles/Reshuffle.ViaRandomKey/Reshuffle/GroupByKey/Write
    Aug 15, 2018 12:21:57 PM org.apache.beam.runners.dataflow.util.MonitoringUtil$LoggingHandler
process
    INFO: 2018-08-15T12:21:57.425Z: Executing operation WriteOneFilePerWindow/TextIO.Write/WriteFiles/FinalizeTempFileBundles/Reshuffle.ViaRandomKey/Reshuffle/GroupByKey/Close
    Aug 15, 2018 12:21:57 PM org.apache.beam.runners.dataflow.util.MonitoringUtil$LoggingHandler
process
    INFO: 2018-08-15T12:21:57.517Z: Executing operation WriteOneFilePerWindow/TextIO.Write/WriteFiles/FinalizeTempFileBundles/Reshuffle.ViaRandomKey/Reshuffle/GroupByKey/Read+WriteOneFilePerWindow/TextIO.Write/WriteFiles/FinalizeTempFileBundles/Reshuffle.ViaRandomKey/Reshuffle/GroupByKey/GroupByWindow+WriteOneFilePerWindow/TextIO.Write/WriteFiles/FinalizeTempFileBundles/Reshuffle.ViaRandomKey/Reshuffle/ExpandIterable+WriteOneFilePerWindow/TextIO.Write/WriteFiles/FinalizeTempFileBundles/Reshuffle.ViaRandomKey/Values/Values/Map
    Aug 15, 2018 12:22:02 PM org.apache.beam.runners.dataflow.util.MonitoringUtil$LoggingHandler
process
    INFO: 2018-08-15T12:22:01.025Z: Cleaning up.
    Aug 15, 2018 12:22:02 PM org.apache.beam.runners.dataflow.util.MonitoringUtil$LoggingHandler
process
    INFO: 2018-08-15T12:22:01.110Z: Stopping worker pool...
    Aug 15, 2018 12:24:00 PM org.apache.beam.runners.dataflow.util.MonitoringUtil$LoggingHandler
process
    INFO: 2018-08-15T12:23:59.966Z: Autoscaling: Resized worker pool from 1 to 0.
    Aug 15, 2018 12:24:00 PM org.apache.beam.runners.dataflow.util.MonitoringUtil$LoggingHandler
process
    INFO: 2018-08-15T12:24:00.004Z: Autoscaling: Would further reduce the number of workers
but reached the minimum number allowed for the job.
    Aug 15, 2018 12:24:00 PM org.apache.beam.runners.dataflow.util.MonitoringUtil$LoggingHandler
process
    INFO: 2018-08-15T12:24:00.062Z: Worker pool stopped.
    Aug 15, 2018 12:24:07 PM org.apache.beam.runners.dataflow.DataflowPipelineJob waitUntilFinish
    INFO: Job 2018-08-15_05_20_16-17888157210846358496 finished with status DONE.
    Aug 15, 2018 12:24:07 PM org.apache.beam.runners.dataflow.TestDataflowRunner checkForPAssertSuccess
    INFO: Success result for Dataflow job 2018-08-15_05_20_16-17888157210846358496. Found
0 success, 0 failures out of 0 expected assertions.
    Aug 15, 2018 12:24:10 PM org.apache.beam.runners.dataflow.DataflowPipelineJob waitUntilFinish
    INFO: Job 2018-08-15_05_20_16-17888157210846358496 finished with status DONE.

Gradle Test Executor 97 finished executing tests.

> Task :beam-runners-google-cloud-dataflow-java-examples:preCommit
Finished generating test XML results (0.006 secs) into: <https://builds.apache.org/job/beam_PreCommit_Java_Cron/ws/src/runners/google-cloud-dataflow-java/examples/build/test-results/preCommit>
Generating HTML test report...
Finished generating test html results (0.009 secs) into: <https://builds.apache.org/job/beam_PreCommit_Java_Cron/ws/src/runners/google-cloud-dataflow-java/examples/build/reports/tests/preCommit>
Packing task ':beam-runners-google-cloud-dataflow-java-examples:preCommit'
:beam-runners-google-cloud-dataflow-java-examples:preCommit (Thread[Task worker for ':' Thread
10,5,main]) completed. Took 13 mins 28.404 secs.
:beam-runners-google-cloud-dataflow-java-examples:test (Thread[Task worker for ':' Thread
10,5,main]) started.

> Task :beam-runners-google-cloud-dataflow-java-examples:test NO-SOURCE
Skipping task ':beam-runners-google-cloud-dataflow-java-examples:test' as it has no source
files and no previous output files.
:beam-runners-google-cloud-dataflow-java-examples:test (Thread[Task worker for ':' Thread
10,5,main]) completed. Took 0.01 secs.
:beam-runners-google-cloud-dataflow-java-examples:check (Thread[Task worker for ':' Thread
10,5,main]) started.

> Task :beam-runners-google-cloud-dataflow-java-examples:check
Skipping task ':beam-runners-google-cloud-dataflow-java-examples:check' as it has no actions.
:beam-runners-google-cloud-dataflow-java-examples:check (Thread[Task worker for ':' Thread
10,5,main]) completed. Took 0.0 secs.
:beam-runners-google-cloud-dataflow-java-examples:build (Thread[Task worker for ':' Thread
10,5,main]) started.

> Task :beam-runners-google-cloud-dataflow-java-examples:build
Skipping task ':beam-runners-google-cloud-dataflow-java-examples:build' as it has no actions.
:beam-runners-google-cloud-dataflow-java-examples:build (Thread[Task worker for ':' Thread
10,5,main]) completed. Took 0.001 secs.
:beam-runners-google-cloud-dataflow-java-examples:buildDependents (Thread[Task worker for
':' Thread 10,5,main]) started.

> Task :beam-runners-google-cloud-dataflow-java-examples:buildDependents
Caching disabled for task ':beam-runners-google-cloud-dataflow-java-examples:buildDependents':
Caching has not been enabled for the task
Task ':beam-runners-google-cloud-dataflow-java-examples:buildDependents' is not up-to-date
because:
  Task has not declared any outputs despite executing actions.
:beam-runners-google-cloud-dataflow-java-examples:buildDependents (Thread[Task worker for
':' Thread 10,5,main]) completed. Took 0.004 secs.
:beam-examples-java:buildDependents (Thread[Task worker for ':' Thread 10,5,main]) started.
:beam-runners-google-cloud-dataflow-java:buildDependents (Thread[Task worker for ':' Thread
3,5,main]) started.

> Task :beam-examples-java:buildDependents
Caching disabled for task ':beam-examples-java:buildDependents': Caching has not been enabled
for the task
Task ':beam-examples-java:buildDependents' is not up-to-date because:
  Task has not declared any outputs despite executing actions.
:beam-examples-java:buildDependents (Thread[Task worker for ':' Thread 10,5,main]) completed.
Took 0.001 secs.

> Task :beam-runners-google-cloud-dataflow-java:buildDependents
Caching disabled for task ':beam-runners-google-cloud-dataflow-java:buildDependents': Caching
has not been enabled for the task
Task ':beam-runners-google-cloud-dataflow-java:buildDependents' is not up-to-date because:
  Task has not declared any outputs despite executing actions.
:beam-runners-google-cloud-dataflow-java:buildDependents (Thread[Task worker for ':' Thread
3,5,main]) completed. Took 0.001 secs.
:beam-sdks-java-io-google-cloud-platform:buildDependents (Thread[Task worker for ':' Thread
3,5,main]) started.

> Task :beam-sdks-java-io-google-cloud-platform:buildDependents
Caching disabled for task ':beam-sdks-java-io-google-cloud-platform:buildDependents': Caching
has not been enabled for the task
Task ':beam-sdks-java-io-google-cloud-platform:buildDependents' is not up-to-date because:
  Task has not declared any outputs despite executing actions.
:beam-sdks-java-io-google-cloud-platform:buildDependents (Thread[Task worker for ':' Thread
3,5,main]) completed. Took 0.0 secs.
:beam-runners-direct-java:buildDependents (Thread[Task worker for ':' Thread 3,5,main]) started.
:beam-sdks-java-extensions-protobuf:buildDependents (Thread[Task worker for ':' Thread 10,5,main])
started.

> Task :beam-runners-direct-java:buildDependents
Caching disabled for task ':beam-runners-direct-java:buildDependents': Caching has not been
enabled for the task
Task ':beam-runners-direct-java:buildDependents' is not up-to-date because:
  Task has not declared any outputs despite executing actions.
:beam-runners-direct-java:buildDependents (Thread[Task worker for ':' Thread 3,5,main]) completed.
Took 0.0 secs.
:beam-runners-java-fn-execution:buildDependents (Thread[Task worker for ':' Thread 3,5,main])
started.

> Task :beam-sdks-java-extensions-protobuf:buildDependents
Caching disabled for task ':beam-sdks-java-extensions-protobuf:buildDependents': Caching has
not been enabled for the task
Task ':beam-sdks-java-extensions-protobuf:buildDependents' is not up-to-date because:
  Task has not declared any outputs despite executing actions.
:beam-sdks-java-extensions-protobuf:buildDependents (Thread[Task worker for ':' Thread 10,5,main])
completed. Took 0.001 secs.

> Task :beam-runners-java-fn-execution:buildDependents
Caching disabled for task ':beam-runners-java-fn-execution:buildDependents': Caching has not
been enabled for the task
Task ':beam-runners-java-fn-execution:buildDependents' is not up-to-date because:
  Task has not declared any outputs despite executing actions.
:beam-runners-java-fn-execution:buildDependents (Thread[Task worker for ':' Thread 3,5,main])
completed. Took 0.007 secs.
:beam-runners-local-java-core:buildDependents (Thread[Task worker for ':' Thread 5,5,main])
started.
:beam-sdks-java-harness:buildDependents (Thread[Task worker for ':' Thread 3,5,main]) started.
:beam-vendor-sdks-java-extensions-protobuf:buildDependents (Thread[Task worker for ':' Thread
8,5,main]) started.

> Task :beam-sdks-java-harness:buildDependents
Caching disabled for task ':beam-sdks-java-harness:buildDependents': Caching has not been
enabled for the task
Task ':beam-sdks-java-harness:buildDependents' is not up-to-date because:
  Task has not declared any outputs despite executing actions.

> Task :beam-vendor-sdks-java-extensions-protobuf:buildDependents
Caching disabled for task ':beam-vendor-sdks-java-extensions-protobuf:buildDependents': Caching
has not been enabled for the task
Task ':beam-vendor-sdks-java-extensions-protobuf:buildDependents' is not up-to-date because:
  Task has not declared any outputs despite executing actions.
:beam-sdks-java-harness:buildDependents (Thread[Task worker for ':' Thread 3,5,main]) completed.
Took 0.0 secs.

> Task :beam-runners-local-java-core:buildDependents
Caching disabled for task ':beam-runners-local-java-core:buildDependents': Caching has not
been enabled for the task
Task ':beam-runners-local-java-core:buildDependents' is not up-to-date because:
  Task has not declared any outputs despite executing actions.
:beam-vendor-sdks-java-extensions-protobuf:buildDependents (Thread[Task worker for ':' Thread
8,5,main]) completed. Took 0.0 secs.
:beam-runners-local-java-core:buildDependents (Thread[Task worker for ':' Thread 5,5,main])
completed. Took 0.002 secs.
:beam-runners-core-java:buildDependents (Thread[Task worker for ':' Thread 3,5,main]) started.
:beam-sdks-java-extensions-google-cloud-platform-core:buildDependents (Thread[Daemon worker,5,main])
started.
:beam-sdks-java-fn-execution:buildDependents (Thread[Task worker for ':' Thread 11,5,main])
started.

> Task :beam-runners-core-java:buildDependents
Caching disabled for task ':beam-runners-core-java:buildDependents': Caching has not been
enabled for the task
Task ':beam-runners-core-java:buildDependents' is not up-to-date because:
  Task has not declared any outputs despite executing actions.
:beam-runners-core-java:buildDependents (Thread[Task worker for ':' Thread 3,5,main]) completed.
Took 0.0 secs.
:beam-runners-core-construction-java:buildDependents (Thread[Task worker for ':' Thread 3,5,main])
started.

> Task :beam-sdks-java-fn-execution:buildDependents
Caching disabled for task ':beam-sdks-java-fn-execution:buildDependents': Caching has not
been enabled for the task
Task ':beam-sdks-java-fn-execution:buildDependents' is not up-to-date because:
  Task has not declared any outputs despite executing actions.

> Task :beam-sdks-java-extensions-google-cloud-platform-core:buildDependents
Caching disabled for task ':beam-sdks-java-extensions-google-cloud-platform-core:buildDependents':
Caching has not been enabled for the task
Task ':beam-sdks-java-extensions-google-cloud-platform-core:buildDependents' is not up-to-date
because:
  Task has not declared any outputs despite executing actions.
:beam-sdks-java-fn-execution:buildDependents (Thread[Task worker for ':' Thread 11,5,main])
completed. Took 0.001 secs.
:beam-sdks-java-extensions-google-cloud-platform-core:buildDependents (Thread[Daemon worker,5,main])
completed. Took 0.002 secs.

> Task :beam-runners-core-construction-java:buildDependents
Caching disabled for task ':beam-runners-core-construction-java:buildDependents': Caching
has not been enabled for the task
Task ':beam-runners-core-construction-java:buildDependents' is not up-to-date because:
  Task has not declared any outputs despite executing actions.
:beam-runners-core-construction-java:buildDependents (Thread[Task worker for ':' Thread 3,5,main])
completed. Took 0.001 secs.
:beam-sdks-java-core:buildDependents (Thread[Task worker for ':' Thread 3,5,main]) started.

> Task :beam-sdks-java-core:buildDependents
Caching disabled for task ':beam-sdks-java-core:buildDependents': Caching has not been enabled
for the task
Task ':beam-sdks-java-core:buildDependents' is not up-to-date because:
  Task has not declared any outputs despite executing actions.
:beam-sdks-java-core:buildDependents (Thread[Task worker for ':' Thread 3,5,main]) completed.
Took 0.0 secs.

FAILURE: Build failed with an exception.

* What went wrong:
Execution failed for task ':beam-runners-google-cloud-dataflow-java-examples-streaming:preCommit'.
> There were failing tests. See the report at: file://<https://builds.apache.org/job/beam_PreCommit_Java_Cron/ws/src/runners/google-cloud-dataflow-java/examples-streaming/build/reports/tests/preCommit/index.html>

* Try:
Run with --stacktrace option to get the stack trace. Run with --debug option to get more log
output. Run with --scan to get full insights.

* Get more help at https://help.gradle.org

Deprecated Gradle features were used in this build, making it incompatible with Gradle 5.0.
See https://docs.gradle.org/4.8/userguide/command_line_interface.html#sec:command_line_warnings

BUILD FAILED in 24m 0s
762 actionable tasks: 758 executed, 4 from cache

Publishing build scan...
https://gradle.com/s/okwuyrymeuq4k

Build step 'Invoke Gradle script' changed build result to FAILURE
Build step 'Invoke Gradle script' marked build as failure

Mime
View raw message