beam-commits mailing list archives

Site index · List index
Message view « Date » · « Thread »
Top « Date » · « Thread »
From Apache Jenkins Server <jenk...@builds.apache.org>
Subject Build failed in Jenkins: beam_PostCommit_Java_Nexmark_Flink #106
Date Sun, 22 Jul 2018 18:03:17 GMT
See <https://builds.apache.org/job/beam_PostCommit_Java_Nexmark_Flink/106/display/redirect?page=changes>

Changes:

[carlos.alonso] Adds the BigQueryInsertError model class

[carlos.alonso] Adds BigQueryInsertErrorCoder and tests

[carlos.alonso] Adds extended errors info to WriteResult

[carlos.alonso] Makes streaming methods generic but limited to the implemented error

[carlos.alonso] Removes ErrorContainers auxiliary class. Adds BigQueryServicesImpl test

[carlos.alonso] Makes BigQueryIO.Write to be configurable to decide which kind of errors

[carlos.alonso] Removes unneeded coder registration

[carlos.alonso] Simplifies BigQueryInsertError codification

[carlos.alonso] A few style improvements

------------------------------------------
[...truncated 133.92 KB...]
Packing task ':beam-runners-core-java:compileJava'
:beam-runners-core-java:compileJava (Thread[Task worker for ':' Thread 9,5,main]) completed.
Took 7.464 secs.
:beam-runners-core-java:classes (Thread[Task worker for ':' Thread 9,5,main]) started.

> Task :beam-runners-core-java:classes
Skipping task ':beam-runners-core-java:classes' as it has no actions.
:beam-runners-core-java:classes (Thread[Task worker for ':' Thread 9,5,main]) completed. Took
0.0 secs.
:beam-runners-core-java:shadowJar (Thread[Task worker for ':' Thread 8,5,main]) started.

> Task :beam-runners-core-java:shadowJar
Build cache key for task ':beam-runners-core-java:shadowJar' is 4dc6c0ec1d81f3e58ab8170b0094bca4
Caching disabled for task ':beam-runners-core-java:shadowJar': Caching has not been enabled
for the task
Task ':beam-runners-core-java:shadowJar' is not up-to-date because:
  No history is available.
*******************
GRADLE SHADOW STATS

Total Jars: 2 (includes project)
Total Time: 2.08s [2080ms]
Average Time/Jar: 1.04s [1040.0ms]
*******************
:beam-runners-core-java:shadowJar (Thread[Task worker for ':' Thread 8,5,main]) completed.
Took 2.392 secs.
:beam-sdks-java-harness:compileJava (Thread[Task worker for ':' Thread 8,5,main]) started.

> Task :beam-sdks-java-harness:compileJava
Build cache key for task ':beam-sdks-java-harness:compileJava' is c520d6114449cc700269c592b4b548a3
Task ':beam-sdks-java-harness:compileJava' is not up-to-date because:
  No history is available.
Custom actions are attached to task ':beam-sdks-java-harness:compileJava'.
All input files are considered out-of-date for incremental task ':beam-sdks-java-harness:compileJava'.
Compiling with error-prone compiler
Note: <https://builds.apache.org/job/beam_PostCommit_Java_Nexmark_Flink/ws/src/sdks/java/harness/src/main/java/org/apache/beam/fn/harness/state/FnApiStateAccessor.java>
uses or overrides a deprecated API.
Note: Recompile with -Xlint:deprecation for details.
Note: Some input files use unchecked or unsafe operations.
Note: Recompile with -Xlint:unchecked for details.
Packing task ':beam-sdks-java-harness:compileJava'
:beam-sdks-java-harness:compileJava (Thread[Task worker for ':' Thread 8,5,main]) completed.
Took 6.002 secs.
:beam-sdks-java-harness:classes (Thread[Task worker for ':' Thread 8,5,main]) started.

> Task :beam-sdks-java-harness:classes
Skipping task ':beam-sdks-java-harness:classes' as it has no actions.
:beam-sdks-java-harness:classes (Thread[Task worker for ':' Thread 8,5,main]) completed. Took
0.0 secs.
:beam-sdks-java-harness:jar (Thread[Task worker for ':' Thread 27,5,main]) started.

> Task :beam-sdks-java-harness:jar
Build cache key for task ':beam-sdks-java-harness:jar' is f842674bc707a4cf40fe79398f88105f
Caching disabled for task ':beam-sdks-java-harness:jar': Caching has not been enabled for
the task
Task ':beam-sdks-java-harness:jar' is not up-to-date because:
  No history is available.
:beam-sdks-java-harness:jar (Thread[Task worker for ':' Thread 27,5,main]) completed. Took
0.034 secs.
:beam-sdks-java-harness:shadowJar (Thread[Task worker for ':' Thread 27,5,main]) started.

> Task :beam-sdks-java-harness:shadowJar
Build cache key for task ':beam-sdks-java-harness:shadowJar' is bceaaaf525c031b3c7399e1a95280f10
Caching disabled for task ':beam-sdks-java-harness:shadowJar': Caching has not been enabled
for the task
Task ':beam-sdks-java-harness:shadowJar' is not up-to-date because:
  No history is available.
*******************
GRADLE SHADOW STATS

Total Jars: 42 (includes project)
Total Time: 36.389s [36389ms]
Average Time/Jar: 0.8664047619048s [866.4047619048ms]
*******************
:beam-sdks-java-harness:shadowJar (Thread[Task worker for ':' Thread 27,5,main]) completed.
Took 36.856 secs.
:beam-runners-java-fn-execution:compileJava (Thread[Task worker for ':' Thread 27,5,main])
started.

> Task :beam-runners-java-fn-execution:compileJava
Build cache key for task ':beam-runners-java-fn-execution:compileJava' is 9af3bee039d4f166c1524451cf8228aa
Task ':beam-runners-java-fn-execution:compileJava' is not up-to-date because:
  No history is available.
Custom actions are attached to task ':beam-runners-java-fn-execution:compileJava'.
All input files are considered out-of-date for incremental task ':beam-runners-java-fn-execution:compileJava'.
Compiling with error-prone compiler
Note: <https://builds.apache.org/job/beam_PostCommit_Java_Nexmark_Flink/ws/src/runners/java-fn-execution/src/main/java/org/apache/beam/runners/fnexecution/ServerFactory.java>
uses or overrides a deprecated API.
Note: Recompile with -Xlint:deprecation for details.
Note: Some input files use unchecked or unsafe operations.
Note: Recompile with -Xlint:unchecked for details.
Packing task ':beam-runners-java-fn-execution:compileJava'
:beam-runners-java-fn-execution:compileJava (Thread[Task worker for ':' Thread 27,5,main])
completed. Took 11.215 secs.
:beam-runners-java-fn-execution:classes (Thread[Task worker for ':' Thread 27,5,main]) started.

> Task :beam-runners-java-fn-execution:classes
Skipping task ':beam-runners-java-fn-execution:classes' as it has no actions.
:beam-runners-java-fn-execution:classes (Thread[Task worker for ':' Thread 27,5,main]) completed.
Took 0.0 secs.
:beam-runners-java-fn-execution:shadowJar (Thread[Task worker for ':' Thread 27,5,main]) started.

> Task :beam-runners-java-fn-execution:shadowJar
Build cache key for task ':beam-runners-java-fn-execution:shadowJar' is a8aa98967de27ed6fb5277414b9e1208
Caching disabled for task ':beam-runners-java-fn-execution:shadowJar': Caching has not been
enabled for the task
Task ':beam-runners-java-fn-execution:shadowJar' is not up-to-date because:
  No history is available.
*******************
GRADLE SHADOW STATS

Total Jars: 2 (includes project)
Total Time: 3.188s [3188ms]
Average Time/Jar: 1.594s [1594.0ms]
*******************
:beam-runners-java-fn-execution:shadowJar (Thread[Task worker for ':' Thread 27,5,main]) completed.
Took 3.333 secs.
:beam-runners-direct-java:compileJava (Thread[Task worker for ':' Thread 27,5,main]) started.
:beam-runners-flink_2.11:compileJava (Thread[Task worker for ':' Thread 3,5,main]) started.

> Task :beam-runners-direct-java:compileJava
Build cache key for task ':beam-runners-direct-java:compileJava' is f09f8bee34704f9f053aea0198858b07
Task ':beam-runners-direct-java:compileJava' is not up-to-date because:
  No history is available.
Custom actions are attached to task ':beam-runners-direct-java:compileJava'.
All input files are considered out-of-date for incremental task ':beam-runners-direct-java:compileJava'.
Compiling with error-prone compiler
Note: Some input files use or override a deprecated API.
Note: Recompile with -Xlint:deprecation for details.
Note: Some input files use unchecked or unsafe operations.
Note: Recompile with -Xlint:unchecked for details.
Packing task ':beam-runners-direct-java:compileJava'
:beam-runners-direct-java:compileJava (Thread[Task worker for ':' Thread 27,5,main]) completed.
Took 10.55 secs.
:beam-runners-direct-java:classes (Thread[Task worker for ':' Thread 27,5,main]) started.

> Task :beam-runners-direct-java:classes
Skipping task ':beam-runners-direct-java:classes' as it has no actions.
:beam-runners-direct-java:classes (Thread[Task worker for ':' Thread 27,5,main]) completed.
Took 0.0 secs.
:beam-runners-direct-java:shadowJar (Thread[Task worker for ':' Thread 9,5,main]) started.

> Task :beam-runners-flink_2.11:compileJava
Build cache key for task ':beam-runners-flink_2.11:compileJava' is 396f8bd65364834251d51ea3e736cd40
Task ':beam-runners-flink_2.11:compileJava' is not up-to-date because:
  No history is available.
Custom actions are attached to task ':beam-runners-flink_2.11:compileJava'.
All input files are considered out-of-date for incremental task ':beam-runners-flink_2.11:compileJava'.
Compiling with error-prone compiler
Note: Some input files use or override a deprecated API.
Note: Recompile with -Xlint:deprecation for details.
Note: Some input files use unchecked or unsafe operations.
Note: Recompile with -Xlint:unchecked for details.
Packing task ':beam-runners-flink_2.11:compileJava'
:beam-runners-flink_2.11:compileJava (Thread[Task worker for ':' Thread 3,5,main]) completed.
Took 15.034 secs.
:beam-runners-flink_2.11:classes (Thread[Task worker for ':' Thread 3,5,main]) started.

> Task :beam-runners-flink_2.11:classes
Skipping task ':beam-runners-flink_2.11:classes' as it has no actions.
:beam-runners-flink_2.11:classes (Thread[Task worker for ':' Thread 3,5,main]) completed.
Took 0.0 secs.
:beam-runners-flink_2.11:shadowJar (Thread[Task worker for ':' Thread 6,5,main]) started.

> Task :beam-runners-direct-java:shadowJar
Build cache key for task ':beam-runners-direct-java:shadowJar' is 1a835dec0111183acb617791e06b1eeb
Caching disabled for task ':beam-runners-direct-java:shadowJar': Caching has not been enabled
for the task
Task ':beam-runners-direct-java:shadowJar' is not up-to-date because:
  No history is available.

> Task :beam-runners-flink_2.11:shadowJar
Build cache key for task ':beam-runners-flink_2.11:shadowJar' is 972e0e2c1f662d1daee22170f89132a8
Caching disabled for task ':beam-runners-flink_2.11:shadowJar': Caching has not been enabled
for the task
Task ':beam-runners-flink_2.11:shadowJar' is not up-to-date because:
  No history is available.
*******************
GRADLE SHADOW STATS

Total Jars: 2 (includes project)
Total Time: 2.189s [2189ms]
Average Time/Jar: 1.0945s [1094.5ms]
*******************
:beam-runners-flink_2.11:shadowJar (Thread[Task worker for ':' Thread 6,5,main]) completed.
Took 2.544 secs.

> Task :beam-runners-direct-java:shadowJar
*******************
GRADLE SHADOW STATS

Total Jars: 7 (includes project)
Total Time: 11.759s [11759ms]
Average Time/Jar: 1.6798571428570999s [1679.8571428571ms]
*******************
:beam-runners-direct-java:shadowJar (Thread[Task worker for ':' Thread 9,5,main]) completed.
Took 12.416 secs.
:beam-sdks-java-extensions-sql:compileJava (Thread[Task worker for ':' Thread 9,5,main]) started.

> Task :beam-sdks-java-extensions-sql:compileJava
Build cache key for task ':beam-sdks-java-extensions-sql:compileJava' is 3a63e6bdec810fcd3bca7572099912fa
Task ':beam-sdks-java-extensions-sql:compileJava' is not up-to-date because:
  No history is available.
Custom actions are attached to task ':beam-sdks-java-extensions-sql:compileJava'.
All input files are considered out-of-date for incremental task ':beam-sdks-java-extensions-sql:compileJava'.
Compiling with error-prone compiler
Note: Some input files use or override a deprecated API.
Note: Recompile with -Xlint:deprecation for details.
Note: Some input files use unchecked or unsafe operations.
Note: Recompile with -Xlint:unchecked for details.
Packing task ':beam-sdks-java-extensions-sql:compileJava'
:beam-sdks-java-extensions-sql:compileJava (Thread[Task worker for ':' Thread 9,5,main]) completed.
Took 14.773 secs.
:beam-sdks-java-extensions-sql:classes (Thread[Task worker for ':' Thread 9,5,main]) started.

> Task :beam-sdks-java-extensions-sql:classes
Skipping task ':beam-sdks-java-extensions-sql:classes' as it has no actions.
:beam-sdks-java-extensions-sql:classes (Thread[Task worker for ':' Thread 9,5,main]) completed.
Took 0.0 secs.
:beam-sdks-java-extensions-sql:shadowJar (Thread[Task worker for ':' Thread 43,5,main]) started.

> Task :beam-sdks-java-extensions-sql:shadowJar
Build cache key for task ':beam-sdks-java-extensions-sql:shadowJar' is 6280ab38fc87369b1f9fd16aead8a280
Caching disabled for task ':beam-sdks-java-extensions-sql:shadowJar': Caching has not been
enabled for the task
Task ':beam-sdks-java-extensions-sql:shadowJar' is not up-to-date because:
  No history is available.
*******************
GRADLE SHADOW STATS

Total Jars: 9 (includes project)
Total Time: 10.297s [10297ms]
Average Time/Jar: 1.1441111111111s [1144.1111111111ms]
*******************
:beam-sdks-java-extensions-sql:shadowJar (Thread[Task worker for ':' Thread 43,5,main]) completed.
Took 11.284 secs.
:beam-sdks-java-nexmark:compileJava (Thread[Task worker for ':' Thread 43,5,main]) started.

> Task :beam-sdks-java-nexmark:compileJava
Build cache key for task ':beam-sdks-java-nexmark:compileJava' is 7c09566a14af4f7bfd110976bdce6b57
Task ':beam-sdks-java-nexmark:compileJava' is not up-to-date because:
  No history is available.
Custom actions are attached to task ':beam-sdks-java-nexmark:compileJava'.
All input files are considered out-of-date for incremental task ':beam-sdks-java-nexmark:compileJava'.
Compiling with error-prone compiler
<https://builds.apache.org/job/beam_PostCommit_Java_Nexmark_Flink/ws/src/sdks/java/nexmark/src/main/java/org/apache/beam/sdk/nexmark/Main.java>:44:
error: BigQueryServices is not public in org.apache.beam.sdk.io.gcp.bigquery; cannot be accessed
from outside package
import org.apache.beam.sdk.io.gcp.bigquery.BigQueryServices;
                                          ^
<https://builds.apache.org/job/beam_PostCommit_Java_Nexmark_Flink/ws/src/sdks/java/nexmark/src/main/java/org/apache/beam/sdk/nexmark/Main.java>:120:
error: BigQueryServices is not public in org.apache.beam.sdk.io.gcp.bigquery; cannot be accessed
from outside package
      @Nullable BigQueryServices testBigQueryServices,
                ^
2 errors

> Task :beam-sdks-java-nexmark:compileJava FAILED
:beam-sdks-java-nexmark:compileJava (Thread[Task worker for ':' Thread 43,5,main]) completed.
Took 3.808 secs.

FAILURE: Build failed with an exception.

* What went wrong:
Execution failed for task ':beam-sdks-java-nexmark:compileJava'.
> Compilation failed with exit code 1; see the compiler error output for details.

* Try:
Run with --stacktrace option to get the stack trace. Run with --debug option to get more log
output. Run with --scan to get full insights.

* Get more help at https://help.gradle.org

Deprecated Gradle features were used in this build, making it incompatible with Gradle 5.0.
See https://docs.gradle.org/4.8/userguide/command_line_interface.html#sec:command_line_warnings

BUILD FAILED in 3m 6s
63 actionable tasks: 59 executed, 4 from cache

Publishing build scan...
https://gradle.com/s/cbqiiuxyj3ftg

Build step 'Invoke Gradle script' changed build result to FAILURE
Build step 'Invoke Gradle script' marked build as failure

Mime
View raw message