beam-commits mailing list archives

Site index · List index
Message view « Date » · « Thread »
Top « Date » · « Thread »
From Apache Jenkins Server <jenk...@builds.apache.org>
Subject Build failed in Jenkins: beam_PreCommit_Java_Cron #147
Date Thu, 26 Jul 2018 00:10:38 GMT
See <https://builds.apache.org/job/beam_PreCommit_Java_Cron/147/display/redirect?page=changes>

Changes:

[daniel.o.programmer] [BEAM-3709] Implementing new combine URNs in python.

[kedin] [SQL] Enable running BeamSqlLine from gradle

[lcwik] [BEAM-4866] Fix missing licenses.

[pablo] Removing scoped metrics container

[pablo] Remove old style metrics context management

[garrettjonesgoogle] Bumping versions that were missed in #5988

[lcwik] [BEAM-4176] Initial implementation for running portable runner tests

[pablo] Fix Java Nightly Snapshot Failures

------------------------------------------
[...truncated 11.55 MB...]
    Jul 26, 2018 12:10:35 AM org.apache.beam.sdk.extensions.sql.impl.BeamQueryPlanner convertToBeamRel
    INFO: SQLPlan>
    LogicalProject(EXPR$0=[CARDINALITY($1)])
      BeamIOSourceRel(table=[[beam, PCOLLECTION]])

    Jul 26, 2018 12:10:35 AM org.apache.beam.sdk.extensions.sql.impl.BeamQueryPlanner convertToBeamRel
    INFO: BEAMPlan>
    BeamCalcRel(expr#0..1=[{inputs}], expr#2=[CARDINALITY($t1)], EXPR$0=[$t2])
      BeamIOSourceRel(table=[[beam, PCOLLECTION]])


org.apache.beam.sdk.extensions.sql.BeamSqlDslArrayTest > testSelectRowsFromArrayOfRows
STANDARD_ERROR
    Jul 26, 2018 12:10:35 AM org.apache.beam.sdk.extensions.sql.impl.BeamQueryPlanner convertToBeamRel
    INFO: SQL:
    SELECT `PCOLLECTION`.`f_arrayOfRows`
    FROM `beam`.`PCOLLECTION` AS `PCOLLECTION`
    Jul 26, 2018 12:10:35 AM org.apache.beam.sdk.extensions.sql.impl.BeamQueryPlanner convertToBeamRel
    INFO: SQLPlan>
    LogicalProject(f_arrayOfRows=[$1])
      BeamIOSourceRel(table=[[beam, PCOLLECTION]])

    Jul 26, 2018 12:10:35 AM org.apache.beam.sdk.extensions.sql.impl.BeamQueryPlanner convertToBeamRel
    INFO: BEAMPlan>
    BeamCalcRel(expr#0..1=[{inputs}], f_arrayOfRows=[$t1])
      BeamIOSourceRel(table=[[beam, PCOLLECTION]])


org.apache.beam.sdk.extensions.sql.BeamSqlDslArrayTest > testUnnestLiteral STANDARD_ERROR
    Jul 26, 2018 12:10:35 AM org.apache.beam.sdk.extensions.sql.impl.BeamQueryPlanner convertToBeamRel
    INFO: SQL:
    SELECT `EXPR$0`.`EXPR$0`
    FROM UNNEST(ARRAY['a', 'b', 'c']) AS `EXPR$0`
    Jul 26, 2018 12:10:35 AM org.apache.beam.sdk.extensions.sql.impl.BeamQueryPlanner convertToBeamRel
    INFO: SQLPlan>
    LogicalProject(EXPR$0=[$0])
      Uncollect
        LogicalProject(EXPR$0=[ARRAY('a', 'b', 'c')])
          LogicalValues(tuples=[[{ 0 }]])

    Jul 26, 2018 12:10:35 AM org.apache.beam.sdk.extensions.sql.impl.BeamQueryPlanner convertToBeamRel
    INFO: BEAMPlan>
    BeamCalcRel(expr#0=[{inputs}], EXPR$0=[$t0])
      BeamUncollectRel
        BeamCalcRel(expr#0=[{inputs}], expr#1=['a'], expr#2=['b'], expr#3=['c'], expr#4=[ARRAY($t1,
$t2, $t3)], EXPR$0=[$t4])
          BeamValuesRel(tuples=[[{ 0 }]])


org.apache.beam.sdk.extensions.sql.BeamSqlDslArrayTest > testUnnestNamedLiteral STANDARD_ERROR
    Jul 26, 2018 12:10:35 AM org.apache.beam.sdk.extensions.sql.impl.BeamQueryPlanner convertToBeamRel
    INFO: SQL:
    SELECT `t`.`f_string`
    FROM UNNEST(ARRAY['a', 'b', 'c']) AS `t` (`f_string`)
    Jul 26, 2018 12:10:35 AM org.apache.beam.sdk.extensions.sql.impl.BeamQueryPlanner convertToBeamRel
    INFO: SQLPlan>
    LogicalProject(f_string=[$0])
      Uncollect
        LogicalProject(EXPR$0=[ARRAY('a', 'b', 'c')])
          LogicalValues(tuples=[[{ 0 }]])

    Jul 26, 2018 12:10:35 AM org.apache.beam.sdk.extensions.sql.impl.BeamQueryPlanner convertToBeamRel
    INFO: BEAMPlan>
    BeamCalcRel(expr#0=[{inputs}], f_string=[$t0])
      BeamUncollectRel
        BeamCalcRel(expr#0=[{inputs}], expr#1=['a'], expr#2=['b'], expr#3=['c'], expr#4=[ARRAY($t1,
$t2, $t3)], EXPR$0=[$t4])
          BeamValuesRel(tuples=[[{ 0 }]])


org.apache.beam.sdk.extensions.sql.BeamSqlDslArrayTest > testSelectSingleRowFromArrayOfRows
STANDARD_ERROR
    Jul 26, 2018 12:10:35 AM org.apache.beam.sdk.extensions.sql.impl.BeamQueryPlanner convertToBeamRel
    INFO: SQL:
    SELECT `PCOLLECTION`.`f_arrayOfRows`[1]
    FROM `beam`.`PCOLLECTION` AS `PCOLLECTION`
    Jul 26, 2018 12:10:35 AM org.apache.beam.sdk.extensions.sql.impl.BeamQueryPlanner convertToBeamRel
    INFO: SQLPlan>
    LogicalProject(EXPR$0$0=[ITEM($1, 1).f_rowString], EXPR$0$1=[ITEM($1, 1).f_rowInt])
      BeamIOSourceRel(table=[[beam, PCOLLECTION]])

    Jul 26, 2018 12:10:35 AM org.apache.beam.sdk.extensions.sql.impl.BeamQueryPlanner convertToBeamRel
    INFO: BEAMPlan>
    BeamCalcRel(expr#0..1=[{inputs}], expr#2=[1], expr#3=[ITEM($t1, $t2)], expr#4=[$t3.f_rowString],
expr#5=[$t3.f_rowInt], EXPR$0$0=[$t4], EXPR$0$1=[$t5])
      BeamIOSourceRel(table=[[beam, PCOLLECTION]])


org.apache.beam.sdk.extensions.sql.BeamSqlDslArrayTest > testProjectArrayField STANDARD_ERROR
    Jul 26, 2018 12:10:35 AM org.apache.beam.sdk.extensions.sql.impl.BeamQueryPlanner convertToBeamRel
    INFO: SQL:
    SELECT `PCOLLECTION`.`f_int`, `PCOLLECTION`.`f_stringArr`
    FROM `beam`.`PCOLLECTION` AS `PCOLLECTION`
    Jul 26, 2018 12:10:35 AM org.apache.beam.sdk.extensions.sql.impl.BeamQueryPlanner convertToBeamRel
    INFO: SQLPlan>
    LogicalProject(f_int=[$0], f_stringArr=[$1])
      BeamIOSourceRel(table=[[beam, PCOLLECTION]])

    Jul 26, 2018 12:10:35 AM org.apache.beam.sdk.extensions.sql.impl.BeamQueryPlanner convertToBeamRel
    INFO: BEAMPlan>
    BeamCalcRel(expr#0..1=[{inputs}], proj#0..1=[{exprs}])
      BeamIOSourceRel(table=[[beam, PCOLLECTION]])


org.apache.beam.sdk.extensions.sql.BeamSqlDslNestedRowsTest > testNestedRowArrayFieldAccess
STANDARD_ERROR
    Jul 26, 2018 12:10:35 AM org.apache.beam.sdk.extensions.sql.impl.BeamQueryPlanner convertToBeamRel
    INFO: SQL:
    SELECT `PCOLLECTION`.`f_nestedRow`.`f_nestedArray`
    FROM `beam`.`PCOLLECTION` AS `PCOLLECTION`
    Jul 26, 2018 12:10:35 AM org.apache.beam.sdk.extensions.sql.impl.BeamQueryPlanner convertToBeamRel
    INFO: SQLPlan>
    LogicalProject(f_nestedArray=[$4])
      LogicalProject(f_int=[$0], f_nestedInt=[$1.f_nestedInt], f_nestedString=[$1.f_nestedString],
f_nestedIntPlusOne=[$1.f_nestedIntPlusOne], f_nestedArray=[$1.f_nestedArray])
        BeamIOSourceRel(table=[[beam, PCOLLECTION]])

    Jul 26, 2018 12:10:35 AM org.apache.beam.sdk.extensions.sql.impl.BeamQueryPlanner convertToBeamRel
    INFO: BEAMPlan>
    BeamCalcRel(expr#0..1=[{inputs}], expr#2=[$t1.f_nestedArray], f_nestedArray=[$t2])
      BeamIOSourceRel(table=[[beam, PCOLLECTION]])


org.apache.beam.sdk.extensions.sql.BeamSqlDslNestedRowsTest > testRowConstructorBraces
STANDARD_ERROR
    Jul 26, 2018 12:10:36 AM org.apache.beam.sdk.extensions.sql.impl.BeamQueryPlanner convertToBeamRel
    INFO: SQL:
    SELECT 1 AS `f_int`, ROW(3, 'BB', `PCOLLECTION`.`f_int` + 1) AS `f_row1`
    FROM `beam`.`PCOLLECTION` AS `PCOLLECTION`
    Jul 26, 2018 12:10:36 AM org.apache.beam.sdk.extensions.sql.impl.BeamQueryPlanner convertToBeamRel
    INFO: SQLPlan>
    LogicalProject(f_int=[1], f_row1$$0=[3], f_row1$$1=['BB'], f_row1$$2=[+($0, 1)])
      LogicalProject(f_int=[$0], f_nestedInt=[$1.f_nestedInt], f_nestedString=[$1.f_nestedString],
f_nestedIntPlusOne=[$1.f_nestedIntPlusOne])
        BeamIOSourceRel(table=[[beam, PCOLLECTION]])

    Jul 26, 2018 12:10:36 AM org.apache.beam.sdk.extensions.sql.impl.BeamQueryPlanner convertToBeamRel
    INFO: BEAMPlan>
    BeamCalcRel(expr#0..1=[{inputs}], expr#2=[1], expr#3=[3], expr#4=['BB'], expr#5=[+($t0,
$t2)], f_int=[$t2], f_row1$$0=[$t3], f_row1$$1=[$t4], f_row1$$2=[$t5])
      BeamIOSourceRel(table=[[beam, PCOLLECTION]])


org.apache.beam.sdk.extensions.sql.BeamSqlDslNestedRowsTest > testNestedRowFieldAccess
STANDARD_ERROR
    Jul 26, 2018 12:10:36 AM org.apache.beam.sdk.extensions.sql.impl.BeamQueryPlanner convertToBeamRel
    INFO: SQL:
    SELECT `PCOLLECTION`.`f_nestedRow`.`f_nestedString`
    FROM `beam`.`PCOLLECTION` AS `PCOLLECTION`
    Jul 26, 2018 12:10:36 AM org.apache.beam.sdk.extensions.sql.impl.BeamQueryPlanner convertToBeamRel
    INFO: SQLPlan>
    LogicalProject(f_nestedString=[$2])
      LogicalProject(f_int=[$0], f_nestedInt=[$1.f_nestedInt], f_nestedString=[$1.f_nestedString],
f_nestedIntPlusOne=[$1.f_nestedIntPlusOne])
        BeamIOSourceRel(table=[[beam, PCOLLECTION]])

    Jul 26, 2018 12:10:36 AM org.apache.beam.sdk.extensions.sql.impl.BeamQueryPlanner convertToBeamRel
    INFO: BEAMPlan>
    BeamCalcRel(expr#0..1=[{inputs}], expr#2=[$t1.f_nestedString], f_nestedString=[$t2])
      BeamIOSourceRel(table=[[beam, PCOLLECTION]])


org.apache.beam.sdk.extensions.sql.BeamSqlDslNestedRowsTest > testNestedRowArrayElementAccess
STANDARD_ERROR
    Jul 26, 2018 12:10:36 AM org.apache.beam.sdk.extensions.sql.impl.BeamQueryPlanner convertToBeamRel
    INFO: SQL:
    SELECT `PCOLLECTION`.`f_nestedRow`.`f_nestedArray`[1]
    FROM `beam`.`PCOLLECTION` AS `PCOLLECTION`
    Jul 26, 2018 12:10:36 AM org.apache.beam.sdk.extensions.sql.impl.BeamQueryPlanner convertToBeamRel
    INFO: SQLPlan>
    LogicalProject(EXPR$0=[ITEM($4, 1)])
      LogicalProject(f_int=[$0], f_nestedInt=[$1.f_nestedInt], f_nestedString=[$1.f_nestedString],
f_nestedIntPlusOne=[$1.f_nestedIntPlusOne], f_nestedArray=[$1.f_nestedArray])
        BeamIOSourceRel(table=[[beam, PCOLLECTION]])

    Jul 26, 2018 12:10:36 AM org.apache.beam.sdk.extensions.sql.impl.BeamQueryPlanner convertToBeamRel
    INFO: BEAMPlan>
    BeamCalcRel(expr#0..1=[{inputs}], expr#2=[$t1.f_nestedArray], expr#3=[1], expr#4=[ITEM($t2,
$t3)], EXPR$0=[$t4])
      BeamIOSourceRel(table=[[beam, PCOLLECTION]])


org.apache.beam.sdk.extensions.sql.BeamSqlDslNestedRowsTest > testRowConstructorKeyword
STANDARD_ERROR
    Jul 26, 2018 12:10:36 AM org.apache.beam.sdk.extensions.sql.impl.BeamQueryPlanner convertToBeamRel
    INFO: SQL:
    SELECT 1 AS `f_int`, ROW(3, 'BB', `PCOLLECTION`.`f_int` + 1) AS `f_row1`
    FROM `beam`.`PCOLLECTION` AS `PCOLLECTION`
    Jul 26, 2018 12:10:36 AM org.apache.beam.sdk.extensions.sql.impl.BeamQueryPlanner convertToBeamRel
    INFO: SQLPlan>
    LogicalProject(f_int=[1], f_row1$$0=[3], f_row1$$1=['BB'], f_row1$$2=[+($0, 1)])
      LogicalProject(f_int=[$0], f_nestedInt=[$1.f_nestedInt], f_nestedString=[$1.f_nestedString],
f_nestedIntPlusOne=[$1.f_nestedIntPlusOne])
        BeamIOSourceRel(table=[[beam, PCOLLECTION]])

    Jul 26, 2018 12:10:36 AM org.apache.beam.sdk.extensions.sql.impl.BeamQueryPlanner convertToBeamRel
    INFO: BEAMPlan>
    BeamCalcRel(expr#0..1=[{inputs}], expr#2=[1], expr#3=[3], expr#4=['BB'], expr#5=[+($t0,
$t2)], f_int=[$t2], f_row1$$0=[$t3], f_row1$$1=[$t4], f_row1$$2=[$t5])
      BeamIOSourceRel(table=[[beam, PCOLLECTION]])

Finished generating test XML results (0.009 secs) into: <https://builds.apache.org/job/beam_PreCommit_Java_Cron/ws/src/sdks/java/extensions/sql/build/test-results/test>
Generating HTML test report...
Finished generating test html results (0.02 secs) into: <https://builds.apache.org/job/beam_PreCommit_Java_Cron/ws/src/sdks/java/extensions/sql/build/reports/tests/test>
Packing task ':beam-sdks-java-extensions-sql:test'
:beam-sdks-java-extensions-sql:test (Thread[Task worker for ':' Thread 10,5,main]) completed.
Took 46.522 secs.
:beam-sdks-java-extensions-sql:check (Thread[Task worker for ':' Thread 10,5,main]) started.

> Task :beam-sdks-java-extensions-sql:check
Skipping task ':beam-sdks-java-extensions-sql:check' as it has no actions.
:beam-sdks-java-extensions-sql:check (Thread[Task worker for ':' Thread 10,5,main]) completed.
Took 0.0 secs.
:beam-sdks-java-extensions-sql:build (Thread[Task worker for ':' Thread 10,5,main]) started.

> Task :beam-sdks-java-extensions-sql:build
Skipping task ':beam-sdks-java-extensions-sql:build' as it has no actions.
:beam-sdks-java-extensions-sql:build (Thread[Task worker for ':' Thread 10,5,main]) completed.
Took 0.0 secs.

FAILURE: Build completed with 3 failures.

1: Task failed with an exception.
-----------
* What went wrong:
Execution failed for task ':beam-sdks-java-extensions-google-cloud-platform-core:compileTestJava'.
> Compilation failed with exit code 1; see the compiler error output for details.

* Try:
Run with --stacktrace option to get the stack trace. Run with --debug option to get more log
output. Run with --scan to get full insights.
==============================================================================

2: Task failed with an exception.
-----------
* What went wrong:
Could not resolve all files for configuration ':beam-sdks-java-io-hadoop-file-system:testCompileClasspath'.
> Could not find zookeeper-tests.jar (org.apache.zookeeper:zookeeper:3.4.6).
  Searched in the following locations:
      file:/home/jenkins/.m2/repository/org/apache/zookeeper/zookeeper/3.4.6/zookeeper-3.4.6-tests.jar

* Try:
Run with --stacktrace option to get the stack trace. Run with --debug option to get more log
output. Run with --scan to get full insights.
==============================================================================

3: Task failed with an exception.
-----------
* What went wrong:
Could not resolve all files for configuration ':beam-sdks-java-io-hbase:testCompileClasspath'.
> Could not find zookeeper-tests.jar (org.apache.zookeeper:zookeeper:3.4.6).
  Searched in the following locations:
      file:/home/jenkins/.m2/repository/org/apache/zookeeper/zookeeper/3.4.6/zookeeper-3.4.6-tests.jar

* Try:
Run with --stacktrace option to get the stack trace. Run with --debug option to get more log
output. Run with --scan to get full insights.
==============================================================================

* Get more help at https://help.gradle.org

Deprecated Gradle features were used in this build, making it incompatible with Gradle 5.0.
See https://docs.gradle.org/4.8/userguide/command_line_interface.html#sec:command_line_warnings

BUILD FAILED in 10m 11s
611 actionable tasks: 610 executed, 1 from cache

Publishing build scan...
https://gradle.com/s/sd5tvnfvyhuua

Stopped 1 worker daemon(s).
Build step 'Invoke Gradle script' changed build result to FAILURE
Build step 'Invoke Gradle script' marked build as failure

Mime
View raw message