beam-commits mailing list archives

Site index · List index
Message view « Date » · « Thread »
Top « Date » · « Thread »
From Apache Jenkins Server <jenk...@builds.apache.org>
Subject Build failed in Jenkins: beam_PostCommit_Java_Nexmark_Spark #106
Date Mon, 23 Jul 2018 00:03:31 GMT
See <https://builds.apache.org/job/beam_PostCommit_Java_Nexmark_Spark/106/display/redirect>

------------------------------------------
[...truncated 135.38 KB...]
Packing task ':beam-runners-core-java:compileJava'
:beam-runners-core-java:compileJava (Thread[Task worker for ':' Thread 22,5,main]) completed.
Took 8.929 secs.
:beam-runners-core-java:classes (Thread[Task worker for ':' Thread 22,5,main]) started.

> Task :beam-runners-core-java:classes
Skipping task ':beam-runners-core-java:classes' as it has no actions.
:beam-runners-core-java:classes (Thread[Task worker for ':' Thread 22,5,main]) completed.
Took 0.0 secs.
:beam-runners-core-java:shadowJar (Thread[Task worker for ':' Thread 22,5,main]) started.

> Task :beam-runners-core-java:shadowJar
Build cache key for task ':beam-runners-core-java:shadowJar' is 6f7677a80942dc616b13ffc1b6790fcd
Caching disabled for task ':beam-runners-core-java:shadowJar': Caching has not been enabled
for the task
Task ':beam-runners-core-java:shadowJar' is not up-to-date because:
  No history is available.
*******************
GRADLE SHADOW STATS

Total Jars: 2 (includes project)
Total Time: 2.015s [2015ms]
Average Time/Jar: 1.0075s [1007.5ms]
*******************
:beam-runners-core-java:shadowJar (Thread[Task worker for ':' Thread 22,5,main]) completed.
Took 2.38 secs.
:beam-sdks-java-harness:compileJava (Thread[Task worker for ':' Thread 22,5,main]) started.
:beam-runners-spark:compileJava (Thread[Task worker for ':' Thread 34,5,main]) started.

> Task :beam-sdks-java-harness:compileJava
Build cache key for task ':beam-sdks-java-harness:compileJava' is 49de89aea5dfebe0075dfe0d914a72d4
Task ':beam-sdks-java-harness:compileJava' is not up-to-date because:
  No history is available.
Custom actions are attached to task ':beam-sdks-java-harness:compileJava'.
All input files are considered out-of-date for incremental task ':beam-sdks-java-harness:compileJava'.
Compiling with error-prone compiler
Note: <https://builds.apache.org/job/beam_PostCommit_Java_Nexmark_Spark/ws/src/sdks/java/harness/src/main/java/org/apache/beam/fn/harness/state/FnApiStateAccessor.java>
uses or overrides a deprecated API.
Note: Recompile with -Xlint:deprecation for details.
Note: Some input files use unchecked or unsafe operations.
Note: Recompile with -Xlint:unchecked for details.
Packing task ':beam-sdks-java-harness:compileJava'
:beam-sdks-java-harness:compileJava (Thread[Task worker for ':' Thread 22,5,main]) completed.
Took 6.532 secs.
:beam-sdks-java-harness:classes (Thread[Task worker for ':' Thread 22,5,main]) started.

> Task :beam-sdks-java-harness:classes
Skipping task ':beam-sdks-java-harness:classes' as it has no actions.
:beam-sdks-java-harness:classes (Thread[Task worker for ':' Thread 22,5,main]) completed.
Took 0.0 secs.
:beam-sdks-java-harness:jar (Thread[Task worker for ':' Thread 5,5,main]) started.

> Task :beam-sdks-java-harness:jar
Build cache key for task ':beam-sdks-java-harness:jar' is f842674bc707a4cf40fe79398f88105f
Caching disabled for task ':beam-sdks-java-harness:jar': Caching has not been enabled for
the task
Task ':beam-sdks-java-harness:jar' is not up-to-date because:
  No history is available.
:beam-sdks-java-harness:jar (Thread[Task worker for ':' Thread 5,5,main]) completed. Took
0.04 secs.
:beam-sdks-java-harness:shadowJar (Thread[Task worker for ':' Thread 5,5,main]) started.

> Task :beam-sdks-java-harness:shadowJar
Build cache key for task ':beam-sdks-java-harness:shadowJar' is 425d4cf8c20ac37b541812a948ed6758
Caching disabled for task ':beam-sdks-java-harness:shadowJar': Caching has not been enabled
for the task
Task ':beam-sdks-java-harness:shadowJar' is not up-to-date because:
  No history is available.

> Task :beam-runners-spark:compileJava
Build cache key for task ':beam-runners-spark:compileJava' is ebcdbd8380bc0d369d2b149b040f9b40
Task ':beam-runners-spark:compileJava' is not up-to-date because:
  No history is available.
Custom actions are attached to task ':beam-runners-spark:compileJava'.
All input files are considered out-of-date for incremental task ':beam-runners-spark:compileJava'.
Compiling with error-prone compiler
Note: Some input files use or override a deprecated API.
Note: Recompile with -Xlint:deprecation for details.
Note: Some input files use unchecked or unsafe operations.
Note: Recompile with -Xlint:unchecked for details.
Packing task ':beam-runners-spark:compileJava'
:beam-runners-spark:compileJava (Thread[Task worker for ':' Thread 34,5,main]) completed.
Took 18.372 secs.
:beam-runners-spark:classes (Thread[Task worker for ':' Thread 34,5,main]) started.

> Task :beam-runners-spark:classes
Skipping task ':beam-runners-spark:classes' as it has no actions.
:beam-runners-spark:classes (Thread[Task worker for ':' Thread 34,5,main]) completed. Took
0.0 secs.
:beam-runners-spark:shadowJar (Thread[Task worker for ':' Thread 47,5,main]) started.

> Task :beam-runners-spark:shadowJar
Build cache key for task ':beam-runners-spark:shadowJar' is 18d5d75a2006177e103401c2976b362d
Caching disabled for task ':beam-runners-spark:shadowJar': Caching has not been enabled for
the task
Task ':beam-runners-spark:shadowJar' is not up-to-date because:
  No history is available.
*******************
GRADLE SHADOW STATS

Total Jars: 2 (includes project)
Total Time: 2.1s [2100ms]
Average Time/Jar: 1.05s [1050.0ms]
*******************
:beam-runners-spark:shadowJar (Thread[Task worker for ':' Thread 47,5,main]) completed. Took
2.388 secs.

> Task :beam-sdks-java-harness:shadowJar
*******************
GRADLE SHADOW STATS

Total Jars: 42 (includes project)
Total Time: 35.271s [35271ms]
Average Time/Jar: 0.8397857142857s [839.7857142857ms]
*******************
:beam-sdks-java-harness:shadowJar (Thread[Task worker for ':' Thread 5,5,main]) completed.
Took 35.67 secs.
:beam-runners-java-fn-execution:compileJava (Thread[Task worker for ':' Thread 5,5,main])
started.

> Task :beam-runners-java-fn-execution:compileJava
Build cache key for task ':beam-runners-java-fn-execution:compileJava' is 6356a1dac28e28b116f80f774795b9ba
Task ':beam-runners-java-fn-execution:compileJava' is not up-to-date because:
  No history is available.
Custom actions are attached to task ':beam-runners-java-fn-execution:compileJava'.
All input files are considered out-of-date for incremental task ':beam-runners-java-fn-execution:compileJava'.
Compiling with error-prone compiler
Note: <https://builds.apache.org/job/beam_PostCommit_Java_Nexmark_Spark/ws/src/runners/java-fn-execution/src/main/java/org/apache/beam/runners/fnexecution/ServerFactory.java>
uses or overrides a deprecated API.
Note: Recompile with -Xlint:deprecation for details.
Note: Some input files use unchecked or unsafe operations.
Note: Recompile with -Xlint:unchecked for details.
Packing task ':beam-runners-java-fn-execution:compileJava'
:beam-runners-java-fn-execution:compileJava (Thread[Task worker for ':' Thread 5,5,main])
completed. Took 11.167 secs.
:beam-runners-java-fn-execution:classes (Thread[Task worker for ':' Thread 5,5,main]) started.

> Task :beam-runners-java-fn-execution:classes
Skipping task ':beam-runners-java-fn-execution:classes' as it has no actions.
:beam-runners-java-fn-execution:classes (Thread[Task worker for ':' Thread 5,5,main]) completed.
Took 0.001 secs.
:beam-runners-java-fn-execution:shadowJar (Thread[Task worker for ':' Thread 5,5,main]) started.

> Task :beam-runners-java-fn-execution:shadowJar
Build cache key for task ':beam-runners-java-fn-execution:shadowJar' is f38c72e79b9a517c1382cadb4b183e92
Caching disabled for task ':beam-runners-java-fn-execution:shadowJar': Caching has not been
enabled for the task
Task ':beam-runners-java-fn-execution:shadowJar' is not up-to-date because:
  No history is available.
*******************
GRADLE SHADOW STATS

Total Jars: 2 (includes project)
Total Time: 2.088s [2088ms]
Average Time/Jar: 1.044s [1044.0ms]
*******************
:beam-runners-java-fn-execution:shadowJar (Thread[Task worker for ':' Thread 5,5,main]) completed.
Took 2.247 secs.
:beam-runners-direct-java:compileJava (Thread[Task worker for ':' Thread 5,5,main]) started.

> Task :beam-runners-direct-java:compileJava
Build cache key for task ':beam-runners-direct-java:compileJava' is 6cc6393a310087cc08a6cec043054566
Task ':beam-runners-direct-java:compileJava' is not up-to-date because:
  No history is available.
Custom actions are attached to task ':beam-runners-direct-java:compileJava'.
All input files are considered out-of-date for incremental task ':beam-runners-direct-java:compileJava'.
Compiling with error-prone compiler
Note: Some input files use or override a deprecated API.
Note: Recompile with -Xlint:deprecation for details.
Note: Some input files use unchecked or unsafe operations.
Note: Recompile with -Xlint:unchecked for details.
Packing task ':beam-runners-direct-java:compileJava'
:beam-runners-direct-java:compileJava (Thread[Task worker for ':' Thread 5,5,main]) completed.
Took 9.647 secs.
:beam-runners-direct-java:classes (Thread[Task worker for ':' Thread 5,5,main]) started.

> Task :beam-runners-direct-java:classes
Skipping task ':beam-runners-direct-java:classes' as it has no actions.
:beam-runners-direct-java:classes (Thread[Task worker for ':' Thread 5,5,main]) completed.
Took 0.0 secs.
:beam-runners-direct-java:shadowJar (Thread[Task worker for ':' Thread 5,5,main]) started.

> Task :beam-runners-direct-java:shadowJar
Build cache key for task ':beam-runners-direct-java:shadowJar' is 6ccd59ca5dc7d3ea5ac20d9e5b023a34
Caching disabled for task ':beam-runners-direct-java:shadowJar': Caching has not been enabled
for the task
Task ':beam-runners-direct-java:shadowJar' is not up-to-date because:
  No history is available.
*******************
GRADLE SHADOW STATS

Total Jars: 7 (includes project)
Total Time: 11.418s [11418ms]
Average Time/Jar: 1.6311428571429s [1631.1428571429ms]
*******************
:beam-runners-direct-java:shadowJar (Thread[Task worker for ':' Thread 5,5,main]) completed.
Took 11.986 secs.
:beam-sdks-java-extensions-sql:compileJava (Thread[Task worker for ':' Thread 5,5,main]) started.

> Task :beam-sdks-java-extensions-sql:compileJava
Build cache key for task ':beam-sdks-java-extensions-sql:compileJava' is 68b58e7f69cd63899a8c48ae3d010572
Task ':beam-sdks-java-extensions-sql:compileJava' is not up-to-date because:
  No history is available.
Custom actions are attached to task ':beam-sdks-java-extensions-sql:compileJava'.
All input files are considered out-of-date for incremental task ':beam-sdks-java-extensions-sql:compileJava'.
Compiling with error-prone compiler
Note: Some input files use or override a deprecated API.
Note: Recompile with -Xlint:deprecation for details.
Note: Some input files use unchecked or unsafe operations.
Note: Recompile with -Xlint:unchecked for details.
Packing task ':beam-sdks-java-extensions-sql:compileJava'
:beam-sdks-java-extensions-sql:compileJava (Thread[Task worker for ':' Thread 5,5,main]) completed.
Took 14.397 secs.
:beam-sdks-java-extensions-sql:classes (Thread[Task worker for ':' Thread 5,5,main]) started.

> Task :beam-sdks-java-extensions-sql:classes
Skipping task ':beam-sdks-java-extensions-sql:classes' as it has no actions.
:beam-sdks-java-extensions-sql:classes (Thread[Task worker for ':' Thread 5,5,main]) completed.
Took 0.0 secs.
:beam-sdks-java-extensions-sql:shadowJar (Thread[Task worker for ':' Thread 5,5,main]) started.

> Task :beam-sdks-java-extensions-sql:shadowJar
Build cache key for task ':beam-sdks-java-extensions-sql:shadowJar' is a06036f34a2c80fcda8b45850d0a1288
Caching disabled for task ':beam-sdks-java-extensions-sql:shadowJar': Caching has not been
enabled for the task
Task ':beam-sdks-java-extensions-sql:shadowJar' is not up-to-date because:
  No history is available.
*******************
GRADLE SHADOW STATS

Total Jars: 9 (includes project)
Total Time: 9.648s [9648ms]
Average Time/Jar: 1.072s [1072.0ms]
*******************
:beam-sdks-java-extensions-sql:shadowJar (Thread[Task worker for ':' Thread 5,5,main]) completed.
Took 10.606 secs.
:beam-sdks-java-nexmark:compileJava (Thread[Task worker for ':' Thread 5,5,main]) started.

> Task :beam-sdks-java-nexmark:compileJava
Build cache key for task ':beam-sdks-java-nexmark:compileJava' is bfa01c49c60b4053b4a7ed6032f000a7
Task ':beam-sdks-java-nexmark:compileJava' is not up-to-date because:
  No history is available.
Custom actions are attached to task ':beam-sdks-java-nexmark:compileJava'.
All input files are considered out-of-date for incremental task ':beam-sdks-java-nexmark:compileJava'.
Compiling with error-prone compiler
<https://builds.apache.org/job/beam_PostCommit_Java_Nexmark_Spark/ws/src/sdks/java/nexmark/src/main/java/org/apache/beam/sdk/nexmark/Main.java>:44:
error: BigQueryServices is not public in org.apache.beam.sdk.io.gcp.bigquery; cannot be accessed
from outside package
import org.apache.beam.sdk.io.gcp.bigquery.BigQueryServices;
                                          ^
<https://builds.apache.org/job/beam_PostCommit_Java_Nexmark_Spark/ws/src/sdks/java/nexmark/src/main/java/org/apache/beam/sdk/nexmark/Main.java>:120:
error: BigQueryServices is not public in org.apache.beam.sdk.io.gcp.bigquery; cannot be accessed
from outside package
      @Nullable BigQueryServices testBigQueryServices,
                ^
2 errors

> Task :beam-sdks-java-nexmark:compileJava FAILED
:beam-sdks-java-nexmark:compileJava (Thread[Task worker for ':' Thread 5,5,main]) completed.
Took 3.451 secs.

FAILURE: Build failed with an exception.

* What went wrong:
Execution failed for task ':beam-sdks-java-nexmark:compileJava'.
> Compilation failed with exit code 1; see the compiler error output for details.

* Try:
Run with --stacktrace option to get the stack trace. Run with --debug option to get more log
output. Run with --scan to get full insights.

* Get more help at https://help.gradle.org

Deprecated Gradle features were used in this build, making it incompatible with Gradle 5.0.
See https://docs.gradle.org/4.8/userguide/command_line_interface.html#sec:command_line_warnings

BUILD FAILED in 3m 21s
62 actionable tasks: 58 executed, 4 from cache

Publishing build scan...
https://gradle.com/s/2hntt6hml426a

Build step 'Invoke Gradle script' changed build result to FAILURE
Build step 'Invoke Gradle script' marked build as failure

Mime
View raw message