beam-commits mailing list archives

Site index · List index
Message view « Date » · « Thread »
Top « Date » · « Thread »
From Apache Jenkins Server <jenk...@builds.apache.org>
Subject Build failed in Jenkins: beam_PreCommit_Python_Cron #8
Date Wed, 27 Jun 2018 12:13:15 GMT
See <https://builds.apache.org/job/beam_PreCommit_Python_Cron/8/display/redirect>

------------------------------------------
[...truncated 1.42 MB...]
        }
        component_coder_ids: "ref_Coder_FastPrimitivesCoder_3"
        component_coder_ids: "ref_Coder_GlobalWindowCoder_6"
      }
    }
    coders {
      key: "ref_Coder_WindowedValueCoder_12"
      value {
        spec {
          spec {
            urn: "beam:coder:windowed_value:v1"
          }
        }
        component_coder_ids: "ref_Coder_TupleCoder_13"
        component_coder_ids: "ref_Coder_GlobalWindowCoder_6"
      }
    }
    coders {
      key: "ref_Coder_WindowedValueCoder_14"
      value {
        spec {
          spec {
            urn: "beam:coder:windowed_value:v1"
          }
        }
        component_coder_ids: "ref_Coder_TupleCoder_15"
        component_coder_ids: "ref_Coder_GlobalWindowCoder_6"
      }
    }
    coders {
      key: "ref_Coder_WindowedValueCoder_14_bytes"
      value {
        spec {
          spec {
            urn: "beam:coder:windowed_value:v1"
          }
        }
        component_coder_ids: "ref_Coder_TupleCoder_15_bytes"
        component_coder_ids: "ref_Coder_GlobalWindowCoder_6"
      }
    }
    coders {
      key: "ref_Coder_WindowedValueCoder_14_len_prefix"
      value {
        spec {
          spec {
            urn: "beam:coder:windowed_value:v1"
          }
        }
        component_coder_ids: "ref_Coder_TupleCoder_15_len_prefix"
        component_coder_ids: "ref_Coder_GlobalWindowCoder_6"
      }
    }
    coders {
      key: "ref_Coder_WindowedValueCoder_17"
      value {
        spec {
          spec {
            urn: "beam:coder:windowed_value:v1"
          }
        }
        component_coder_ids: "ref_Coder_TupleCoder_18"
        component_coder_ids: "ref_Coder_GlobalWindowCoder_6"
      }
    }
    coders {
      key: "ref_Coder_WindowedValueCoder_19"
      value {
        spec {
          spec {
            urn: "beam:coder:windowed_value:v1"
          }
        }
        component_coder_ids: "ref_Coder_TupleCoder_20"
        component_coder_ids: "ref_Coder_GlobalWindowCoder_6"
      }
    }
    coders {
      key: "ref_Coder_WindowedValueCoder_22"
      value {
        spec {
          spec {
            urn: "beam:coder:windowed_value:v1"
          }
        }
        component_coder_ids: "ref_Coder_TupleCoder_4"
        component_coder_ids: "ref_Coder_GlobalWindowCoder_6"
      }
    }
    coders {
      key: "ref_Coder_WindowedValueCoder_23"
      value {
        spec {
          spec {
            urn: "beam:coder:windowed_value:v1"
          }
        }
        component_coder_ids: "ref_Coder_TupleCoder_5"
        component_coder_ids: "ref_Coder_GlobalWindowCoder_6"
      }
    }
    coders {
      key: "ref_Coder_WindowedValueCoder_24"
      value {
        spec {
          spec {
            urn: "beam:coder:windowed_value:v1"
          }
        }
        component_coder_ids: "ref_Coder_TupleCoder_25"
        component_coder_ids: "ref_Coder_GlobalWindowCoder_6"
      }
    }
    coders {
      key: "ref_Coder_WindowedValueCoder_7"
      value {
        spec {
          spec {
            urn: "beam:coder:windowed_value:v1"
          }
        }
        component_coder_ids: "ref_Coder_VarIntCoder_8"
        component_coder_ids: "ref_Coder_GlobalWindowCoder_6"
      }
    }
    coders {
      key: "ref_Coder_WindowedValueCoder_9"
      value {
        spec {
          spec {
            urn: "beam:coder:windowed_value:v1"
          }
        }
        component_coder_ids: "ref_Coder_TupleCoder_10"
        component_coder_ids: "ref_Coder_GlobalWindowCoder_6"
      }
    }
    coders {
      key: "ref_Coder_WindowedValueCoder_9_bytes"
      value {
        spec {
          spec {
            urn: "beam:coder:windowed_value:v1"
          }
        }
        component_coder_ids: "ref_Coder_TupleCoder_10_bytes"
        component_coder_ids: "ref_Coder_GlobalWindowCoder_6"
      }
    }
    coders {
      key: "ref_Coder_WindowedValueCoder_9_len_prefix"
      value {
        spec {
          spec {
            urn: "beam:coder:windowed_value:v1"
          }
        }
        component_coder_ids: "ref_Coder_TupleCoder_10_len_prefix"
        component_coder_ids: "ref_Coder_GlobalWindowCoder_6"
      }
    }
  }
}

root: DEBUG: CONTROL RESPONSE instruction_id: "control_5"
register {
}

root: DEBUG: CONTROL REQUEST instruction_id: "bundle_56"
process_bundle {
  process_bundle_descriptor_reference: "4"
}

root: INFO: start <DoOperation assert_that/Match output_tags=['out']>
root: INFO: start <DoOperation assert_that/Unkey output_tags=['out']>
root: INFO: start <DoOperation assert_that/Group/Map(_merge_tagged_vals_under_key) output_tags=['out']>
root: INFO: start <DataInputOperation assert_that/Group/GroupByKey/Read receivers=[ConsumerSet[assert_that/Group/GroupByKey/Read.out0,
coder=WindowedValueCoder[TupleCoder[LengthPrefixCoder[FastPrimitivesCoder], IterableCoder[LengthPrefixCoder[FastPrimitivesCoder]]]],
len(consumers)=1]]>
--------------------- >> end captured logging << ---------------------

----------------------------------------------------------------------
XML: <https://builds.apache.org/job/beam_PreCommit_Python_Cron/ws/src/sdks/python/nosetests.xml>
----------------------------------------------------------------------
Ran 1611 tests in 159.448s

FAILED (SKIP=288, errors=1)
ERROR: InvocationError for command '<https://builds.apache.org/job/beam_PreCommit_Python_Cron/ws/src/sdks/python/target/.tox/py27-cython/bin/python>
setup.py nosetests' (exited with code 1)
___________________________________ summary ____________________________________
ERROR:   py27-cython: commands failed

> Task :beam-sdks-python:testCython FAILED
:beam-sdks-python:testCython (Thread[Task worker for ':' Thread 15,5,main]) completed. Took
4 mins 52.048 secs.

FAILURE: Build completed with 3 failures.

1: Task failed with an exception.
-----------
* Where:
Build file '<https://builds.apache.org/job/beam_PreCommit_Python_Cron/ws/src/sdks/python/build.gradle'>
line: 122

* What went wrong:
Execution failed for task ':beam-sdks-python:testGcp'.
> Process 'command 'sh'' finished with non-zero exit value 1

* Try:
Run with --stacktrace option to get the stack trace. Run with --debug option to get more log
output. Run with --scan to get full insights.
==============================================================================

2: Task failed with an exception.
-----------
* Where:
Build file '<https://builds.apache.org/job/beam_PreCommit_Python_Cron/ws/src/sdks/python/build.gradle'>
line: 132

* What went wrong:
Execution failed for task ':beam-sdks-python:testPython'.
> Process 'command 'sh'' finished with non-zero exit value 1

* Try:
Run with --stacktrace option to get the stack trace. Run with --debug option to get more log
output. Run with --scan to get full insights.
==============================================================================

3: Task failed with an exception.
-----------
* Where:
Build file '<https://builds.apache.org/job/beam_PreCommit_Python_Cron/ws/src/sdks/python/build.gradle'>
line: 142

* What went wrong:
Execution failed for task ':beam-sdks-python:testCython'.
> Process 'command 'sh'' finished with non-zero exit value 1

* Try:
Run with --stacktrace option to get the stack trace. Run with --debug option to get more log
output. Run with --scan to get full insights.
==============================================================================

* Get more help at https://help.gradle.org

Deprecated Gradle features were used in this build, making it incompatible with Gradle 5.0.
See https://docs.gradle.org/4.8/userguide/command_line_interface.html#sec:command_line_warnings

BUILD FAILED in 13m 0s
9 actionable tasks: 9 executed

Publishing build scan...
https://gradle.com/s/7bto6r47gkoro

Build step 'Invoke Gradle script' changed build result to FAILURE
Build step 'Invoke Gradle script' marked build as failure
Not sending mail to unregistered user amaliujia@163.com
Not sending mail to unregistered user xiliu@xiliu-ld1.linkedin.biz
Not sending mail to unregistered user klk@google.com

Mime
View raw message