beam-commits mailing list archives

Site index · List index
Message view « Date » · « Thread »
Top « Date » · « Thread »
From Apache Jenkins Server <jenk...@builds.apache.org>
Subject Build failed in Jenkins: beam_PerformanceTests_HadoopInputFormat #394
Date Thu, 14 Jun 2018 19:19:05 GMT
See <https://builds.apache.org/job/beam_PerformanceTests_HadoopInputFormat/394/display/redirect?page=changes>

Changes:

[apilloud] [SQL] Make getString more generic

[apilloud] [SQL] Support unquoted table types

[jiangkai] call SqlFunctions in numeric type conversion

[lcwik] Clean-up BeamFnDataBufferingOutboundObserver since Dataflow has migrated

[jiangkai] unit test for BuildExpression literal casting

[fvoichick] Fixed link to nonexistent IsBounded.apply method

[fvoichick] Fixed documentation of default window size in example code

[fvoichick] Fixed inappropriate Javadoc comments

[aaltay] [BEAM-4333] Add integration tests for python mobile games (#5630)

------------------------------------------
[...truncated 119.16 KB...]
    	at sun.reflect.DelegatingMethodAccessorImpl.invoke(DelegatingMethodAccessorImpl.java:43)
    	at java.lang.reflect.Method.invoke(Method.java:498)
    	at org.gradle.internal.dispatch.ReflectionDispatch.dispatch(ReflectionDispatch.java:35)
    	at org.gradle.internal.dispatch.ReflectionDispatch.dispatch(ReflectionDispatch.java:24)
    	at org.gradle.internal.remote.internal.hub.MessageHubBackedObjectConnection$DispatchWrapper.dispatch(MessageHubBackedObjectConnection.java:155)
    	at org.gradle.internal.remote.internal.hub.MessageHubBackedObjectConnection$DispatchWrapper.dispatch(MessageHubBackedObjectConnection.java:137)
    	at org.gradle.internal.remote.internal.hub.MessageHub$Handler.run(MessageHub.java:404)
    	at org.gradle.internal.concurrent.ExecutorPolicy$CatchAndRecordFailures.onExecute(ExecutorPolicy.java:63)
    	at org.gradle.internal.concurrent.ManagedExecutorImpl$1.run(ManagedExecutorImpl.java:46)
    	at java.util.concurrent.ThreadPoolExecutor.runWorker(ThreadPoolExecutor.java:1149)
    	at java.util.concurrent.ThreadPoolExecutor$Worker.run(ThreadPoolExecutor.java:624)
    	at org.gradle.internal.concurrent.ThreadFactoryImpl$ManagedThreadRunnable.run(ThreadFactoryImpl.java:55)
    	at java.lang.Thread.run(Thread.java:748)

    Jun 14, 2018 7:18:59 PM org.postgresql.Driver connect
    SEVERE: Connection error: 
    org.postgresql.util.PSQLException: The connection attempt failed.
    	at org.postgresql.core.v3.ConnectionFactoryImpl.openConnectionImpl(ConnectionFactoryImpl.java:257)
    	at org.postgresql.core.ConnectionFactory.openConnection(ConnectionFactory.java:49)
    	at org.postgresql.jdbc.PgConnection.<init>(PgConnection.java:195)
    	at org.postgresql.Driver.makeConnection(Driver.java:452)
    	at org.postgresql.Driver.connect(Driver.java:254)
    	at java.sql.DriverManager.getConnection(DriverManager.java:664)
    	at java.sql.DriverManager.getConnection(DriverManager.java:247)
    	at org.postgresql.ds.common.BaseDataSource.getConnection(BaseDataSource.java:94)
    	at org.postgresql.ds.common.BaseDataSource.getConnection(BaseDataSource.java:79)
    	at org.apache.beam.sdk.io.common.DatabaseTestHelper.createTable(DatabaseTestHelper.java:46)
    	at org.apache.beam.sdk.io.hadoop.inputformat.HadoopInputFormatIOIT.setUp(HadoopInputFormatIOIT.java:97)
    	at sun.reflect.NativeMethodAccessorImpl.invoke0(Native Method)
    	at sun.reflect.NativeMethodAccessorImpl.invoke(NativeMethodAccessorImpl.java:62)
    	at sun.reflect.DelegatingMethodAccessorImpl.invoke(DelegatingMethodAccessorImpl.java:43)
    	at java.lang.reflect.Method.invoke(Method.java:498)
    	at org.junit.runners.model.FrameworkMethod$1.runReflectiveCall(FrameworkMethod.java:50)
    	at org.junit.internal.runners.model.ReflectiveCallable.run(ReflectiveCallable.java:12)
    	at org.junit.runners.model.FrameworkMethod.invokeExplosively(FrameworkMethod.java:47)
    	at org.junit.internal.runners.statements.RunBefores.evaluate(RunBefores.java:24)
    	at org.junit.internal.runners.statements.RunAfters.evaluate(RunAfters.java:27)
    	at org.junit.runners.ParentRunner.run(ParentRunner.java:363)
    	at org.gradle.api.internal.tasks.testing.junit.JUnitTestClassExecutor.runTestClass(JUnitTestClassExecutor.java:106)
    	at org.gradle.api.internal.tasks.testing.junit.JUnitTestClassExecutor.execute(JUnitTestClassExecutor.java:58)
    	at org.gradle.api.internal.tasks.testing.junit.JUnitTestClassExecutor.execute(JUnitTestClassExecutor.java:38)
    	at org.gradle.api.internal.tasks.testing.junit.AbstractJUnitTestClassProcessor.processTestClass(AbstractJUnitTestClassProcessor.java:66)
    	at org.gradle.api.internal.tasks.testing.SuiteTestClassProcessor.processTestClass(SuiteTestClassProcessor.java:51)
    	at sun.reflect.NativeMethodAccessorImpl.invoke0(Native Method)
    	at sun.reflect.NativeMethodAccessorImpl.invoke(NativeMethodAccessorImpl.java:62)
    	at sun.reflect.DelegatingMethodAccessorImpl.invoke(DelegatingMethodAccessorImpl.java:43)
    	at java.lang.reflect.Method.invoke(Method.java:498)
    	at org.gradle.internal.dispatch.ReflectionDispatch.dispatch(ReflectionDispatch.java:35)
    	at org.gradle.internal.dispatch.ReflectionDispatch.dispatch(ReflectionDispatch.java:24)
    	at org.gradle.internal.dispatch.ContextClassLoaderDispatch.dispatch(ContextClassLoaderDispatch.java:32)
    	at org.gradle.internal.dispatch.ProxyDispatchAdapter$DispatchingInvocationHandler.invoke(ProxyDispatchAdapter.java:93)
    	at com.sun.proxy.$Proxy2.processTestClass(Unknown Source)
    	at org.gradle.api.internal.tasks.testing.worker.TestWorker.processTestClass(TestWorker.java:109)
    	at sun.reflect.NativeMethodAccessorImpl.invoke0(Native Method)
    	at sun.reflect.NativeMethodAccessorImpl.invoke(NativeMethodAccessorImpl.java:62)
    	at sun.reflect.DelegatingMethodAccessorImpl.invoke(DelegatingMethodAccessorImpl.java:43)
    	at java.lang.reflect.Method.invoke(Method.java:498)
    	at org.gradle.internal.dispatch.ReflectionDispatch.dispatch(ReflectionDispatch.java:35)
    	at org.gradle.internal.dispatch.ReflectionDispatch.dispatch(ReflectionDispatch.java:24)
    	at org.gradle.internal.remote.internal.hub.MessageHubBackedObjectConnection$DispatchWrapper.dispatch(MessageHubBackedObjectConnection.java:155)
    	at org.gradle.internal.remote.internal.hub.MessageHubBackedObjectConnection$DispatchWrapper.dispatch(MessageHubBackedObjectConnection.java:137)
    	at org.gradle.internal.remote.internal.hub.MessageHub$Handler.run(MessageHub.java:404)
    	at org.gradle.internal.concurrent.ExecutorPolicy$CatchAndRecordFailures.onExecute(ExecutorPolicy.java:63)
    	at org.gradle.internal.concurrent.ManagedExecutorImpl$1.run(ManagedExecutorImpl.java:46)
    	at java.util.concurrent.ThreadPoolExecutor.runWorker(ThreadPoolExecutor.java:1149)
    	at java.util.concurrent.ThreadPoolExecutor$Worker.run(ThreadPoolExecutor.java:624)
    	at org.gradle.internal.concurrent.ThreadFactoryImpl$ManagedThreadRunnable.run(ThreadFactoryImpl.java:55)
    	at java.lang.Thread.run(Thread.java:748)
    Caused by: java.net.SocketTimeoutException: connect timed out
    	at java.net.PlainSocketImpl.socketConnect(Native Method)
    	at java.net.AbstractPlainSocketImpl.doConnect(AbstractPlainSocketImpl.java:350)
    	at java.net.AbstractPlainSocketImpl.connectToAddress(AbstractPlainSocketImpl.java:206)
    	at java.net.AbstractPlainSocketImpl.connect(AbstractPlainSocketImpl.java:188)
    	at java.net.SocksSocketImpl.connect(SocksSocketImpl.java:392)
    	at java.net.Socket.connect(Socket.java:589)
    	at org.postgresql.core.PGStream.<init>(PGStream.java:69)
    	at org.postgresql.core.v3.ConnectionFactoryImpl.openConnectionImpl(ConnectionFactoryImpl.java:156)
    	... 50 more

    Jun 14, 2018 7:18:59 PM org.postgresql.ds.common.BaseDataSource getConnection
    SEVERE: Failed to create a Non-Pooling DataSource from PostgreSQL JDBC Driver 42.2.2 for
postgres at jdbc:postgresql://104.154.182.64:5432/postgres?ssl=false: org.postgresql.util.PSQLException:
The connection attempt failed.

Gradle Test Executor 1 finished executing tests.

> Task :beam-sdks-java-io-hadoop-input-format:integrationTest

org.apache.beam.sdk.io.hadoop.inputformat.HadoopInputFormatIOIT > classMethod FAILED
    org.postgresql.util.PSQLException: The connection attempt failed.
        at org.postgresql.core.v3.ConnectionFactoryImpl.openConnectionImpl(ConnectionFactoryImpl.java:257)
        at org.postgresql.core.ConnectionFactory.openConnection(ConnectionFactory.java:49)
        at org.postgresql.jdbc.PgConnection.<init>(PgConnection.java:195)
        at org.postgresql.Driver.makeConnection(Driver.java:452)
        at org.postgresql.Driver.connect(Driver.java:254)
        at java.sql.DriverManager.getConnection(DriverManager.java:664)
        at java.sql.DriverManager.getConnection(DriverManager.java:247)
        at org.postgresql.ds.common.BaseDataSource.getConnection(BaseDataSource.java:94)
        at org.postgresql.ds.common.BaseDataSource.getConnection(BaseDataSource.java:79)
        at org.apache.beam.sdk.io.common.DatabaseTestHelper.createTable(DatabaseTestHelper.java:46)
        at org.apache.beam.sdk.io.hadoop.inputformat.HadoopInputFormatIOIT.setUp(HadoopInputFormatIOIT.java:97)

        Caused by:
        java.net.SocketTimeoutException: connect timed out
            at java.net.PlainSocketImpl.socketConnect(Native Method)
            at java.net.AbstractPlainSocketImpl.doConnect(AbstractPlainSocketImpl.java:350)
            at java.net.AbstractPlainSocketImpl.connectToAddress(AbstractPlainSocketImpl.java:206)
            at java.net.AbstractPlainSocketImpl.connect(AbstractPlainSocketImpl.java:188)
            at java.net.SocksSocketImpl.connect(SocksSocketImpl.java:392)
            at java.net.Socket.connect(Socket.java:589)
            at org.postgresql.core.PGStream.<init>(PGStream.java:69)
            at org.postgresql.core.v3.ConnectionFactoryImpl.openConnectionImpl(ConnectionFactoryImpl.java:156)
            ... 10 more

org.apache.beam.sdk.io.hadoop.inputformat.HadoopInputFormatIOIT > classMethod FAILED
    org.postgresql.util.PSQLException: ERROR: table "beamtest_hadoopinputformatioit_2018_06_14_19_18_49_849"
does not exist
        at org.postgresql.core.v3.QueryExecutorImpl.receiveErrorResponse(QueryExecutorImpl.java:2433)
        at org.postgresql.core.v3.QueryExecutorImpl.processResults(QueryExecutorImpl.java:2178)
        at org.postgresql.core.v3.QueryExecutorImpl.execute(QueryExecutorImpl.java:306)
        at org.postgresql.jdbc.PgStatement.executeInternal(PgStatement.java:441)
        at org.postgresql.jdbc.PgStatement.execute(PgStatement.java:365)
        at org.postgresql.jdbc.PgStatement.executeWithFlags(PgStatement.java:307)
        at org.postgresql.jdbc.PgStatement.executeCachedSql(PgStatement.java:293)
        at org.postgresql.jdbc.PgStatement.executeWithFlags(PgStatement.java:270)
        at org.postgresql.jdbc.PgStatement.executeUpdate(PgStatement.java:244)
        at org.apache.beam.sdk.io.common.DatabaseTestHelper.deleteTable(DatabaseTestHelper.java:59)
        at org.apache.beam.sdk.io.hadoop.inputformat.HadoopInputFormatIOIT.tearDown(HadoopInputFormatIOIT.java:124)
Finished generating test XML results (0.012 secs) into: <https://builds.apache.org/job/beam_PerformanceTests_HadoopInputFormat/ws/src/sdks/java/io/hadoop-input-format/build/test-results/integrationTest>
Generating HTML test report...
Finished generating test html results (0.019 secs) into: <https://builds.apache.org/job/beam_PerformanceTests_HadoopInputFormat/ws/src/sdks/java/io/hadoop-input-format/build/reports/tests/integrationTest>

> Task :beam-sdks-java-io-hadoop-input-format:integrationTest FAILED
:beam-sdks-java-io-hadoop-input-format:integrationTest (Thread[Task worker for ':' Thread
8,5,main]) completed. Took 15.267 secs.

Deprecated Gradle features were used in this build, making it incompatible with Gradle 5.0.
See https://docs.gradle.org/4.8/userguide/command_line_interface.html#sec:command_line_warnings
67 actionable tasks: 1 executed, 66 up-to-date

Publishing build scan...
https://gradle.com/s/gr24hjn3rusj4


STDERR: 
2 tests completed, 2 failed

FAILURE: Build failed with an exception.

* What went wrong:
Execution failed for task ':beam-sdks-java-io-hadoop-input-format:integrationTest'.
> There were failing tests. See the report at: file://<https://builds.apache.org/job/beam_PerformanceTests_HadoopInputFormat/ws/src/sdks/java/io/hadoop-input-format/build/reports/tests/integrationTest/index.html>

* Try:
Run with --debug option to get more log output. Run with --scan to get full insights.

* Exception is:
org.gradle.api.tasks.TaskExecutionException: Execution failed for task ':beam-sdks-java-io-hadoop-input-format:integrationTest'.
	at org.gradle.api.internal.tasks.execution.ExecuteActionsTaskExecuter.executeActions(ExecuteActionsTaskExecuter.java:110)
	at org.gradle.api.internal.tasks.execution.ExecuteActionsTaskExecuter.execute(ExecuteActionsTaskExecuter.java:77)
	at org.gradle.api.internal.tasks.execution.OutputDirectoryCreatingTaskExecuter.execute(OutputDirectoryCreatingTaskExecuter.java:51)
	at org.gradle.api.internal.tasks.execution.SkipCachedTaskExecuter.execute(SkipCachedTaskExecuter.java:105)
	at org.gradle.api.internal.tasks.execution.SkipUpToDateTaskExecuter.execute(SkipUpToDateTaskExecuter.java:59)
	at org.gradle.api.internal.tasks.execution.ResolveTaskOutputCachingStateExecuter.execute(ResolveTaskOutputCachingStateExecuter.java:54)
	at org.gradle.api.internal.tasks.execution.ResolveBuildCacheKeyExecuter.execute(ResolveBuildCacheKeyExecuter.java:66)
	at org.gradle.api.internal.tasks.execution.ValidatingTaskExecuter.execute(ValidatingTaskExecuter.java:59)
	at org.gradle.api.internal.tasks.execution.SkipEmptySourceFilesTaskExecuter.execute(SkipEmptySourceFilesTaskExecuter.java:101)
	at org.gradle.api.internal.tasks.execution.FinalizeInputFilePropertiesTaskExecuter.execute(FinalizeInputFilePropertiesTaskExecuter.java:44)
	at org.gradle.api.internal.tasks.execution.CleanupStaleOutputsExecuter.execute(CleanupStaleOutputsExecuter.java:91)
	at org.gradle.api.internal.tasks.execution.ResolveTaskArtifactStateTaskExecuter.execute(ResolveTaskArtifactStateTaskExecuter.java:62)
	at org.gradle.api.internal.tasks.execution.SkipTaskWithNoActionsExecuter.execute(SkipTaskWithNoActionsExecuter.java:59)
	at org.gradle.api.internal.tasks.execution.SkipOnlyIfTaskExecuter.execute(SkipOnlyIfTaskExecuter.java:54)
	at org.gradle.api.internal.tasks.execution.ExecuteAtMostOnceTaskExecuter.execute(ExecuteAtMostOnceTaskExecuter.java:43)
	at org.gradle.api.internal.tasks.execution.CatchExceptionTaskExecuter.execute(CatchExceptionTaskExecuter.java:34)
	at org.gradle.api.internal.tasks.execution.EventFiringTaskExecuter$1.run(EventFiringTaskExecuter.java:51)
	at org.gradle.internal.operations.DefaultBuildOperationExecutor$RunnableBuildOperationWorker.execute(DefaultBuildOperationExecutor.java:317)
	at org.gradle.internal.operations.DefaultBuildOperationExecutor$RunnableBuildOperationWorker.execute(DefaultBuildOperationExecutor.java:309)
	at org.gradle.internal.operations.DefaultBuildOperationExecutor.execute(DefaultBuildOperationExecutor.java:185)
	at org.gradle.internal.operations.DefaultBuildOperationExecutor.run(DefaultBuildOperationExecutor.java:97)
	at org.gradle.internal.operations.DelegatingBuildOperationExecutor.run(DelegatingBuildOperationExecutor.java:31)
	at org.gradle.api.internal.tasks.execution.EventFiringTaskExecuter.execute(EventFiringTaskExecuter.java:46)
	at org.gradle.execution.taskgraph.DefaultTaskExecutionGraph$ExecuteTaskAction.execute(DefaultTaskExecutionGraph.java:262)
	at org.gradle.execution.taskgraph.DefaultTaskExecutionGraph$ExecuteTaskAction.execute(DefaultTaskExecutionGraph.java:246)
	at org.gradle.execution.taskgraph.DefaultTaskPlanExecutor$TaskExecutorWorker$1.execute(DefaultTaskPlanExecutor.java:136)
	at org.gradle.execution.taskgraph.DefaultTaskPlanExecutor$TaskExecutorWorker$1.execute(DefaultTaskPlanExecutor.java:130)
	at org.gradle.execution.taskgraph.DefaultTaskPlanExecutor$TaskExecutorWorker.execute(DefaultTaskPlanExecutor.java:201)
	at org.gradle.execution.taskgraph.DefaultTaskPlanExecutor$TaskExecutorWorker.executeWithTask(DefaultTaskPlanExecutor.java:192)
	at org.gradle.execution.taskgraph.DefaultTaskPlanExecutor$TaskExecutorWorker.run(DefaultTaskPlanExecutor.java:130)
	at org.gradle.internal.concurrent.ExecutorPolicy$CatchAndRecordFailures.onExecute(ExecutorPolicy.java:63)
	at org.gradle.internal.concurrent.ManagedExecutorImpl$1.run(ManagedExecutorImpl.java:46)
	at org.gradle.internal.concurrent.ThreadFactoryImpl$ManagedThreadRunnable.run(ThreadFactoryImpl.java:55)
Caused by: org.gradle.api.GradleException: There were failing tests. See the report at: file://<https://builds.apache.org/job/beam_PerformanceTests_HadoopInputFormat/ws/src/sdks/java/io/hadoop-input-format/build/reports/tests/integrationTest/index.html>
	at org.gradle.api.tasks.testing.AbstractTestTask.handleTestFailures(AbstractTestTask.java:612)
	at org.gradle.api.tasks.testing.AbstractTestTask.executeTests(AbstractTestTask.java:484)
	at org.gradle.api.tasks.testing.Test.executeTests(Test.java:603)
	at org.gradle.internal.reflect.JavaMethod.invoke(JavaMethod.java:73)
	at org.gradle.api.internal.project.taskfactory.StandardTaskAction.doExecute(StandardTaskAction.java:46)
	at org.gradle.api.internal.project.taskfactory.StandardTaskAction.execute(StandardTaskAction.java:39)
	at org.gradle.api.internal.project.taskfactory.StandardTaskAction.execute(StandardTaskAction.java:26)
	at org.gradle.api.internal.AbstractTask$TaskActionWrapper.execute(AbstractTask.java:794)
	at org.gradle.api.internal.AbstractTask$TaskActionWrapper.execute(AbstractTask.java:761)
	at org.gradle.api.internal.tasks.execution.ExecuteActionsTaskExecuter$1.run(ExecuteActionsTaskExecuter.java:131)
	at org.gradle.internal.operations.DefaultBuildOperationExecutor$RunnableBuildOperationWorker.execute(DefaultBuildOperationExecutor.java:317)
	at org.gradle.internal.operations.DefaultBuildOperationExecutor$RunnableBuildOperationWorker.execute(DefaultBuildOperationExecutor.java:309)
	at org.gradle.internal.operations.DefaultBuildOperationExecutor.execute(DefaultBuildOperationExecutor.java:185)
	at org.gradle.internal.operations.DefaultBuildOperationExecutor.run(DefaultBuildOperationExecutor.java:97)
	at org.gradle.internal.operations.DelegatingBuildOperationExecutor.run(DelegatingBuildOperationExecutor.java:31)
	at org.gradle.api.internal.tasks.execution.ExecuteActionsTaskExecuter.executeAction(ExecuteActionsTaskExecuter.java:120)
	at org.gradle.api.internal.tasks.execution.ExecuteActionsTaskExecuter.executeActions(ExecuteActionsTaskExecuter.java:99)
	... 32 more


* Get more help at https://help.gradle.org

BUILD FAILED in 24s

2018-06-14 19:19:04,239 8c208dba MainThread beam_integration_benchmark(1/1) ERROR    Error
during benchmark beam_integration_benchmark
Traceback (most recent call last):
  File "<https://builds.apache.org/job/beam_PerformanceTests_HadoopInputFormat/ws/PerfKitBenchmarker/perfkitbenchmarker/pkb.py",>
line 667, in RunBenchmark
    DoRunPhase(spec, collector, detailed_timer)
  File "<https://builds.apache.org/job/beam_PerformanceTests_HadoopInputFormat/ws/PerfKitBenchmarker/perfkitbenchmarker/pkb.py",>
line 547, in DoRunPhase
    samples = spec.BenchmarkRun(spec)
  File "<https://builds.apache.org/job/beam_PerformanceTests_HadoopInputFormat/ws/PerfKitBenchmarker/perfkitbenchmarker/linux_benchmarks/beam_integration_benchmark.py",>
line 159, in Run
    job_type=job_type)
  File "<https://builds.apache.org/job/beam_PerformanceTests_HadoopInputFormat/ws/PerfKitBenchmarker/perfkitbenchmarker/providers/gcp/gcp_dpb_dataflow.py",>
line 90, in SubmitJob
    assert retcode == 0, "Integration Test Failed."
AssertionError: Integration Test Failed.
2018-06-14 19:19:04,240 8c208dba MainThread beam_integration_benchmark(1/1) INFO     Cleaning
up benchmark beam_integration_benchmark
2018-06-14 19:19:04,241 8c208dba MainThread beam_integration_benchmark(1/1) INFO     Running:
kubectl --kubeconfig=<https://builds.apache.org/job/beam_PerformanceTests_HadoopInputFormat/ws/config-beam-performancetests-hadoopinputformat-394>
delete -f <https://builds.apache.org/job/beam_PerformanceTests_HadoopInputFormat/ws/src/.test-infra/kubernetes/postgres/postgres-service-for-local-dev.yml>
--ignore-not-found
2018-06-14 19:19:04,589 8c208dba MainThread beam_integration_benchmark(1/1) ERROR    Exception
running benchmark
Traceback (most recent call last):
  File "<https://builds.apache.org/job/beam_PerformanceTests_HadoopInputFormat/ws/PerfKitBenchmarker/perfkitbenchmarker/pkb.py",>
line 801, in RunBenchmarkTask
    RunBenchmark(spec, collector)
  File "<https://builds.apache.org/job/beam_PerformanceTests_HadoopInputFormat/ws/PerfKitBenchmarker/perfkitbenchmarker/pkb.py",>
line 667, in RunBenchmark
    DoRunPhase(spec, collector, detailed_timer)
  File "<https://builds.apache.org/job/beam_PerformanceTests_HadoopInputFormat/ws/PerfKitBenchmarker/perfkitbenchmarker/pkb.py",>
line 547, in DoRunPhase
    samples = spec.BenchmarkRun(spec)
  File "<https://builds.apache.org/job/beam_PerformanceTests_HadoopInputFormat/ws/PerfKitBenchmarker/perfkitbenchmarker/linux_benchmarks/beam_integration_benchmark.py",>
line 159, in Run
    job_type=job_type)
  File "<https://builds.apache.org/job/beam_PerformanceTests_HadoopInputFormat/ws/PerfKitBenchmarker/perfkitbenchmarker/providers/gcp/gcp_dpb_dataflow.py",>
line 90, in SubmitJob
    assert retcode == 0, "Integration Test Failed."
AssertionError: Integration Test Failed.
2018-06-14 19:19:04,590 8c208dba MainThread beam_integration_benchmark(1/1) ERROR    Benchmark
1/1 beam_integration_benchmark (UID: beam_integration_benchmark0) failed. Execution will continue.
2018-06-14 19:19:04,603 8c208dba MainThread INFO     Benchmark run statuses:
---------------------------------------------------------------------------------
Name                        UID                          Status  Failed Substatus
---------------------------------------------------------------------------------
beam_integration_benchmark  beam_integration_benchmark0  FAILED                  
---------------------------------------------------------------------------------
Success rate: 0.00% (0/1)
2018-06-14 19:19:04,603 8c208dba MainThread INFO     Complete logs can be found at: <https://builds.apache.org/job/beam_PerformanceTests_HadoopInputFormat/ws/runs/8c208dba/pkb.log>
2018-06-14 19:19:04,603 8c208dba MainThread INFO     Completion statuses can be found at:
<https://builds.apache.org/job/beam_PerformanceTests_HadoopInputFormat/ws/runs/8c208dba/completion_statuses.json>
Build step 'Execute shell' marked build as failure

Mime
View raw message