beam-commits mailing list archives

Site index · List index
Message view « Date » · « Thread »
Top « Date » · « Thread »
From Apache Jenkins Server <jenk...@builds.apache.org>
Subject Build failed in Jenkins: beam_PostCommit_Go_GradleBuild #308
Date Thu, 21 Jun 2018 22:36:40 GMT
See <https://builds.apache.org/job/beam_PostCommit_Go_GradleBuild/308/display/redirect?page=changes>

Changes:

[amaliujia] support unbounded limit.

------------------------------------------
[...truncated 274.86 KB...]
2018/06/21 22:36:36 Plan[plan]:
4: Impulse[0]
1: Discard
2: ParDo[beam.partitionFn] Out:[1]
3: ParDo[beam.createFn] Out:[2]
2018/06/21 22:36:36 Pipeline:
2018/06/21 22:36:36 Nodes: {1: []uint8/bytes GLO}
{2: int/int[varintz] GLO}
{3: int/int[varintz] GLO}
{4: int/int[varintz] GLO}
{5: int/int[varintz] GLO}
{6: int/int[varintz] GLO}
{7: int/int[varintz] GLO}
{8: int/int[varintz] GLO}
Edges: 1: Impulse [] -> [Out: []uint8 -> {1: []uint8/bytes GLO}]
2: ParDo [In(Main): []uint8 <- {1: []uint8/bytes GLO}] -> [Out: T -> {2: int/int[varintz]
GLO}]
3: ParDo [In(Main): int <- {2: int/int[varintz] GLO}] -> [Out: int -> {3: int/int[varintz]
GLO} Out: int -> {4: int/int[varintz] GLO} Out: int -> {5: int/int[varintz] GLO} Out:
int -> {6: int/int[varintz] GLO} Out: int -> {7: int/int[varintz] GLO} Out: int ->
{8: int/int[varintz] GLO}]
2018/06/21 22:36:36 Plan[plan]:
9: Impulse[0]
1: Discard
2: Discard
3: Discard
4: Discard
5: Discard
6: Discard
7: ParDo[beam.partitionFn] Out:[1 2 3 4 5 6]
8: ParDo[beam.createFn] Out:[7]
2018/06/21 22:36:36 Pipeline:
2018/06/21 22:36:36 Nodes: {1: []uint8/bytes GLO}
{2: int/int[varintz] GLO}
{3: int/int[varintz] GLO}
{4: int/int[varintz] GLO}
{5: int/int[varintz] GLO}
{6: int/int[varintz] GLO}
{7: int/int[varintz] GLO}
Edges: 1: Impulse [] -> [Out: []uint8 -> {1: []uint8/bytes GLO}]
2: ParDo [In(Main): []uint8 <- {1: []uint8/bytes GLO}] -> [Out: T -> {2: int/int[varintz]
GLO}]
3: ParDo [In(Main): int <- {2: int/int[varintz] GLO}] -> [Out: int -> {3: int/int[varintz]
GLO} Out: int -> {4: int/int[varintz] GLO} Out: int -> {5: int/int[varintz] GLO} Out:
int -> {6: int/int[varintz] GLO} Out: int -> {7: int/int[varintz] GLO}]
2018/06/21 22:36:36 Plan[plan]:
8: Impulse[0]
1: Discard
2: Discard
3: Discard
4: Discard
5: Discard
6: ParDo[beam.partitionFn] Out:[1 2 3 4 5]
7: ParDo[beam.createFn] Out:[6]
--- PASS: TestPartitionFailures (0.00s)
=== RUN   TestPartitionFlattenIdentity
2018/06/21 22:36:36 Pipeline:
2018/06/21 22:36:36 Nodes: {1: []uint8/bytes GLO}
{2: int/int[varintz] GLO}
{3: int/int[varintz] GLO}
{4: int/int[varintz] GLO}
{5: int/int[varintz] GLO}
{6: []uint8/bytes GLO}
{7: int/int[varintz] GLO}
{8: int/int[varintz] GLO}
{9: int/int[varintz] GLO}
Edges: 1: Impulse [] -> [Out: []uint8 -> {1: []uint8/bytes GLO}]
2: ParDo [In(Main): []uint8 <- {1: []uint8/bytes GLO}] -> [Out: T -> {2: int/int[varintz]
GLO}]
3: ParDo [In(Main): int <- {2: int/int[varintz] GLO}] -> [Out: int -> {3: int/int[varintz]
GLO} Out: int -> {4: int/int[varintz] GLO}]
4: Flatten [In(Main): int <- {3: int/int[varintz] GLO} In(Main): int <- {4: int/int[varintz]
GLO}] -> [Out: int -> {5: int/int[varintz] GLO}]
5: Impulse [] -> [Out: []uint8 -> {6: []uint8/bytes GLO}]
6: ParDo [In(Main): []uint8 <- {6: []uint8/bytes GLO} In(Iter): T <- {5: int/int[varintz]
GLO} In(Iter): T <- {2: int/int[varintz] GLO}] -> [Out: T -> {7: int/int[varintz]
GLO} Out: T -> {8: int/int[varintz] GLO} Out: T -> {9: int/int[varintz] GLO}]
7: ParDo [In(Main): X <- {7: int/int[varintz] GLO}] -> []
8: ParDo [In(Main): X <- {9: int/int[varintz] GLO}] -> []
2018/06/21 22:36:36 Plan[plan]:
12: Impulse[0]
13: Impulse[0]
1: ParDo[passert.failFn] Out:[]
2: Discard
3: ParDo[passert.failFn] Out:[]
4: ParDo[passert.diffFn] Out:[1 2 3]
5: wait[2] Out:4
6: buffer[6]. wait:5 Out:4
7: buffer[7]. wait:5 Out:4
8: Flatten[2]. Out:buffer[6]. wait:5 Out:4
9: ParDo[beam.partitionFn] Out:[8 8]
10: Multiplex. Out:[9 7]
11: ParDo[beam.createFn] Out:[10]
2018/06/21 22:36:36 wait[5] unblocked w/ 1 [false]
2018/06/21 22:36:36 wait[5] done
2018/06/21 22:36:36 Pipeline:
2018/06/21 22:36:36 Nodes: {1: []uint8/bytes GLO}
{2: int/int[varintz] GLO}
{3: int/int[varintz] GLO}
{4: int/int[varintz] GLO}
{5: int/int[varintz] GLO}
{6: []uint8/bytes GLO}
{7: int/int[varintz] GLO}
{8: int/int[varintz] GLO}
{9: int/int[varintz] GLO}
Edges: 1: Impulse [] -> [Out: []uint8 -> {1: []uint8/bytes GLO}]
2: ParDo [In(Main): []uint8 <- {1: []uint8/bytes GLO}] -> [Out: T -> {2: int/int[varintz]
GLO}]
3: ParDo [In(Main): int <- {2: int/int[varintz] GLO}] -> [Out: int -> {3: int/int[varintz]
GLO} Out: int -> {4: int/int[varintz] GLO}]
4: Flatten [In(Main): int <- {3: int/int[varintz] GLO} In(Main): int <- {4: int/int[varintz]
GLO}] -> [Out: int -> {5: int/int[varintz] GLO}]
5: Impulse [] -> [Out: []uint8 -> {6: []uint8/bytes GLO}]
6: ParDo [In(Main): []uint8 <- {6: []uint8/bytes GLO} In(Iter): T <- {5: int/int[varintz]
GLO} In(Iter): T <- {2: int/int[varintz] GLO}] -> [Out: T -> {7: int/int[varintz]
GLO} Out: T -> {8: int/int[varintz] GLO} Out: T -> {9: int/int[varintz] GLO}]
7: ParDo [In(Main): X <- {7: int/int[varintz] GLO}] -> []
8: ParDo [In(Main): X <- {9: int/int[varintz] GLO}] -> []
2018/06/21 22:36:36 Plan[plan]:
12: Impulse[0]
13: Impulse[0]
1: ParDo[passert.failFn] Out:[]
2: Discard
3: ParDo[passert.failFn] Out:[]
4: ParDo[passert.diffFn] Out:[1 2 3]
5: wait[2] Out:4
6: buffer[6]. wait:5 Out:4
7: buffer[7]. wait:5 Out:4
8: Flatten[2]. Out:buffer[6]. wait:5 Out:4
9: ParDo[beam.partitionFn] Out:[8 8]
10: Multiplex. Out:[9 7]
11: ParDo[beam.createFn] Out:[10]
2018/06/21 22:36:36 wait[5] unblocked w/ 1 [false]
2018/06/21 22:36:36 wait[5] done
2018/06/21 22:36:36 Pipeline:
2018/06/21 22:36:36 Nodes: {1: []uint8/bytes GLO}
{2: int/int[varintz] GLO}
{3: int/int[varintz] GLO}
{4: int/int[varintz] GLO}
{5: int/int[varintz] GLO}
{6: int/int[varintz] GLO}
{7: int/int[varintz] GLO}
{8: int/int[varintz] GLO}
{9: int/int[varintz] GLO}
{10: int/int[varintz] GLO}
{11: []uint8/bytes GLO}
{12: int/int[varintz] GLO}
{13: int/int[varintz] GLO}
{14: int/int[varintz] GLO}
Edges: 1: Impulse [] -> [Out: []uint8 -> {1: []uint8/bytes GLO}]
2: ParDo [In(Main): []uint8 <- {1: []uint8/bytes GLO}] -> [Out: T -> {2: int/int[varintz]
GLO}]
3: ParDo [In(Main): int <- {2: int/int[varintz] GLO}] -> [Out: int -> {3: int/int[varintz]
GLO} Out: int -> {4: int/int[varintz] GLO} Out: int -> {5: int/int[varintz] GLO} Out:
int -> {6: int/int[varintz] GLO} Out: int -> {7: int/int[varintz] GLO} Out: int ->
{8: int/int[varintz] GLO} Out: int -> {9: int/int[varintz] GLO}]
4: Flatten [In(Main): int <- {3: int/int[varintz] GLO} In(Main): int <- {4: int/int[varintz]
GLO} In(Main): int <- {5: int/int[varintz] GLO} In(Main): int <- {6: int/int[varintz]
GLO} In(Main): int <- {7: int/int[varintz] GLO} In(Main): int <- {8: int/int[varintz]
GLO} In(Main): int <- {9: int/int[varintz] GLO}] -> [Out: int -> {10: int/int[varintz]
GLO}]
5: Impulse [] -> [Out: []uint8 -> {11: []uint8/bytes GLO}]
6: ParDo [In(Main): []uint8 <- {11: []uint8/bytes GLO} In(Iter): T <- {10: int/int[varintz]
GLO} In(Iter): T <- {2: int/int[varintz] GLO}] -> [Out: T -> {12: int/int[varintz]
GLO} Out: T -> {13: int/int[varintz] GLO} Out: T -> {14: int/int[varintz] GLO}]
7: ParDo [In(Main): X <- {12: int/int[varintz] GLO}] -> []
8: ParDo [In(Main): X <- {14: int/int[varintz] GLO}] -> []
2018/06/21 22:36:36 Plan[plan]:
12: Impulse[0]
13: Impulse[0]
1: ParDo[passert.failFn] Out:[]
2: Discard
3: ParDo[passert.failFn] Out:[]
4: ParDo[passert.diffFn] Out:[1 2 3]
5: wait[2] Out:4
6: buffer[6]. wait:5 Out:4
7: buffer[7]. wait:5 Out:4
8: Flatten[7]. Out:buffer[6]. wait:5 Out:4
9: ParDo[beam.partitionFn] Out:[8 8 8 8 8 8 8]
10: Multiplex. Out:[9 7]
11: ParDo[beam.createFn] Out:[10]
2018/06/21 22:36:36 wait[5] unblocked w/ 1 [false]
2018/06/21 22:36:36 wait[5] done
--- PASS: TestPartitionFlattenIdentity (0.00s)
=== RUN   Example_metricsDeclaredAnywhere
--- PASS: Example_metricsDeclaredAnywhere (0.00s)
=== RUN   Example_metricsReusable
--- PASS: Example_metricsReusable (0.00s)
PASS
coverage: 44.8% of statements
ok  	github.com/apache/beam/sdks/go/pkg/beam	0.023s	coverage: 44.8% of statements

> Task :beam-sdks-go:test
Test for github.com/apache/beam/sdks/go/pkg/beam/core/runtime/harness finished, 1 completed,
0 failed
Result of package github.com/apache/beam/sdks/go/pkg/beam:
Test for github.com/apache/beam/sdks/go/pkg/beam finished, 7 completed, 0 failed
Result of package github.com/apache/beam/sdks/go/pkg/beam/core/runtime:

=== RUN   TestOptions
--- PASS: TestOptions (0.00s)
=== RUN   TestKey
--- PASS: TestKey (0.00s)
=== RUN   TestRegister
--- PASS: TestRegister (0.00s)
PASS
coverage: 51.5% of statements
ok  	github.com/apache/beam/sdks/go/pkg/beam/core/runtime	0.003s	coverage: 51.5% of statements
=== RUN   TestCombineFn3String
--- PASS: TestCombineFn3String (0.00s)
=== RUN   TestCombineFn3RevString
--- PASS: TestCombineFn3RevString (0.00s)
=== RUN   TestCombineFnMerge
--- PASS: TestCombineFnMerge (0.00s)
PASS
coverage: 54.8% of statements
ok  	github.com/apache/beam/sdks/go/pkg/beam/transforms/top	0.007s	coverage: 54.8% of statements

> Task :beam-sdks-go:test
Test for github.com/apache/beam/sdks/go/pkg/beam/core/runtime finished, 3 completed, 0 failed
Result of package github.com/apache/beam/sdks/go/pkg/beam/transforms/top:
Test for github.com/apache/beam/sdks/go/pkg/beam/transforms/top finished, 3 completed, 0 failed
Result of package github.com/apache/beam/sdks/go/pkg/beam/core/typex:

=== RUN   TestClassOf
--- PASS: TestClassOf (0.00s)
=== RUN   TestIsConcrete
--- PASS: TestIsConcrete (0.00s)
=== RUN   TestIsBound
--- PASS: TestIsBound (0.00s)
=== RUN   TestIsStructurallyAssignable
--- PASS: TestIsStructurallyAssignable (0.00s)
=== RUN   TestBindSubstitute
--- PASS: TestBindSubstitute (0.00s)
PASS
coverage: 61.5% of statements
ok  	github.com/apache/beam/sdks/go/pkg/beam/core/typex	0.003s	coverage: 61.5% of statements

> Task :beam-sdks-go:test
Test for github.com/apache/beam/sdks/go/pkg/beam/core/typex finished, 5 completed, 0 failed
Generating HTML test report...
Finished generating test html results (0.134 secs) into: <https://builds.apache.org/job/beam_PostCommit_Go_GradleBuild/ws/src/sdks/go/.gogradle/reports/test>
Invalidating in-memory cache of <https://builds.apache.org/job/beam_PostCommit_Go_GradleBuild/ws/src/.gradle/4.8/fileHashes/fileHashes.bin>
Invalidating in-memory cache of <https://builds.apache.org/job/beam_PostCommit_Go_GradleBuild/ws/src/.gradle/4.8/fileHashes/resourceHashesCache.bin>
:beam-sdks-go:test (Thread[Task worker for ':' Thread 4,5,main]) completed. Took 25.359 secs.
:goPreCommit (Thread[Task worker for ':' Thread 4,5,main]) started.

> Task :goPreCommit
Skipping task ':goPreCommit' as it has no actions.
:goPreCommit (Thread[Task worker for ':' Thread 4,5,main]) completed. Took 0.001 secs.

FAILURE: Build failed with an exception.

* Where:
Build file '<https://builds.apache.org/job/beam_PostCommit_Go_GradleBuild/ws/src/build.gradle'>
line: 178

* What went wrong:
Execution failed for task ':goIntegrationTests'.
> Process 'command 'sh'' finished with non-zero exit value 1

* Try:
Run with --stacktrace option to get the stack trace. Run with --debug option to get more log
output. Run with --scan to get full insights.

* Get more help at https://help.gradle.org

Deprecated Gradle features were used in this build, making it incompatible with Gradle 5.0.
See https://docs.gradle.org/4.8/userguide/command_line_interface.html#sec:command_line_warnings

BUILD FAILED in 2m 29s
14 actionable tasks: 14 executed

Publishing build scan...
https://gradle.com/s/gtzhrg5zifgk4

Build step 'Invoke Gradle script' changed build result to FAILURE
Build step 'Invoke Gradle script' marked build as failure
Not sending mail to unregistered user amaliujia@163.com

Mime
View raw message