beam-commits mailing list archives

Site index · List index
Message view « Date » · « Thread »
Top « Date » · « Thread »
From Apache Jenkins Server <jenk...@builds.apache.org>
Subject Build failed in Jenkins: beam_PostCommit_Py_ValCont #97
Date Sun, 24 Jun 2018 22:15:03 GMT
See <https://builds.apache.org/job/beam_PostCommit_Py_ValCont/97/display/redirect>

------------------------------------------
[...truncated 74.24 KB...]
adding 'apache-beam-2.6.0.dev0/apache_beam/runners/experimental/__init__.py'
adding 'apache-beam-2.6.0.dev0/apache_beam/runners/experimental/python_rpc_direct/server.py'
adding 'apache-beam-2.6.0.dev0/apache_beam/runners/experimental/python_rpc_direct/python_rpc_direct_runner.py'
adding 'apache-beam-2.6.0.dev0/apache_beam/runners/experimental/python_rpc_direct/__init__.py'
adding 'apache-beam-2.6.0.dev0/apache_beam/runners/direct/sdf_direct_runner_test.py'
adding 'apache-beam-2.6.0.dev0/apache_beam/runners/direct/watermark_manager.py'
adding 'apache-beam-2.6.0.dev0/apache_beam/runners/direct/clock.py'
adding 'apache-beam-2.6.0.dev0/apache_beam/runners/direct/helper_transforms.py'
adding 'apache-beam-2.6.0.dev0/apache_beam/runners/direct/direct_runner_test.py'
adding 'apache-beam-2.6.0.dev0/apache_beam/runners/direct/transform_evaluator.py'
adding 'apache-beam-2.6.0.dev0/apache_beam/runners/direct/consumer_tracking_pipeline_visitor.py'
adding 'apache-beam-2.6.0.dev0/apache_beam/runners/direct/sdf_direct_runner.py'
adding 'apache-beam-2.6.0.dev0/apache_beam/runners/direct/util.py'
adding 'apache-beam-2.6.0.dev0/apache_beam/runners/direct/direct_metrics.py'
adding 'apache-beam-2.6.0.dev0/apache_beam/runners/direct/bundle_factory.py'
adding 'apache-beam-2.6.0.dev0/apache_beam/runners/direct/direct_runner.py'
adding 'apache-beam-2.6.0.dev0/apache_beam/runners/direct/executor.py'
adding 'apache-beam-2.6.0.dev0/apache_beam/runners/direct/__init__.py'
adding 'apache-beam-2.6.0.dev0/apache_beam/runners/direct/direct_metrics_test.py'
adding 'apache-beam-2.6.0.dev0/apache_beam/runners/direct/evaluation_context.py'
adding 'apache-beam-2.6.0.dev0/apache_beam/runners/direct/consumer_tracking_pipeline_visitor_test.py'
adding 'apache-beam-2.6.0.dev0/apache_beam/runners/test/__init__.py'
adding 'apache-beam-2.6.0.dev0/apache_beam/runners/job/manager.py'
adding 'apache-beam-2.6.0.dev0/apache_beam/runners/job/__init__.py'
adding 'apache-beam-2.6.0.dev0/apache_beam/runners/job/utils.py'
adding 'apache-beam-2.6.0.dev0/apache_beam/runners/portability/portable_stager.py'
adding 'apache-beam-2.6.0.dev0/apache_beam/runners/portability/portable_runner_test.py'
adding 'apache-beam-2.6.0.dev0/apache_beam/runners/portability/fn_api_runner_test.py'
adding 'apache-beam-2.6.0.dev0/apache_beam/runners/portability/fn_api_runner.py'
adding 'apache-beam-2.6.0.dev0/apache_beam/runners/portability/local_job_service.py'
adding 'apache-beam-2.6.0.dev0/apache_beam/runners/portability/stager.py'
adding 'apache-beam-2.6.0.dev0/apache_beam/runners/portability/stager_test.py'
adding 'apache-beam-2.6.0.dev0/apache_beam/runners/portability/portable_stager_test.py'
adding 'apache-beam-2.6.0.dev0/apache_beam/runners/portability/__init__.py'
adding 'apache-beam-2.6.0.dev0/apache_beam/runners/portability/local_job_service_main.py'
adding 'apache-beam-2.6.0.dev0/apache_beam/runners/portability/portable_runner.py'
adding 'apache-beam-2.6.0.dev0/apache_beam/runners/dataflow/test_dataflow_runner.py'
adding 'apache-beam-2.6.0.dev0/apache_beam/runners/dataflow/dataflow_runner.py'
adding 'apache-beam-2.6.0.dev0/apache_beam/runners/dataflow/dataflow_metrics.py'
adding 'apache-beam-2.6.0.dev0/apache_beam/runners/dataflow/dataflow_runner_test.py'
adding 'apache-beam-2.6.0.dev0/apache_beam/runners/dataflow/dataflow_metrics_test.py'
adding 'apache-beam-2.6.0.dev0/apache_beam/runners/dataflow/ptransform_overrides.py'
adding 'apache-beam-2.6.0.dev0/apache_beam/runners/dataflow/__init__.py'
adding 'apache-beam-2.6.0.dev0/apache_beam/runners/dataflow/template_runner_test.py'
adding 'apache-beam-2.6.0.dev0/apache_beam/runners/dataflow/native_io/streaming_create.py'
adding 'apache-beam-2.6.0.dev0/apache_beam/runners/dataflow/native_io/iobase_test.py'
adding 'apache-beam-2.6.0.dev0/apache_beam/runners/dataflow/native_io/iobase.py'
adding 'apache-beam-2.6.0.dev0/apache_beam/runners/dataflow/native_io/__init__.py'
adding 'apache-beam-2.6.0.dev0/apache_beam/runners/dataflow/internal/apiclient_test.py'
adding 'apache-beam-2.6.0.dev0/apache_beam/runners/dataflow/internal/apiclient.py'
adding 'apache-beam-2.6.0.dev0/apache_beam/runners/dataflow/internal/__init__.py'
adding 'apache-beam-2.6.0.dev0/apache_beam/runners/dataflow/internal/names.py'
adding 'apache-beam-2.6.0.dev0/apache_beam/runners/dataflow/internal/clients/__init__.py'
adding 'apache-beam-2.6.0.dev0/apache_beam/runners/dataflow/internal/clients/dataflow/dataflow_v1b3_client.py'
adding 'apache-beam-2.6.0.dev0/apache_beam/runners/dataflow/internal/clients/dataflow/dataflow_v1b3_messages.py'
adding 'apache-beam-2.6.0.dev0/apache_beam/runners/dataflow/internal/clients/dataflow/message_matchers_test.py'
adding 'apache-beam-2.6.0.dev0/apache_beam/runners/dataflow/internal/clients/dataflow/message_matchers.py'
adding 'apache-beam-2.6.0.dev0/apache_beam/runners/dataflow/internal/clients/dataflow/__init__.py'
adding 'apache-beam-2.6.0.dev0/apache_beam/runners/worker/sdk_worker_main_test.py'
adding 'apache-beam-2.6.0.dev0/apache_beam/runners/worker/data_plane.py'
adding 'apache-beam-2.6.0.dev0/apache_beam/runners/worker/operation_specs.py'
adding 'apache-beam-2.6.0.dev0/apache_beam/runners/worker/operations.py'
adding 'apache-beam-2.6.0.dev0/apache_beam/runners/worker/sideinputs_test.py'
adding 'apache-beam-2.6.0.dev0/apache_beam/runners/worker/statesampler_fast.pyx'
adding 'apache-beam-2.6.0.dev0/apache_beam/runners/worker/logger.pxd'
adding 'apache-beam-2.6.0.dev0/apache_beam/runners/worker/opcounters_test.py'
adding 'apache-beam-2.6.0.dev0/apache_beam/runners/worker/sdk_worker.py'
adding 'apache-beam-2.6.0.dev0/apache_beam/runners/worker/sdk_worker_test.py'
adding 'apache-beam-2.6.0.dev0/apache_beam/runners/worker/worker_id_interceptor_test.py'
adding 'apache-beam-2.6.0.dev0/apache_beam/runners/worker/log_handler_test.py'
adding 'apache-beam-2.6.0.dev0/apache_beam/runners/worker/statesampler_test.py'
adding 'apache-beam-2.6.0.dev0/apache_beam/runners/worker/opcounters.pxd'
adding 'apache-beam-2.6.0.dev0/apache_beam/runners/worker/logger.py'
adding 'apache-beam-2.6.0.dev0/apache_beam/runners/worker/opcounters.py'
adding 'apache-beam-2.6.0.dev0/apache_beam/runners/worker/logger_test.py'
adding 'apache-beam-2.6.0.dev0/apache_beam/runners/worker/statesampler.py'
adding 'apache-beam-2.6.0.dev0/apache_beam/runners/worker/sideinputs.py'
adding 'apache-beam-2.6.0.dev0/apache_beam/runners/worker/statesampler_slow.py'
adding 'apache-beam-2.6.0.dev0/apache_beam/runners/worker/bundle_processor.py'
adding 'apache-beam-2.6.0.dev0/apache_beam/runners/worker/log_handler.py'
adding 'apache-beam-2.6.0.dev0/apache_beam/runners/worker/statesampler_fast.pxd'
adding 'apache-beam-2.6.0.dev0/apache_beam/runners/worker/worker_id_interceptor.py'
adding 'apache-beam-2.6.0.dev0/apache_beam/runners/worker/operations.pxd'
adding 'apache-beam-2.6.0.dev0/apache_beam/runners/worker/sdk_worker_main.py'
adding 'apache-beam-2.6.0.dev0/apache_beam/runners/worker/__init__.py'
adding 'apache-beam-2.6.0.dev0/apache_beam/runners/worker/data_plane_test.py'
adding 'apache-beam-2.6.0.dev0/apache_beam/internal/util_test.py'
adding 'apache-beam-2.6.0.dev0/apache_beam/internal/pickler.py'
adding 'apache-beam-2.6.0.dev0/apache_beam/internal/util.py'
adding 'apache-beam-2.6.0.dev0/apache_beam/internal/module_test.py'
adding 'apache-beam-2.6.0.dev0/apache_beam/internal/__init__.py'
adding 'apache-beam-2.6.0.dev0/apache_beam/internal/pickler_test.py'
adding 'apache-beam-2.6.0.dev0/apache_beam/internal/gcp/json_value_test.py'
adding 'apache-beam-2.6.0.dev0/apache_beam/internal/gcp/json_value.py'
adding 'apache-beam-2.6.0.dev0/apache_beam/internal/gcp/__init__.py'
adding 'apache-beam-2.6.0.dev0/apache_beam/internal/gcp/auth.py'
adding 'apache-beam-2.6.0.dev0/apache_beam/metrics/execution.py'
adding 'apache-beam-2.6.0.dev0/apache_beam/metrics/execution.pxd'
adding 'apache-beam-2.6.0.dev0/apache_beam/metrics/cells_test.py'
adding 'apache-beam-2.6.0.dev0/apache_beam/metrics/execution_test.py'
adding 'apache-beam-2.6.0.dev0/apache_beam/metrics/metricbase.py'
adding 'apache-beam-2.6.0.dev0/apache_beam/metrics/cells.py'
adding 'apache-beam-2.6.0.dev0/apache_beam/metrics/metric.py'
adding 'apache-beam-2.6.0.dev0/apache_beam/metrics/__init__.py'
adding 'apache-beam-2.6.0.dev0/apache_beam/metrics/metric_test.py'
adding 'apache-beam-2.6.0.dev0/apache_beam/tools/sideinput_microbenchmark.py'
adding 'apache-beam-2.6.0.dev0/apache_beam/tools/map_fn_microbenchmark.py'
adding 'apache-beam-2.6.0.dev0/apache_beam/tools/__init__.py'
adding 'apache-beam-2.6.0.dev0/apache_beam/tools/distribution_counter_microbenchmark.py'
adding 'apache-beam-2.6.0.dev0/apache_beam/tools/utils.py'
adding 'apache-beam-2.6.0.dev0/apache_beam/examples/wordcount_debugging_test.py'
adding 'apache-beam-2.6.0.dev0/apache_beam/examples/windowed_wordcount.py'
adding 'apache-beam-2.6.0.dev0/apache_beam/examples/wordcount_debugging.py'
adding 'apache-beam-2.6.0.dev0/apache_beam/examples/leader_board_it_test.py'
adding 'apache-beam-2.6.0.dev0/apache_beam/examples/streaming_wordcount_debugging.py'
adding 'apache-beam-2.6.0.dev0/apache_beam/examples/wordcount_minimal.py'
adding 'apache-beam-2.6.0.dev0/apache_beam/examples/streaming_wordcount.py'
adding 'apache-beam-2.6.0.dev0/apache_beam/examples/wordcount_fnapi.py'
adding 'apache-beam-2.6.0.dev0/apache_beam/examples/wordcount.py'
adding 'apache-beam-2.6.0.dev0/apache_beam/examples/wordcount_it_test.py'
adding 'apache-beam-2.6.0.dev0/apache_beam/examples/__init__.py'
adding 'apache-beam-2.6.0.dev0/apache_beam/examples/user_score_it_test.py'
adding 'apache-beam-2.6.0.dev0/apache_beam/examples/wordcount_minimal_test.py'
adding 'apache-beam-2.6.0.dev0/apache_beam/examples/streaming_wordcount_it_test.py'
adding 'apache-beam-2.6.0.dev0/apache_beam/examples/wordcount_test.py'
adding 'apache-beam-2.6.0.dev0/apache_beam/examples/hourly_team_score_it_test.py'
adding 'apache-beam-2.6.0.dev0/apache_beam/examples/cookbook/bigquery_side_input_test.py'
adding 'apache-beam-2.6.0.dev0/apache_beam/examples/cookbook/bigquery_side_input.py'
adding 'apache-beam-2.6.0.dev0/apache_beam/examples/cookbook/bigquery_tornadoes_test.py'
adding 'apache-beam-2.6.0.dev0/apache_beam/examples/cookbook/multiple_output_pardo_test.py'
adding 'apache-beam-2.6.0.dev0/apache_beam/examples/cookbook/filters_test.py'
adding 'apache-beam-2.6.0.dev0/apache_beam/examples/cookbook/datastore_wordcount.py'
adding 'apache-beam-2.6.0.dev0/apache_beam/examples/cookbook/bigquery_tornadoes.py'
adding 'apache-beam-2.6.0.dev0/apache_beam/examples/cookbook/custom_ptransform_test.py'
adding 'apache-beam-2.6.0.dev0/apache_beam/examples/cookbook/group_with_coder_test.py'
adding 'apache-beam-2.6.0.dev0/apache_beam/examples/cookbook/bigquery_schema.py'
adding 'apache-beam-2.6.0.dev0/apache_beam/examples/cookbook/bigquery_tornadoes_it_test.py'
adding 'apache-beam-2.6.0.dev0/apache_beam/examples/cookbook/mergecontacts.py'
adding 'apache-beam-2.6.0.dev0/apache_beam/examples/cookbook/mergecontacts_test.py'
adding 'apache-beam-2.6.0.dev0/apache_beam/examples/cookbook/__init__.py'
adding 'apache-beam-2.6.0.dev0/apache_beam/examples/cookbook/group_with_coder.py'
adding 'apache-beam-2.6.0.dev0/apache_beam/examples/cookbook/custom_ptransform.py'
adding 'apache-beam-2.6.0.dev0/apache_beam/examples/cookbook/combiners_test.py'
adding 'apache-beam-2.6.0.dev0/apache_beam/examples/cookbook/coders_test.py'
adding 'apache-beam-2.6.0.dev0/apache_beam/examples/cookbook/coders.py'
adding 'apache-beam-2.6.0.dev0/apache_beam/examples/cookbook/filters.py'
adding 'apache-beam-2.6.0.dev0/apache_beam/examples/cookbook/multiple_output_pardo.py'
adding 'apache-beam-2.6.0.dev0/apache_beam/examples/snippets/snippets_test.py'
adding 'apache-beam-2.6.0.dev0/apache_beam/examples/snippets/snippets.py'
adding 'apache-beam-2.6.0.dev0/apache_beam/examples/snippets/__init__.py'
adding 'apache-beam-2.6.0.dev0/apache_beam/examples/complete/autocomplete_test.py'
adding 'apache-beam-2.6.0.dev0/apache_beam/examples/complete/estimate_pi.py'
adding 'apache-beam-2.6.0.dev0/apache_beam/examples/complete/tfidf.py'
adding 'apache-beam-2.6.0.dev0/apache_beam/examples/complete/tfidf_test.py'
adding 'apache-beam-2.6.0.dev0/apache_beam/examples/complete/autocomplete.py'
adding 'apache-beam-2.6.0.dev0/apache_beam/examples/complete/top_wikipedia_sessions_test.py'
adding 'apache-beam-2.6.0.dev0/apache_beam/examples/complete/__init__.py'
adding 'apache-beam-2.6.0.dev0/apache_beam/examples/complete/estimate_pi_test.py'
adding 'apache-beam-2.6.0.dev0/apache_beam/examples/complete/top_wikipedia_sessions.py'
adding 'apache-beam-2.6.0.dev0/apache_beam/examples/complete/game/user_score_test.py'
adding 'apache-beam-2.6.0.dev0/apache_beam/examples/complete/game/hourly_team_score_test.py'
adding 'apache-beam-2.6.0.dev0/apache_beam/examples/complete/game/leader_board_test.py'
adding 'apache-beam-2.6.0.dev0/apache_beam/examples/complete/game/hourly_team_score.py'
adding 'apache-beam-2.6.0.dev0/apache_beam/examples/complete/game/game_stats.py'
adding 'apache-beam-2.6.0.dev0/apache_beam/examples/complete/game/leader_board.py'
adding 'apache-beam-2.6.0.dev0/apache_beam/examples/complete/game/__init__.py'
adding 'apache-beam-2.6.0.dev0/apache_beam/examples/complete/game/user_score.py'
adding 'apache-beam-2.6.0.dev0/apache_beam/examples/complete/game/game_stats_test.py'
adding 'apache-beam-2.6.0.dev0/apache_beam/examples/complete/juliaset/setup.py'
adding 'apache-beam-2.6.0.dev0/apache_beam/examples/complete/juliaset/__init__.py'
adding 'apache-beam-2.6.0.dev0/apache_beam/examples/complete/juliaset/juliaset_main.py'
adding 'apache-beam-2.6.0.dev0/apache_beam/examples/complete/juliaset/juliaset/juliaset.py'
adding 'apache-beam-2.6.0.dev0/apache_beam/examples/complete/juliaset/juliaset/juliaset_test.py'
adding 'apache-beam-2.6.0.dev0/apache_beam/examples/complete/juliaset/juliaset/__init__.py'
adding 'apache-beam-2.6.0.dev0/apache_beam/portability/python_urns.py'
adding 'apache-beam-2.6.0.dev0/apache_beam/portability/__init__.py'
adding 'apache-beam-2.6.0.dev0/apache_beam/portability/common_urns.py'
adding 'apache-beam-2.6.0.dev0/apache_beam/portability/api/beam_fn_api_pb2_grpc.py'
adding 'apache-beam-2.6.0.dev0/apache_beam/portability/api/endpoints_pb2.py'
adding 'apache-beam-2.6.0.dev0/apache_beam/portability/api/beam_artifact_api_pb2.py'
adding 'apache-beam-2.6.0.dev0/apache_beam/portability/api/beam_provision_api_pb2.py'
adding 'apache-beam-2.6.0.dev0/apache_beam/portability/api/beam_provision_api_pb2_grpc.py'
adding 'apache-beam-2.6.0.dev0/apache_beam/portability/api/beam_job_api_pb2_grpc.py'
adding 'apache-beam-2.6.0.dev0/apache_beam/portability/api/beam_runner_api_pb2_grpc.py'
adding 'apache-beam-2.6.0.dev0/apache_beam/portability/api/endpoints_pb2_grpc.py'
adding 'apache-beam-2.6.0.dev0/apache_beam/portability/api/standard_window_fns_pb2.py'
adding 'apache-beam-2.6.0.dev0/apache_beam/portability/api/__init__.py'
adding 'apache-beam-2.6.0.dev0/apache_beam/portability/api/beam_fn_api_pb2.py'
adding 'apache-beam-2.6.0.dev0/apache_beam/portability/api/standard_window_fns_pb2_grpc.py'
adding 'apache-beam-2.6.0.dev0/apache_beam/portability/api/beam_job_api_pb2.py'
adding 'apache-beam-2.6.0.dev0/apache_beam/portability/api/beam_artifact_api_pb2_grpc.py'
adding 'apache-beam-2.6.0.dev0/apache_beam/portability/api/beam_runner_api_pb2.py'
Creating tar archive
removing 'apache-beam-2.6.0.dev0' (and everything under it)
sdist archive name: <https://builds.apache.org/job/beam_PostCommit_Py_ValCont/ws/src/sdks/python/build/apache-beam-2.6.0.dev0.tar.gz>

> Task :beam-sdks-python-container:copyDockerfileDependencies

> Task :beam-sdks-go:resolveBuildDependencies
Resolving golang.org/x/crypto: commit='d9133f5469342136e669e85192a26056b587f503', urls=[https://go.googlesource.com/crypto]
Resolving golang.org/x/debug: commit='95515998a8a4bd7448134b2cb5971dbeb12e0b77', urls=[https://go.googlesource.com/debug]
Resolving golang.org/x/net: commit='2fb46b16b8dda405028c50f7c7f0f9dd1fa6bfb1', urls=[https://go.googlesource.com/net]
Resolving golang.org/x/oauth2: commit='a032972e28060ca4f5644acffae3dfc268cc09db', urls=[https://go.googlesource.com/oauth2]
Resolving golang.org/x/sync: commit='fd80eb99c8f653c847d294a001bdf2a3a6f768f5', urls=[https://go.googlesource.com/sync]
Resolving golang.org/x/sys: commit='37707fdb30a5b38865cfb95e5aab41707daec7fd', urls=[https://go.googlesource.com/sys]
Resolving cached github.com/coreos/etcd: commit='11214aa33bf5a47d3d9d8dafe0f6b97237dfe921',
urls=[https://github.com/coreos/etcd.git, git@github.com:coreos/etcd.git]
Resolving cached github.com/coreos/etcd: commit='11214aa33bf5a47d3d9d8dafe0f6b97237dfe921',
urls=[https://github.com/coreos/etcd.git, git@github.com:coreos/etcd.git]
Resolving google.golang.org/api: commit='386d4e5f4f92f86e6aec85985761bba4b938a2d5', urls=[https://code.googlesource.com/google-api-go-client]
Resolving google.golang.org/genproto: commit='2b5a72b8730b0b16380010cfe5286c42108d88e7', urls=[https://github.com/google/go-genproto]
Resolving google.golang.org/grpc: commit='7646b5360d049a7ca31e9133315db43456f39e2e', urls=[https://github.com/grpc/grpc-go]
Resolving cached github.com/coreos/etcd: commit='11214aa33bf5a47d3d9d8dafe0f6b97237dfe921',
urls=[https://github.com/coreos/etcd.git, git@github.com:coreos/etcd.git]
Resolving cached github.com/coreos/etcd: commit='11214aa33bf5a47d3d9d8dafe0f6b97237dfe921',
urls=[https://github.com/coreos/etcd.git, git@github.com:coreos/etcd.git]

> Task :beam-sdks-go:installDependencies
> Task :beam-sdks-go:buildLinuxAmd64
> Task :beam-sdks-go:build

> Task :beam-sdks-python-container:resolveBuildDependencies
Resolving ./github.com/apache/beam/sdks/go@<https://builds.apache.org/job/beam_PostCommit_Py_ValCont/ws/src/sdks/go>

> Task :beam-sdks-python-container:installDependencies
> Task :beam-sdks-python-container:buildLinuxAmd64
> Task :beam-sdks-python-container:build
> Task :beam-sdks-python-container:dockerPrepare

> Task :beam-sdks-python-container:docker FAILED
Get https://registry-1.docker.io/v2/library/python/manifests/2-stretch: received unexpected
HTTP status: 503 Service Unavailable

FAILURE: Build failed with an exception.

* What went wrong:
Execution failed for task ':beam-sdks-python-container:docker'.
> Process 'command 'docker'' finished with non-zero exit value 1

* Try:
Run with --stacktrace option to get the stack trace. Run with --info or --debug option to
get more log output. Run with --scan to get full insights.

* Get more help at https://help.gradle.org

Deprecated Gradle features were used in this build, making it incompatible with Gradle 5.0.
See https://docs.gradle.org/4.8/userguide/command_line_interface.html#sec:command_line_warnings

BUILD FAILED in 2m 3s
16 actionable tasks: 15 executed, 1 up-to-date

Publishing build scan...
https://gradle.com/s/gwlzsz4wfedtm

Build step 'Execute shell' marked build as failure

Mime
View raw message