beam-commits mailing list archives

Site index · List index
Message view « Date » · « Thread »
Top « Date » · « Thread »
From Apache Jenkins Server <jenk...@builds.apache.org>
Subject Build failed in Jenkins: beam_PostCommit_Java_ValidatesRunner_Dataflow_Gradle #501
Date Thu, 14 Jun 2018 21:58:49 GMT
See <https://builds.apache.org/job/beam_PostCommit_Java_ValidatesRunner_Dataflow_Gradle/501/display/redirect?page=changes>

Changes:

[apilloud] [SQL] Make getString more generic

[apilloud] [SQL] Support unquoted table types

[jiangkai] call SqlFunctions in numeric type conversion

[jiangkai] unit test for BuildExpression literal casting

[fvoichick] Fixed link to nonexistent IsBounded.apply method

[fvoichick] Fixed documentation of default window size in example code

[fvoichick] Fixed inappropriate Javadoc comments

[aaltay] [BEAM-4333] Add integration tests for python mobile games (#5630)

------------------------------------------
[...truncated 54.73 MB...]
    	at com.google.cloud.dataflow.worker.BatchDataflowWorker.executeWork(BatchDataflowWorker.java:391)
    	at com.google.cloud.dataflow.worker.BatchDataflowWorker.doWork(BatchDataflowWorker.java:360)
    	at com.google.cloud.dataflow.worker.BatchDataflowWorker.getAndPerformWork(BatchDataflowWorker.java:288)
    	at com.google.cloud.dataflow.worker.DataflowBatchWorkerHarness$WorkerThread.doWork(DataflowBatchWorkerHarness.java:134)
    	at com.google.cloud.dataflow.worker.DataflowBatchWorkerHarness$WorkerThread.call(DataflowBatchWorkerHarness.java:114)
    	at com.google.cloud.dataflow.worker.DataflowBatchWorkerHarness$WorkerThread.call(DataflowBatchWorkerHarness.java:101)
    	at java.util.concurrent.FutureTask.run(FutureTask.java:266)
    	at java.util.concurrent.ThreadPoolExecutor.runWorker(ThreadPoolExecutor.java:1142)
    	at java.util.concurrent.ThreadPoolExecutor$Worker.run(ThreadPoolExecutor.java:617)
    	at java.lang.Thread.run(Thread.java:745)
    Caused by: org.apache.beam.sdk.util.UserCodeException: java.lang.AssertionError: OutputSideInputs/ParMultiDo(Anonymous).output:
org/hamcrest/Matchers
    	at org.apache.beam.sdk.util.UserCodeException.wrap(UserCodeException.java:36)
    	at org.apache.beam.sdk.testing.PAssert$DefaultConcludeFn$DoFnInvoker.invokeProcessElement(Unknown
Source)
    	at org.apache.beam.runners.core.SimpleDoFnRunner.invokeProcessElement(SimpleDoFnRunner.java:185)
    	at org.apache.beam.runners.core.SimpleDoFnRunner.processElement(SimpleDoFnRunner.java:149)
    	at com.google.cloud.dataflow.worker.SimpleParDoFn.processElement(SimpleParDoFn.java:323)
    	at com.google.cloud.dataflow.worker.util.common.worker.ParDoOperation.process(ParDoOperation.java:43)
    	at com.google.cloud.dataflow.worker.util.common.worker.OutputReceiver.process(OutputReceiver.java:48)
    	at com.google.cloud.dataflow.worker.SimpleParDoFn$1.output(SimpleParDoFn.java:271)
    	at org.apache.beam.runners.core.SimpleDoFnRunner.outputWindowedValue(SimpleDoFnRunner.java:219)
    	at org.apache.beam.runners.core.SimpleDoFnRunner.access$700(SimpleDoFnRunner.java:69)
    	at org.apache.beam.runners.core.SimpleDoFnRunner$DoFnProcessContext.output(SimpleDoFnRunner.java:517)
    	at org.apache.beam.runners.core.SimpleDoFnRunner$DoFnProcessContext.output(SimpleDoFnRunner.java:505)
    	at org.apache.beam.sdk.testing.PAssert$GroupedValuesCheckerDoFn.processElement(PAssert.java:1215)
    	at org.apache.beam.sdk.testing.PAssert$GroupedValuesCheckerDoFn$DoFnInvoker.invokeProcessElement(Unknown
Source)
    	at org.apache.beam.runners.core.SimpleDoFnRunner.invokeProcessElement(SimpleDoFnRunner.java:185)
    	at org.apache.beam.runners.core.SimpleDoFnRunner.processElement(SimpleDoFnRunner.java:149)
    	at com.google.cloud.dataflow.worker.SimpleParDoFn.processElement(SimpleParDoFn.java:323)
    	at com.google.cloud.dataflow.worker.util.common.worker.ParDoOperation.process(ParDoOperation.java:43)
    	at com.google.cloud.dataflow.worker.util.common.worker.OutputReceiver.process(OutputReceiver.java:48)
    	at com.google.cloud.dataflow.worker.SimpleParDoFn$1.output(SimpleParDoFn.java:271)
    	at org.apache.beam.runners.core.SimpleDoFnRunner.outputWindowedValue(SimpleDoFnRunner.java:219)
    	at org.apache.beam.runners.core.SimpleDoFnRunner.access$700(SimpleDoFnRunner.java:69)
    	at org.apache.beam.runners.core.SimpleDoFnRunner$DoFnProcessContext.output(SimpleDoFnRunner.java:517)
    	at org.apache.beam.sdk.transforms.DoFnOutputReceivers$WindowedContextOutputReceiver.output(DoFnOutputReceivers.java:42)
    	at org.apache.beam.sdk.transforms.MapElements$1.processElement(MapElements.java:131)
    	at org.apache.beam.sdk.transforms.MapElements$1$DoFnInvoker.invokeProcessElement(Unknown
Source)
    	at org.apache.beam.runners.core.SimpleDoFnRunner.invokeProcessElement(SimpleDoFnRunner.java:185)
    	at org.apache.beam.runners.core.SimpleDoFnRunner.processElement(SimpleDoFnRunner.java:149)
    	at com.google.cloud.dataflow.worker.SimpleParDoFn.processElement(SimpleParDoFn.java:323)
    	at com.google.cloud.dataflow.worker.util.common.worker.ParDoOperation.process(ParDoOperation.java:43)
    	at com.google.cloud.dataflow.worker.util.common.worker.OutputReceiver.process(OutputReceiver.java:48)
    	at com.google.cloud.dataflow.worker.SimpleParDoFn$1.output(SimpleParDoFn.java:271)
    	at org.apache.beam.runners.core.SimpleDoFnRunner.outputWindowedValue(SimpleDoFnRunner.java:219)
    	at org.apache.beam.runners.core.SimpleDoFnRunner.access$700(SimpleDoFnRunner.java:69)
    	at org.apache.beam.runners.core.SimpleDoFnRunner$DoFnProcessContext.output(SimpleDoFnRunner.java:517)
    	at org.apache.beam.runners.core.SimpleDoFnRunner$DoFnProcessContext.output(SimpleDoFnRunner.java:505)
    	at org.apache.beam.sdk.testing.PAssert$ConcatFn.processElement(PAssert.java:1049)
    	at org.apache.beam.sdk.testing.PAssert$ConcatFn$DoFnInvoker.invokeProcessElement(Unknown
Source)
    	at org.apache.beam.runners.core.SimpleDoFnRunner.invokeProcessElement(SimpleDoFnRunner.java:185)
    	at org.apache.beam.runners.core.SimpleDoFnRunner.processElement(SimpleDoFnRunner.java:149)
    	at com.google.cloud.dataflow.worker.SimpleParDoFn.processElement(SimpleParDoFn.java:323)
    	at com.google.cloud.dataflow.worker.util.common.worker.ParDoOperation.process(ParDoOperation.java:43)
    	at com.google.cloud.dataflow.worker.util.common.worker.OutputReceiver.process(OutputReceiver.java:48)
    	at com.google.cloud.dataflow.worker.SimpleParDoFn$1.output(SimpleParDoFn.java:271)
    	at org.apache.beam.runners.core.SimpleDoFnRunner.outputWindowedValue(SimpleDoFnRunner.java:219)
    	at org.apache.beam.runners.core.SimpleDoFnRunner.access$700(SimpleDoFnRunner.java:69)
    	at org.apache.beam.runners.core.SimpleDoFnRunner$DoFnProcessContext.output(SimpleDoFnRunner.java:517)
    	at org.apache.beam.sdk.transforms.DoFnOutputReceivers$WindowedContextOutputReceiver.output(DoFnOutputReceivers.java:42)
    	at org.apache.beam.sdk.transforms.MapElements$1.processElement(MapElements.java:131)
    	at org.apache.beam.sdk.transforms.MapElements$1$DoFnInvoker.invokeProcessElement(Unknown
Source)
    	at org.apache.beam.runners.core.SimpleDoFnRunner.invokeProcessElement(SimpleDoFnRunner.java:185)
    	at org.apache.beam.runners.core.SimpleDoFnRunner.processElement(SimpleDoFnRunner.java:149)
    	at com.google.cloud.dataflow.worker.SimpleParDoFn.processElement(SimpleParDoFn.java:323)
    	at com.google.cloud.dataflow.worker.util.common.worker.ParDoOperation.process(ParDoOperation.java:43)
    	at com.google.cloud.dataflow.worker.util.common.worker.OutputReceiver.process(OutputReceiver.java:48)
    	at com.google.cloud.dataflow.worker.GroupAlsoByWindowsParDoFn$1.output(GroupAlsoByWindowsParDoFn.java:181)
    	... 21 more
    Caused by: java.lang.AssertionError: OutputSideInputs/ParMultiDo(Anonymous).output: org/hamcrest/Matchers
    	at org.apache.beam.sdk.testing.PAssert$PAssertionSite.capture(PAssert.java:168)
    	at org.apache.beam.sdk.testing.PAssert.that(PAssert.java:378)
    	at org.apache.beam.sdk.testing.PAssert.that(PAssert.java:370)
    	at org.apache.beam.sdk.transforms.ViewTest.testSingletonSideInput(ViewTest.java:107)
    	at sun.reflect.NativeMethodAccessorImpl.invoke0(Native Method)
    	at sun.reflect.NativeMethodAccessorImpl.invoke(NativeMethodAccessorImpl.java:62)
    	at sun.reflect.DelegatingMethodAccessorImpl.invoke(DelegatingMethodAccessorImpl.java:43)
    	at java.lang.reflect.Method.invoke(Method.java:498)
    	at org.junit.runners.model.FrameworkMethod$1.runReflectiveCall(FrameworkMethod.java:50)
    	at org.junit.internal.runners.model.ReflectiveCallable.run(ReflectiveCallable.java:12)
    	at org.junit.runners.model.FrameworkMethod.invokeExplosively(FrameworkMethod.java:47)
    	at org.junit.internal.runners.statements.InvokeMethod.evaluate(InvokeMethod.java:17)
    	at org.apache.beam.sdk.testing.TestPipeline$1.evaluate(TestPipeline.java:317)
    	at org.junit.rules.ExpectedException$ExpectedExceptionStatement.evaluate(ExpectedException.java:239)
    	at org.junit.rules.RunRules.evaluate(RunRules.java:20)
    	at org.junit.runners.ParentRunner.runLeaf(ParentRunner.java:325)
    	at org.junit.runners.BlockJUnit4ClassRunner.runChild(BlockJUnit4ClassRunner.java:78)
    	at org.junit.runners.BlockJUnit4ClassRunner.runChild(BlockJUnit4ClassRunner.java:57)
    	at org.junit.runners.ParentRunner$3.run(ParentRunner.java:290)
    	at org.junit.runners.ParentRunner$1.schedule(ParentRunner.java:71)
    	at org.junit.runners.ParentRunner.runChildren(ParentRunner.java:288)
    	at org.junit.runners.ParentRunner.access$000(ParentRunner.java:58)
    	at org.junit.runners.ParentRunner$2.evaluate(ParentRunner.java:268)
    	at org.junit.runners.ParentRunner.run(ParentRunner.java:363)
    	at org.gradle.api.internal.tasks.testing.junit.JUnitTestClassExecutor.runTestClass(JUnitTestClassExecutor.java:106)
    	at org.gradle.api.internal.tasks.testing.junit.JUnitTestClassExecutor.execute(JUnitTestClassExecutor.java:58)
    	at org.gradle.api.internal.tasks.testing.junit.JUnitTestClassExecutor.execute(JUnitTestClassExecutor.java:38)
    	at org.gradle.api.internal.tasks.testing.junit.AbstractJUnitTestClassProcessor.processTestClass(AbstractJUnitTestClassProcessor.java:66)
    	at org.gradle.api.internal.tasks.testing.SuiteTestClassProcessor.processTestClass(SuiteTestClassProcessor.java:51)
    	at sun.reflect.NativeMethodAccessorImpl.invoke0(Native Method)
    	at sun.reflect.NativeMethodAccessorImpl.invoke(NativeMethodAccessorImpl.java:62)
    	at sun.reflect.DelegatingMethodAccessorImpl.invoke(DelegatingMethodAccessorImpl.java:43)
    	at java.lang.reflect.Method.invoke(Method.java:498)
    	at org.gradle.internal.dispatch.ReflectionDispatch.dispatch(ReflectionDispatch.java:35)
    	at org.gradle.internal.dispatch.ReflectionDispatch.dispatch(ReflectionDispatch.java:24)
    	at org.gradle.internal.dispatch.ContextClassLoaderDispatch.dispatch(ContextClassLoaderDispatch.java:32)
    	at org.gradle.internal.dispatch.ProxyDispatchAdapter$DispatchingInvocationHandler.invoke(ProxyDispatchAdapter.java:93)
    	at com.sun.proxy.$Proxy2.processTestClass(Unknown Source)
    	at org.gradle.api.internal.tasks.testing.worker.TestWorker.processTestClass(TestWorker.java:109)
    	at sun.reflect.NativeMethodAccessorImpl.invoke0(Native Method)
    	at sun.reflect.NativeMethodAccessorImpl.invoke(NativeMethodAccessorImpl.java:62)
    	at sun.reflect.DelegatingMethodAccessorImpl.invoke(DelegatingMethodAccessorImpl.java:43)
    	at java.lang.reflect.Method.invoke(Method.java:498)
    	at org.gradle.internal.dispatch.ReflectionDispatch.dispatch(ReflectionDispatch.java:35)
    	at org.gradle.internal.dispatch.ReflectionDispatch.dispatch(ReflectionDispatch.java:24)
    	at org.gradle.internal.remote.internal.hub.MessageHubBackedObjectConnection$DispatchWrapper.dispatch(MessageHubBackedObjectConnection.java:155)
    	at org.gradle.internal.remote.internal.hub.MessageHubBackedObjectConnection$DispatchWrapper.dispatch(MessageHubBackedObjectConnection.java:137)
    	at org.gradle.internal.remote.internal.hub.MessageHub$Handler.run(MessageHub.java:404)
    	at org.gradle.internal.concurrent.ExecutorPolicy$CatchAndRecordFailures.onExecute(ExecutorPolicy.java:63)
    	at org.gradle.internal.concurrent.ManagedExecutorImpl$1.run(ManagedExecutorImpl.java:46)
    	at java.util.concurrent.ThreadPoolExecutor.runWorker(ThreadPoolExecutor.java:1149)
    	at java.util.concurrent.ThreadPoolExecutor$Worker.run(ThreadPoolExecutor.java:624)
    	at org.gradle.internal.concurrent.ThreadFactoryImpl$ManagedThreadRunnable.run(ThreadFactoryImpl.java:55)
    Caused by: java.lang.NoClassDefFoundError: org/hamcrest/Matchers
    	at org.apache.beam.sdk.testing.PAssert$AssertContainsInAnyOrder.apply(PAssert.java:1322)
    	at org.apache.beam.sdk.testing.PAssert$AssertContainsInAnyOrder.apply(PAssert.java:1301)
    	at org.apache.beam.sdk.testing.PAssert$CheckRelationAgainstExpected.apply(PAssert.java:966)
    	at org.apache.beam.sdk.testing.PAssert$CheckRelationAgainstExpected.apply(PAssert.java:946)
    	at org.apache.beam.sdk.testing.PAssert.doChecks(PAssert.java:1250)
    	at org.apache.beam.sdk.testing.PAssert$GroupedValuesCheckerDoFn.processElement(PAssert.java:1215)
    	at org.apache.beam.sdk.testing.PAssert$GroupedValuesCheckerDoFn$DoFnInvoker.invokeProcessElement(Unknown
Source)
    	at org.apache.beam.runners.core.SimpleDoFnRunner.invokeProcessElement(SimpleDoFnRunner.java:185)
    	at org.apache.beam.runners.core.SimpleDoFnRunner.processElement(SimpleDoFnRunner.java:149)
    	at com.google.cloud.dataflow.worker.SimpleParDoFn.processElement(SimpleParDoFn.java:323)
    	at com.google.cloud.dataflow.worker.util.common.worker.ParDoOperation.process(ParDoOperation.java:43)
    	at com.google.cloud.dataflow.worker.util.common.worker.OutputReceiver.process(OutputReceiver.java:48)
    	at com.google.cloud.dataflow.worker.SimpleParDoFn$1.output(SimpleParDoFn.java:271)
    	at org.apache.beam.runners.core.SimpleDoFnRunner.outputWindowedValue(SimpleDoFnRunner.java:219)
    	at org.apache.beam.runners.core.SimpleDoFnRunner.access$700(SimpleDoFnRunner.java:69)
    	at org.apache.beam.runners.core.SimpleDoFnRunner$DoFnProcessContext.output(SimpleDoFnRunner.java:517)
    	at org.apache.beam.sdk.transforms.DoFnOutputReceivers$WindowedContextOutputReceiver.output(DoFnOutputReceivers.java:42)
    	at org.apache.beam.sdk.transforms.MapElements$1.processElement(MapElements.java:131)
    	at org.apache.beam.sdk.transforms.MapElements$1$DoFnInvoker.invokeProcessElement(Unknown
Source)
    	at org.apache.beam.runners.core.SimpleDoFnRunner.invokeProcessElement(SimpleDoFnRunner.java:185)
    	at org.apache.beam.runners.core.SimpleDoFnRunner.processElement(SimpleDoFnRunner.java:149)
    	at com.google.cloud.dataflow.worker.SimpleParDoFn.processElement(SimpleParDoFn.java:323)
    	at com.google.cloud.dataflow.worker.util.common.worker.ParDoOperation.process(ParDoOperation.java:43)
    	at com.google.cloud.dataflow.worker.util.common.worker.OutputReceiver.process(OutputReceiver.java:48)
    	at com.google.cloud.dataflow.worker.SimpleParDoFn$1.output(SimpleParDoFn.java:271)
    	at org.apache.beam.runners.core.SimpleDoFnRunner.outputWindowedValue(SimpleDoFnRunner.java:219)
    	at org.apache.beam.runners.core.SimpleDoFnRunner.access$700(SimpleDoFnRunner.java:69)
    	at org.apache.beam.runners.core.SimpleDoFnRunner$DoFnProcessContext.output(SimpleDoFnRunner.java:517)
    	at org.apache.beam.runners.core.SimpleDoFnRunner$DoFnProcessContext.output(SimpleDoFnRunner.java:505)
    	at org.apache.beam.sdk.testing.PAssert$ConcatFn.processElement(PAssert.java:1049)
    	at org.apache.beam.sdk.testing.PAssert$ConcatFn$DoFnInvoker.invokeProcessElement(Unknown
Source)
    	at org.apache.beam.runners.core.SimpleDoFnRunner.invokeProcessElement(SimpleDoFnRunner.java:185)
    	at org.apache.beam.runners.core.SimpleDoFnRunner.processElement(SimpleDoFnRunner.java:149)
    	at com.google.cloud.dataflow.worker.SimpleParDoFn.processElement(SimpleParDoFn.java:323)
    	at com.google.cloud.dataflow.worker.util.common.worker.ParDoOperation.process(ParDoOperation.java:43)
    	at com.google.cloud.dataflow.worker.util.common.worker.OutputReceiver.process(OutputReceiver.java:48)
    	at com.google.cloud.dataflow.worker.SimpleParDoFn$1.output(SimpleParDoFn.java:271)
    	at org.apache.beam.runners.core.SimpleDoFnRunner.outputWindowedValue(SimpleDoFnRunner.java:219)
    	at org.apache.beam.runners.core.SimpleDoFnRunner.access$700(SimpleDoFnRunner.java:69)
    	at org.apache.beam.runners.core.SimpleDoFnRunner$DoFnProcessContext.output(SimpleDoFnRunner.java:517)
    	at org.apache.beam.sdk.transforms.DoFnOutputReceivers$WindowedContextOutputReceiver.output(DoFnOutputReceivers.java:42)
    	at org.apache.beam.sdk.transforms.MapElements$1.processElement(MapElements.java:131)
    	at org.apache.beam.sdk.transforms.MapElements$1$DoFnInvoker.invokeProcessElement(Unknown
Source)
    	at org.apache.beam.runners.core.SimpleDoFnRunner.invokeProcessElement(SimpleDoFnRunner.java:185)
    	at org.apache.beam.runners.core.SimpleDoFnRunner.processElement(SimpleDoFnRunner.java:149)
    	at com.google.cloud.dataflow.worker.SimpleParDoFn.processElement(SimpleParDoFn.java:323)
    	at com.google.cloud.dataflow.worker.util.common.worker.ParDoOperation.process(ParDoOperation.java:43)
    	at com.google.cloud.dataflow.worker.util.common.worker.OutputReceiver.process(OutputReceiver.java:48)
    	at com.google.cloud.dataflow.worker.GroupAlsoByWindowsParDoFn$1.output(GroupAlsoByWindowsParDoFn.java:181)
    	at com.google.cloud.dataflow.worker.GroupAlsoByWindowFnRunner$1.outputWindowedValue(GroupAlsoByWindowFnRunner.java:102)
    	at com.google.cloud.dataflow.worker.util.BatchGroupAlsoByWindowViaIteratorsFn.processElement(BatchGroupAlsoByWindowViaIteratorsFn.java:124)
    	at com.google.cloud.dataflow.worker.util.BatchGroupAlsoByWindowViaIteratorsFn.processElement(BatchGroupAlsoByWindowViaIteratorsFn.java:53)
    	at com.google.cloud.dataflow.worker.GroupAlsoByWindowFnRunner.invokeProcessElement(GroupAlsoByWindowFnRunner.java:115)
    	at com.google.cloud.dataflow.worker.GroupAlsoByWindowFnRunner.processElement(GroupAlsoByWindowFnRunner.java:73)
    	at com.google.cloud.dataflow.worker.GroupAlsoByWindowsParDoFn.processElement(GroupAlsoByWindowsParDoFn.java:113)
    	at com.google.cloud.dataflow.worker.util.common.worker.ParDoOperation.process(ParDoOperation.java:43)
    	at com.google.cloud.dataflow.worker.util.common.worker.OutputReceiver.process(OutputReceiver.java:48)
    	at com.google.cloud.dataflow.worker.util.common.worker.ReadOperation.runReadLoop(ReadOperation.java:200)
    	at com.google.cloud.dataflow.worker.util.common.worker.ReadOperation.start(ReadOperation.java:158)
    	at com.google.cloud.dataflow.worker.util.common.worker.MapTaskExecutor.execute(MapTaskExecutor.java:75)
    	at com.google.cloud.dataflow.worker.BatchDataflowWorker.executeWork(BatchDataflowWorker.java:391)
    	at com.google.cloud.dataflow.worker.BatchDataflowWorker.doWork(BatchDataflowWorker.java:360)
    	at com.google.cloud.dataflow.worker.BatchDataflowWorker.getAndPerformWork(BatchDataflowWorker.java:288)
    	at com.google.cloud.dataflow.worker.DataflowBatchWorkerHarness$WorkerThread.doWork(DataflowBatchWorkerHarness.java:134)
    	at com.google.cloud.dataflow.worker.DataflowBatchWorkerHarness$WorkerThread.call(DataflowBatchWorkerHarness.java:114)
    	at com.google.cloud.dataflow.worker.DataflowBatchWorkerHarness$WorkerThread.call(DataflowBatchWorkerHarness.java:101)
    	at java.util.concurrent.FutureTask.run(FutureTask.java:266)
    	at java.util.concurrent.ThreadPoolExecutor.runWorker(ThreadPoolExecutor.java:1142)
    	at java.util.concurrent.ThreadPoolExecutor$Worker.run(ThreadPoolExecutor.java:617)
    	at java.lang.Thread.run(Thread.java:745)
    Workflow failed. Causes: S16:PAssert$33/GroupGlobally/GroupDummyAndContents/Read+PAssert$33/GroupGlobally/GroupDummyAndContents/GroupByWindow+PAssert$33/GroupGlobally/Values/Values/Map+PAssert$33/GroupGlobally/ParDo(Concat)+PAssert$33/GetPane/Map+PAssert$33/RunChecks+PAssert$33/VerifyAssertions/ParDo(DefaultConclude)
failed., A work item was attempted 4 times without success. Each time the worker eventually
lost contact with the service. The work item was attempted on: 
      viewtest0testsingletonsid-06141454-4m5c-harness-wgpc,
      viewtest0testsingletonsid-06141454-4m5c-harness-wgpc,
      viewtest0testsingletonsid-06141454-4m5c-harness-wgpc,
      viewtest0testsingletonsid-06141454-4m5c-harness-wgpc
        at org.apache.beam.runners.dataflow.TestDataflowRunner.run(TestDataflowRunner.java:134)
        at org.apache.beam.runners.dataflow.TestDataflowRunner.run(TestDataflowRunner.java:90)
        at org.apache.beam.runners.dataflow.TestDataflowRunner.run(TestDataflowRunner.java:55)
        at org.apache.beam.sdk.Pipeline.run(Pipeline.java:311)
        at org.apache.beam.sdk.testing.TestPipeline.run(TestPipeline.java:348)
        at org.apache.beam.sdk.testing.TestPipeline.run(TestPipeline.java:329)
        at org.apache.beam.sdk.transforms.ViewTest.testSingletonSideInput(ViewTest.java:109)

Gradle Test Executor 37 finished executing tests.

> Task :beam-runners-google-cloud-dataflow-java:validatesRunnerTest

209 tests completed, 190 failed, 2 skipped
Finished generating test XML results (1.159 secs) into: <https://builds.apache.org/job/beam_PostCommit_Java_ValidatesRunner_Dataflow_Gradle/ws/src/runners/google-cloud-dataflow-java/build/test-results/validatesRunnerTest>
Generating HTML test report...
Finished generating test html results (1.145 secs) into: <https://builds.apache.org/job/beam_PostCommit_Java_ValidatesRunner_Dataflow_Gradle/ws/src/runners/google-cloud-dataflow-java/build/reports/tests/validatesRunnerTest>

> Task :beam-runners-google-cloud-dataflow-java:validatesRunnerTest FAILED
:beam-runners-google-cloud-dataflow-java:validatesRunnerTest (Thread[Task worker for ':' Thread
35,5,main]) completed. Took 2 hrs 41 mins 8.759 secs.

FAILURE: Build failed with an exception.

* What went wrong:
Execution failed for task ':beam-runners-google-cloud-dataflow-java:validatesRunnerTest'.
> There were failing tests. See the report at: file://<https://builds.apache.org/job/beam_PostCommit_Java_ValidatesRunner_Dataflow_Gradle/ws/src/runners/google-cloud-dataflow-java/build/reports/tests/validatesRunnerTest/index.html>

* Try:
Run with --stacktrace option to get the stack trace. Run with --debug option to get more log
output. Run with --scan to get full insights.

* Get more help at https://help.gradle.org

Deprecated Gradle features were used in this build, making it incompatible with Gradle 5.0.
See https://docs.gradle.org/4.8/userguide/command_line_interface.html#sec:command_line_warnings

BUILD FAILED in 2h 42m 26s
38 actionable tasks: 35 executed, 3 from cache

Publishing build scan...
https://gradle.com/s/tjwqjvhhov4zy

Build step 'Invoke Gradle script' changed build result to FAILURE
Build step 'Invoke Gradle script' marked build as failure
Recording test results
Not sending mail to unregistered user apilloud@google.com
Not sending mail to unregistered user robbe.sneyders@ml6.eu
Not sending mail to unregistered user github@alasdairhodge.co.uk
Not sending mail to unregistered user aaltay@gmail.com
Not sending mail to unregistered user swegner@google.com
Not sending mail to unregistered user robinyq@rodete-desktop-imager.corp.google.com
Not sending mail to unregistered user jiangkai@gmail.com
Not sending mail to unregistered user fvoichick@gmail.com

Mime
View raw message