beam-commits mailing list archives

Site index · List index
Message view « Date » · « Thread »
Top « Date » · « Thread »
From Apache Jenkins Server <jenk...@builds.apache.org>
Subject Build failed in Jenkins: beam_PreCommit_Python_Cron #34
Date Thu, 28 Jun 2018 18:29:27 GMT
See <https://builds.apache.org/job/beam_PreCommit_Python_Cron/34/display/redirect?page=changes>

Changes:

[robertwb] [BEAM-4285] Extend side input handlers to handle multiple access

[robertwb] Rename several MultimapSideInput* classes to more generic SideInput*.

------------------------------------------
Started by GitHub push by jkff
[EnvInject] - Loading node environment variables.
Building remotely on beam15 (beam) in workspace <https://builds.apache.org/job/beam_PreCommit_Python_Cron/ws/>
Cloning the remote Git repository
Cloning repository https://github.com/apache/beam.git
 > git init <https://builds.apache.org/job/beam_PreCommit_Python_Cron/ws/src> # timeout=10
Fetching upstream changes from https://github.com/apache/beam.git
 > git --version # timeout=10
 > git fetch --tags --progress https://github.com/apache/beam.git +refs/heads/*:refs/remotes/origin/*
 > git config remote.origin.url https://github.com/apache/beam.git # timeout=10
 > git config --add remote.origin.fetch +refs/heads/*:refs/remotes/origin/* # timeout=10
 > git config remote.origin.url https://github.com/apache/beam.git # timeout=10
Fetching upstream changes from https://github.com/apache/beam.git
 > git fetch --tags --progress https://github.com/apache/beam.git +refs/heads/*:refs/remotes/origin/*
+refs/pull/${ghprbPullId}/*:refs/remotes/origin/pr/${ghprbPullId}/*
 > git rev-parse origin/master^{commit} # timeout=10
Checking out Revision 06887741135cfbf93e82bd7f22670d22fa938d1b (origin/master)
 > git config core.sparsecheckout # timeout=10
 > git checkout -f 06887741135cfbf93e82bd7f22670d22fa938d1b
Commit message: "Merge pull request #5814:  [BEAM-4285] Extend side input handlers to handle
multiple access patterns."
 > git rev-list --no-walk 279a05604b83a54e8e5a79e13d8761f94841f326 # timeout=10
Cleaning workspace
 > git rev-parse --verify HEAD # timeout=10
Resetting working tree
 > git reset --hard # timeout=10
 > git clean -fdx # timeout=10
[EnvInject] - Executing scripts and injecting environment variables after the SCM step.
[EnvInject] - Injecting as environment variables the properties content 
SPARK_LOCAL_IP=127.0.0.1

[EnvInject] - Variables injected successfully.
[Gradle] - Launching build.
[src] $ <https://builds.apache.org/job/beam_PreCommit_Python_Cron/ws/src/gradlew> --info
--continue --max-workers=16 -Dorg.gradle.jvmargs=-Xmx3328m :beam-website:setupJenkins :websitePreCommit
Initialized native services in: /home/jenkins/.gradle/native
To honour the JVM settings for this build a new JVM will be forked. Please consider using
the daemon: https://docs.gradle.org/4.8/userguide/gradle_daemon.html.
Starting process 'Gradle build daemon'. Working directory: /home/jenkins/.gradle/daemon/4.8
Command: /usr/local/asfpackages/java/jdk1.8.0_152/bin/java -Xmx3328m -Dfile.encoding=UTF-8
-Duser.country=US -Duser.language=en -Duser.variant -cp /home/jenkins/.gradle/wrapper/dists/gradle-4.8-bin/divx0s2uj4thofgytb7gf9fsi/gradle-4.8/lib/gradle-launcher-4.8.jar
org.gradle.launcher.daemon.bootstrap.GradleDaemon 4.8
Successfully started process 'Gradle build daemon'
An attempt to start the daemon took 0.756 secs.
The client will now receive all logging from the daemon (pid: 6346). The daemon log file:
/home/jenkins/.gradle/daemon/4.8/daemon-6346.out.log
Closing daemon's stdin at end of input.
The daemon will no longer process any standard input.
Daemon will be stopped at the end of the build stopping after processing
Using 16 worker leases.
Starting Build
Parallel execution is an incubating feature.

> Configure project :buildSrc
Evaluating project ':buildSrc' using build file '<https://builds.apache.org/job/beam_PreCommit_Python_Cron/ws/src/buildSrc/build.gradle'.>
file or directory '<https://builds.apache.org/job/beam_PreCommit_Python_Cron/ws/src/buildSrc/src/test/groovy',>
not found
Selected primary task 'build' from project :
file or directory '<https://builds.apache.org/job/beam_PreCommit_Python_Cron/ws/src/buildSrc/src/test/groovy',>
not found
Using local directory build cache for build ':buildSrc' (location = /home/jenkins/.gradle/caches/build-cache-1,
removeUnusedEntriesAfter = 7 days).
:compileJava (Thread[Task worker for ':buildSrc' Thread 7,5,main]) started.

> Task :buildSrc:compileJava NO-SOURCE
file or directory '<https://builds.apache.org/job/beam_PreCommit_Python_Cron/ws/src/buildSrc/src/main/java',>
not found
Skipping task ':buildSrc:compileJava' as it has no source files and no previous output files.
:compileJava (Thread[Task worker for ':buildSrc' Thread 7,5,main]) completed. Took 0.014 secs.
:compileGroovy (Thread[Task worker for ':buildSrc' Thread 7,5,main]) started.

> Task :buildSrc:compileGroovy FROM-CACHE
Build cache key for task ':buildSrc:compileGroovy' is 438bb70aa77fad76d8676056acd3da84
Task ':buildSrc:compileGroovy' is not up-to-date because:
  No history is available.
Origin for task ':buildSrc:compileGroovy': {executionTime=4056, hostName=apache-beam-jenkins-slave-group-lbw6,
operatingSystem=Linux, buildInvocationId=ut27ik332jfkpgmw4ete3o5twa, creationTime=1530138584497,
type=org.gradle.api.tasks.compile.GroovyCompile_Decorated, userName=jenkins, gradleVersion=4.8,
rootPath=/home/jenkins/jenkins-slave/workspace/beam_PreCommit_Go_Commit/src/buildSrc, path=:compileGroovy}
Unpacked output for task ':buildSrc:compileGroovy' from cache.
:compileGroovy (Thread[Task worker for ':buildSrc' Thread 7,5,main]) completed. Took 1.957
secs.
:processResources (Thread[Task worker for ':buildSrc' Thread 7,5,main]) started.

> Task :buildSrc:processResources NO-SOURCE
file or directory '<https://builds.apache.org/job/beam_PreCommit_Python_Cron/ws/src/buildSrc/src/main/resources',>
not found
Skipping task ':buildSrc:processResources' as it has no source files and no previous output
files.
:processResources (Thread[Task worker for ':buildSrc' Thread 7,5,main]) completed. Took 0.001
secs.
:classes (Thread[Task worker for ':buildSrc' Thread 7,5,main]) started.

> Task :buildSrc:classes UP-TO-DATE
Skipping task ':buildSrc:classes' as it has no actions.
:classes (Thread[Task worker for ':buildSrc' Thread 7,5,main]) completed. Took 0.001 secs.
:jar (Thread[Task worker for ':buildSrc' Thread 7,5,main]) started.

> Task :buildSrc:jar
Build cache key for task ':buildSrc:jar' is fd82019e45020846439af78dd3cf9f9b
Caching disabled for task ':buildSrc:jar': Caching has not been enabled for the task
Task ':buildSrc:jar' is not up-to-date because:
  No history is available.
:jar (Thread[Task worker for ':buildSrc' Thread 7,5,main]) completed. Took 0.099 secs.
:assemble (Thread[Task worker for ':buildSrc' Thread 7,5,main]) started.

> Task :buildSrc:assemble
Skipping task ':buildSrc:assemble' as it has no actions.
:assemble (Thread[Task worker for ':buildSrc' Thread 7,5,main]) completed. Took 0.0 secs.
:spotlessGroovy (Thread[Task worker for ':buildSrc' Thread 7,5,main]) started.

> Task :buildSrc:spotlessGroovy
file or directory '<https://builds.apache.org/job/beam_PreCommit_Python_Cron/ws/src/buildSrc/src/test/groovy',>
not found
file or directory '<https://builds.apache.org/job/beam_PreCommit_Python_Cron/ws/src/buildSrc/src/test/groovy',>
not found
file or directory '<https://builds.apache.org/job/beam_PreCommit_Python_Cron/ws/src/buildSrc/src/test/groovy',>
not found
Caching disabled for task ':buildSrc:spotlessGroovy': Caching has not been enabled for the
task
Task ':buildSrc:spotlessGroovy' is not up-to-date because:
  No history is available.
All input files are considered out-of-date for incremental task ':buildSrc:spotlessGroovy'.
file or directory '<https://builds.apache.org/job/beam_PreCommit_Python_Cron/ws/src/buildSrc/src/test/groovy',>
not found
:spotlessGroovy (Thread[Task worker for ':buildSrc' Thread 7,5,main]) completed. Took 1.106
secs.
:spotlessGroovyCheck (Thread[Task worker for ':buildSrc' Thread 7,5,main]) started.

> Task :buildSrc:spotlessGroovyCheck
Skipping task ':buildSrc:spotlessGroovyCheck' as it has no actions.
:spotlessGroovyCheck (Thread[Task worker for ':buildSrc' Thread 7,5,main]) completed. Took
0.0 secs.
:spotlessGroovyGradle (Thread[Task worker for ':buildSrc' Thread 7,5,main]) started.

> Task :buildSrc:spotlessGroovyGradle
Caching disabled for task ':buildSrc:spotlessGroovyGradle': Caching has not been enabled for
the task
Task ':buildSrc:spotlessGroovyGradle' is not up-to-date because:
  No history is available.
All input files are considered out-of-date for incremental task ':buildSrc:spotlessGroovyGradle'.
:spotlessGroovyGradle (Thread[Task worker for ':buildSrc' Thread 7,5,main]) completed. Took
0.025 secs.
:spotlessGroovyGradleCheck (Thread[Task worker for ':buildSrc' Thread 7,5,main]) started.

> Task :buildSrc:spotlessGroovyGradleCheck
Skipping task ':buildSrc:spotlessGroovyGradleCheck' as it has no actions.
:spotlessGroovyGradleCheck (Thread[Task worker for ':buildSrc' Thread 7,5,main]) completed.
Took 0.0 secs.
:spotlessCheck (Thread[Task worker for ':buildSrc' Thread 7,5,main]) started.

> Task :buildSrc:spotlessCheck
Skipping task ':buildSrc:spotlessCheck' as it has no actions.
:spotlessCheck (Thread[Task worker for ':buildSrc' Thread 7,5,main]) completed. Took 0.0 secs.
:compileTestJava (Thread[Task worker for ':buildSrc' Thread 7,5,main]) started.

> Task :buildSrc:compileTestJava NO-SOURCE
file or directory '<https://builds.apache.org/job/beam_PreCommit_Python_Cron/ws/src/buildSrc/src/test/java',>
not found
Skipping task ':buildSrc:compileTestJava' as it has no source files and no previous output
files.
:compileTestJava (Thread[Task worker for ':buildSrc' Thread 7,5,main]) completed. Took 0.002
secs.
:compileTestGroovy (Thread[Task worker for ':buildSrc' Thread 7,5,main]) started.

> Task :buildSrc:compileTestGroovy NO-SOURCE
file or directory '<https://builds.apache.org/job/beam_PreCommit_Python_Cron/ws/src/buildSrc/src/test/groovy',>
not found
Skipping task ':buildSrc:compileTestGroovy' as it has no source files and no previous output
files.
:compileTestGroovy (Thread[Task worker for ':buildSrc' Thread 7,5,main]) completed. Took 0.001
secs.
:processTestResources (Thread[Task worker for ':buildSrc' Thread 7,5,main]) started.

> Task :buildSrc:processTestResources NO-SOURCE
file or directory '<https://builds.apache.org/job/beam_PreCommit_Python_Cron/ws/src/buildSrc/src/test/resources',>
not found
Skipping task ':buildSrc:processTestResources' as it has no source files and no previous output
files.
:processTestResources (Thread[Task worker for ':buildSrc' Thread 7,5,main]) completed. Took
0.001 secs.
:testClasses (Thread[Task worker for ':buildSrc' Thread 7,5,main]) started.

> Task :buildSrc:testClasses UP-TO-DATE
Skipping task ':buildSrc:testClasses' as it has no actions.
:testClasses (Thread[Task worker for ':buildSrc' Thread 7,5,main]) completed. Took 0.0 secs.
:test (Thread[Task worker for ':buildSrc' Thread 7,5,main]) started.

> Task :buildSrc:test NO-SOURCE
Skipping task ':buildSrc:test' as it has no source files and no previous output files.
:test (Thread[Task worker for ':buildSrc' Thread 7,5,main]) completed. Took 0.003 secs.
:check (Thread[Task worker for ':buildSrc' Thread 7,5,main]) started.

> Task :buildSrc:check
Skipping task ':buildSrc:check' as it has no actions.
:check (Thread[Task worker for ':buildSrc' Thread 7,5,main]) completed. Took 0.0 secs.
:build (Thread[Task worker for ':buildSrc' Thread 7,5,main]) started.

> Task :buildSrc:build
Skipping task ':buildSrc:build' as it has no actions.
:build (Thread[Task worker for ':buildSrc' Thread 7,5,main]) completed. Took 0.0 secs.
Settings evaluated using settings file '<https://builds.apache.org/job/beam_PreCommit_Python_Cron/ws/src/settings.gradle'.>
Using local directory build cache for the root build (location = /home/jenkins/.gradle/caches/build-cache-1,
removeUnusedEntriesAfter = 7 days).
Projects loaded. Root project using build file '<https://builds.apache.org/job/beam_PreCommit_Python_Cron/ws/src/build.gradle'.>
Included projects: [root project 'beam', project ':beam-examples-java', project ':beam-model-fn-execution',
project ':beam-model-job-management', project ':beam-model-pipeline', project ':beam-runners-apex',
project ':beam-runners-core-construction-java', project ':beam-runners-core-java', project
':beam-runners-direct-java', project ':beam-runners-extensions-java-metrics', project ':beam-runners-flink_2.11',
project ':beam-runners-flink_2.11-job-server', project ':beam-runners-gcp-gcemd', project
':beam-runners-gcp-gcsproxy', project ':beam-runners-gearpump', project ':beam-runners-google-cloud-dataflow-java',
project ':beam-runners-java-fn-execution', project ':beam-runners-local-java-core', project
':beam-runners-reference-java', project ':beam-runners-samza', project ':beam-runners-spark',
project ':beam-sdks-go', project ':beam-sdks-go-container', project ':beam-sdks-go-examples',
project ':beam-sdks-go-test', project ':beam-sdks-java-build-tools', project ':beam-sdks-java-container',
project ':beam-sdks-java-core', project ':beam-sdks-java-extensions-google-cloud-platform-core',
project ':beam-sdks-java-extensions-join-library', project ':beam-sdks-java-extensions-json-jackson',
project ':beam-sdks-java-extensions-protobuf', project ':beam-sdks-java-extensions-sketching',
project ':beam-sdks-java-extensions-sorter', project ':beam-sdks-java-extensions-sql', project
':beam-sdks-java-extensions-sql-jdbc', project ':beam-sdks-java-extensions-sql-shell', project
':beam-sdks-java-fn-execution', project ':beam-sdks-java-harness', project ':beam-sdks-java-io-amazon-web-services',
project ':beam-sdks-java-io-amqp', project ':beam-sdks-java-io-cassandra', project ':beam-sdks-java-io-common',
project ':beam-sdks-java-io-elasticsearch', project ':beam-sdks-java-io-elasticsearch-tests-2',
project ':beam-sdks-java-io-elasticsearch-tests-5', project ':beam-sdks-java-io-elasticsearch-tests-common',
project ':beam-sdks-java-io-file-based-io-tests', project ':beam-sdks-java-io-google-cloud-platform',
project ':beam-sdks-java-io-hadoop-common', project ':beam-sdks-java-io-hadoop-file-system',
project ':beam-sdks-java-io-hadoop-input-format', project ':beam-sdks-java-io-hbase', project
':beam-sdks-java-io-hcatalog', project ':beam-sdks-java-io-jdbc', project ':beam-sdks-java-io-jms',
project ':beam-sdks-java-io-kafka', project ':beam-sdks-java-io-kinesis', project ':beam-sdks-java-io-mongodb',
project ':beam-sdks-java-io-mqtt', project ':beam-sdks-java-io-parquet', project ':beam-sdks-java-io-redis',
project ':beam-sdks-java-io-solr', project ':beam-sdks-java-io-tika', project ':beam-sdks-java-io-xml',
project ':beam-sdks-java-javadoc', project ':beam-sdks-java-maven-archetypes-examples', project
':beam-sdks-java-maven-archetypes-starter', project ':beam-sdks-java-nexmark', project ':beam-sdks-python',
project ':beam-sdks-python-container', project ':release', project ':runners', project ':runners:google-cloud-dataflow-java',
project ':runners:google-cloud-dataflow-java:examples', project ':runners:google-cloud-dataflow-java:examples-streaming']
Parallel execution with configuration on demand is an incubating feature.

> Configure project :
Evaluating root project 'beam' using build file '<https://builds.apache.org/job/beam_PreCommit_Python_Cron/ws/src/build.gradle'.>
Offline dependencies root configured at 'offline-repository'
Adding 48 .gitignore exclusions to Apache Rat

FAILURE: Build failed with an exception.

* What went wrong:
Project 'beam-website' not found in root project 'beam'.

* Try:
Run with --stacktrace option to get the stack trace. Run with --debug option to get more log
output. Run with --scan to get full insights.

* Get more help at https://help.gradle.org

Deprecated Gradle features were used in this build, making it incompatible with Gradle 5.0.
See https://docs.gradle.org/4.8/userguide/command_line_interface.html#sec:command_line_warnings

BUILD FAILED in 9s

Publishing build scan...
https://gradle.com/s/xadam267nq7z6

Build step 'Invoke Gradle script' changed build result to FAILURE
Build step 'Invoke Gradle script' marked build as failure

Mime
View raw message