beam-commits mailing list archives

Site index · List index
Message view « Date » · « Thread »
Top « Date » · « Thread »
From Apache Jenkins Server <jenk...@builds.apache.org>
Subject Build failed in Jenkins: beam_PostCommit_Py_ValCont #95
Date Sun, 24 Jun 2018 12:44:53 GMT
See <https://builds.apache.org/job/beam_PostCommit_Py_ValCont/95/display/redirect>

------------------------------------------
[...truncated 144.62 KB...]
copying apache_beam/runners/direct/transform_evaluator.py -> apache-beam-2.6.0.dev0/apache_beam/runners/direct
copying apache_beam/runners/direct/util.py -> apache-beam-2.6.0.dev0/apache_beam/runners/direct
copying apache_beam/runners/direct/watermark_manager.py -> apache-beam-2.6.0.dev0/apache_beam/runners/direct
copying apache_beam/runners/experimental/__init__.py -> apache-beam-2.6.0.dev0/apache_beam/runners/experimental
copying apache_beam/runners/experimental/python_rpc_direct/__init__.py -> apache-beam-2.6.0.dev0/apache_beam/runners/experimental/python_rpc_direct
copying apache_beam/runners/experimental/python_rpc_direct/python_rpc_direct_runner.py ->
apache-beam-2.6.0.dev0/apache_beam/runners/experimental/python_rpc_direct
copying apache_beam/runners/experimental/python_rpc_direct/server.py -> apache-beam-2.6.0.dev0/apache_beam/runners/experimental/python_rpc_direct
copying apache_beam/runners/job/__init__.py -> apache-beam-2.6.0.dev0/apache_beam/runners/job
copying apache_beam/runners/job/manager.py -> apache-beam-2.6.0.dev0/apache_beam/runners/job
copying apache_beam/runners/job/utils.py -> apache-beam-2.6.0.dev0/apache_beam/runners/job
copying apache_beam/runners/portability/__init__.py -> apache-beam-2.6.0.dev0/apache_beam/runners/portability
copying apache_beam/runners/portability/fn_api_runner.py -> apache-beam-2.6.0.dev0/apache_beam/runners/portability
copying apache_beam/runners/portability/fn_api_runner_test.py -> apache-beam-2.6.0.dev0/apache_beam/runners/portability
copying apache_beam/runners/portability/local_job_service.py -> apache-beam-2.6.0.dev0/apache_beam/runners/portability
copying apache_beam/runners/portability/local_job_service_main.py -> apache-beam-2.6.0.dev0/apache_beam/runners/portability
copying apache_beam/runners/portability/portable_runner.py -> apache-beam-2.6.0.dev0/apache_beam/runners/portability
copying apache_beam/runners/portability/portable_runner_test.py -> apache-beam-2.6.0.dev0/apache_beam/runners/portability
copying apache_beam/runners/portability/portable_stager.py -> apache-beam-2.6.0.dev0/apache_beam/runners/portability
copying apache_beam/runners/portability/portable_stager_test.py -> apache-beam-2.6.0.dev0/apache_beam/runners/portability
copying apache_beam/runners/portability/stager.py -> apache-beam-2.6.0.dev0/apache_beam/runners/portability
copying apache_beam/runners/portability/stager_test.py -> apache-beam-2.6.0.dev0/apache_beam/runners/portability
copying apache_beam/runners/test/__init__.py -> apache-beam-2.6.0.dev0/apache_beam/runners/test
copying apache_beam/runners/worker/__init__.py -> apache-beam-2.6.0.dev0/apache_beam/runners/worker
copying apache_beam/runners/worker/bundle_processor.py -> apache-beam-2.6.0.dev0/apache_beam/runners/worker
copying apache_beam/runners/worker/data_plane.py -> apache-beam-2.6.0.dev0/apache_beam/runners/worker
copying apache_beam/runners/worker/data_plane_test.py -> apache-beam-2.6.0.dev0/apache_beam/runners/worker
copying apache_beam/runners/worker/log_handler.py -> apache-beam-2.6.0.dev0/apache_beam/runners/worker
copying apache_beam/runners/worker/log_handler_test.py -> apache-beam-2.6.0.dev0/apache_beam/runners/worker
copying apache_beam/runners/worker/logger.pxd -> apache-beam-2.6.0.dev0/apache_beam/runners/worker
copying apache_beam/runners/worker/logger.py -> apache-beam-2.6.0.dev0/apache_beam/runners/worker
copying apache_beam/runners/worker/logger_test.py -> apache-beam-2.6.0.dev0/apache_beam/runners/worker
copying apache_beam/runners/worker/opcounters.pxd -> apache-beam-2.6.0.dev0/apache_beam/runners/worker
copying apache_beam/runners/worker/opcounters.py -> apache-beam-2.6.0.dev0/apache_beam/runners/worker
copying apache_beam/runners/worker/opcounters_test.py -> apache-beam-2.6.0.dev0/apache_beam/runners/worker
copying apache_beam/runners/worker/operation_specs.py -> apache-beam-2.6.0.dev0/apache_beam/runners/worker
copying apache_beam/runners/worker/operations.pxd -> apache-beam-2.6.0.dev0/apache_beam/runners/worker
copying apache_beam/runners/worker/operations.py -> apache-beam-2.6.0.dev0/apache_beam/runners/worker
copying apache_beam/runners/worker/sdk_worker.py -> apache-beam-2.6.0.dev0/apache_beam/runners/worker
copying apache_beam/runners/worker/sdk_worker_main.py -> apache-beam-2.6.0.dev0/apache_beam/runners/worker
copying apache_beam/runners/worker/sdk_worker_main_test.py -> apache-beam-2.6.0.dev0/apache_beam/runners/worker
copying apache_beam/runners/worker/sdk_worker_test.py -> apache-beam-2.6.0.dev0/apache_beam/runners/worker
copying apache_beam/runners/worker/sideinputs.py -> apache-beam-2.6.0.dev0/apache_beam/runners/worker
copying apache_beam/runners/worker/sideinputs_test.py -> apache-beam-2.6.0.dev0/apache_beam/runners/worker
copying apache_beam/runners/worker/statesampler.py -> apache-beam-2.6.0.dev0/apache_beam/runners/worker
copying apache_beam/runners/worker/statesampler_fast.pxd -> apache-beam-2.6.0.dev0/apache_beam/runners/worker
copying apache_beam/runners/worker/statesampler_fast.pyx -> apache-beam-2.6.0.dev0/apache_beam/runners/worker
copying apache_beam/runners/worker/statesampler_slow.py -> apache-beam-2.6.0.dev0/apache_beam/runners/worker
copying apache_beam/runners/worker/statesampler_test.py -> apache-beam-2.6.0.dev0/apache_beam/runners/worker
copying apache_beam/runners/worker/worker_id_interceptor.py -> apache-beam-2.6.0.dev0/apache_beam/runners/worker
copying apache_beam/runners/worker/worker_id_interceptor_test.py -> apache-beam-2.6.0.dev0/apache_beam/runners/worker
copying apache_beam/testing/__init__.py -> apache-beam-2.6.0.dev0/apache_beam/testing
copying apache_beam/testing/pipeline_verifiers.py -> apache-beam-2.6.0.dev0/apache_beam/testing
copying apache_beam/testing/pipeline_verifiers_test.py -> apache-beam-2.6.0.dev0/apache_beam/testing
copying apache_beam/testing/test_pipeline.py -> apache-beam-2.6.0.dev0/apache_beam/testing
copying apache_beam/testing/test_pipeline_test.py -> apache-beam-2.6.0.dev0/apache_beam/testing
copying apache_beam/testing/test_stream.py -> apache-beam-2.6.0.dev0/apache_beam/testing
copying apache_beam/testing/test_stream_test.py -> apache-beam-2.6.0.dev0/apache_beam/testing
copying apache_beam/testing/test_utils.py -> apache-beam-2.6.0.dev0/apache_beam/testing
copying apache_beam/testing/test_utils_test.py -> apache-beam-2.6.0.dev0/apache_beam/testing
copying apache_beam/testing/util.py -> apache-beam-2.6.0.dev0/apache_beam/testing
copying apache_beam/testing/util_test.py -> apache-beam-2.6.0.dev0/apache_beam/testing
copying apache_beam/testing/data/standard_coders.yaml -> apache-beam-2.6.0.dev0/apache_beam/testing/data
copying apache_beam/testing/data/trigger_transcripts.yaml -> apache-beam-2.6.0.dev0/apache_beam/testing/data
copying apache_beam/tools/__init__.py -> apache-beam-2.6.0.dev0/apache_beam/tools
copying apache_beam/tools/distribution_counter_microbenchmark.py -> apache-beam-2.6.0.dev0/apache_beam/tools
copying apache_beam/tools/map_fn_microbenchmark.py -> apache-beam-2.6.0.dev0/apache_beam/tools
copying apache_beam/tools/sideinput_microbenchmark.py -> apache-beam-2.6.0.dev0/apache_beam/tools
copying apache_beam/tools/utils.py -> apache-beam-2.6.0.dev0/apache_beam/tools
copying apache_beam/transforms/__init__.py -> apache-beam-2.6.0.dev0/apache_beam/transforms
copying apache_beam/transforms/combiners.py -> apache-beam-2.6.0.dev0/apache_beam/transforms
copying apache_beam/transforms/combiners_test.py -> apache-beam-2.6.0.dev0/apache_beam/transforms
copying apache_beam/transforms/core.py -> apache-beam-2.6.0.dev0/apache_beam/transforms
copying apache_beam/transforms/create_source.py -> apache-beam-2.6.0.dev0/apache_beam/transforms
copying apache_beam/transforms/create_test.py -> apache-beam-2.6.0.dev0/apache_beam/transforms
copying apache_beam/transforms/cy_combiners.pxd -> apache-beam-2.6.0.dev0/apache_beam/transforms
copying apache_beam/transforms/cy_combiners.py -> apache-beam-2.6.0.dev0/apache_beam/transforms
copying apache_beam/transforms/cy_dataflow_distribution_counter.pxd -> apache-beam-2.6.0.dev0/apache_beam/transforms
copying apache_beam/transforms/cy_dataflow_distribution_counter.pyx -> apache-beam-2.6.0.dev0/apache_beam/transforms
copying apache_beam/transforms/dataflow_distribution_counter_test.py -> apache-beam-2.6.0.dev0/apache_beam/transforms
copying apache_beam/transforms/display.py -> apache-beam-2.6.0.dev0/apache_beam/transforms
copying apache_beam/transforms/display_test.py -> apache-beam-2.6.0.dev0/apache_beam/transforms
copying apache_beam/transforms/ptransform.py -> apache-beam-2.6.0.dev0/apache_beam/transforms
copying apache_beam/transforms/ptransform_test.py -> apache-beam-2.6.0.dev0/apache_beam/transforms
copying apache_beam/transforms/py_dataflow_distribution_counter.py -> apache-beam-2.6.0.dev0/apache_beam/transforms
copying apache_beam/transforms/sideinputs.py -> apache-beam-2.6.0.dev0/apache_beam/transforms
copying apache_beam/transforms/sideinputs_test.py -> apache-beam-2.6.0.dev0/apache_beam/transforms
copying apache_beam/transforms/timeutil.py -> apache-beam-2.6.0.dev0/apache_beam/transforms
copying apache_beam/transforms/trigger.py -> apache-beam-2.6.0.dev0/apache_beam/transforms
copying apache_beam/transforms/trigger_test.py -> apache-beam-2.6.0.dev0/apache_beam/transforms
copying apache_beam/transforms/util.py -> apache-beam-2.6.0.dev0/apache_beam/transforms
copying apache_beam/transforms/util_test.py -> apache-beam-2.6.0.dev0/apache_beam/transforms
copying apache_beam/transforms/window.py -> apache-beam-2.6.0.dev0/apache_beam/transforms
copying apache_beam/transforms/window_test.py -> apache-beam-2.6.0.dev0/apache_beam/transforms
copying apache_beam/transforms/write_ptransform_test.py -> apache-beam-2.6.0.dev0/apache_beam/transforms
copying apache_beam/typehints/__init__.py -> apache-beam-2.6.0.dev0/apache_beam/typehints
copying apache_beam/typehints/decorators.py -> apache-beam-2.6.0.dev0/apache_beam/typehints
copying apache_beam/typehints/native_type_compatibility.py -> apache-beam-2.6.0.dev0/apache_beam/typehints
copying apache_beam/typehints/native_type_compatibility_test.py -> apache-beam-2.6.0.dev0/apache_beam/typehints
copying apache_beam/typehints/opcodes.py -> apache-beam-2.6.0.dev0/apache_beam/typehints
copying apache_beam/typehints/trivial_inference.py -> apache-beam-2.6.0.dev0/apache_beam/typehints
copying apache_beam/typehints/trivial_inference_test.py -> apache-beam-2.6.0.dev0/apache_beam/typehints
copying apache_beam/typehints/typecheck.py -> apache-beam-2.6.0.dev0/apache_beam/typehints
copying apache_beam/typehints/typed_pipeline_test.py -> apache-beam-2.6.0.dev0/apache_beam/typehints
copying apache_beam/typehints/typehints.py -> apache-beam-2.6.0.dev0/apache_beam/typehints
copying apache_beam/typehints/typehints_test.py -> apache-beam-2.6.0.dev0/apache_beam/typehints
copying apache_beam/utils/__init__.py -> apache-beam-2.6.0.dev0/apache_beam/utils
copying apache_beam/utils/annotations.py -> apache-beam-2.6.0.dev0/apache_beam/utils
copying apache_beam/utils/annotations_test.py -> apache-beam-2.6.0.dev0/apache_beam/utils
copying apache_beam/utils/counters.pxd -> apache-beam-2.6.0.dev0/apache_beam/utils
copying apache_beam/utils/counters.py -> apache-beam-2.6.0.dev0/apache_beam/utils
copying apache_beam/utils/counters_test.py -> apache-beam-2.6.0.dev0/apache_beam/utils
copying apache_beam/utils/plugin.py -> apache-beam-2.6.0.dev0/apache_beam/utils
copying apache_beam/utils/processes.py -> apache-beam-2.6.0.dev0/apache_beam/utils
copying apache_beam/utils/processes_test.py -> apache-beam-2.6.0.dev0/apache_beam/utils
copying apache_beam/utils/profiler.py -> apache-beam-2.6.0.dev0/apache_beam/utils
copying apache_beam/utils/proto_utils.py -> apache-beam-2.6.0.dev0/apache_beam/utils
copying apache_beam/utils/retry.py -> apache-beam-2.6.0.dev0/apache_beam/utils
copying apache_beam/utils/retry_test.py -> apache-beam-2.6.0.dev0/apache_beam/utils
copying apache_beam/utils/timestamp.py -> apache-beam-2.6.0.dev0/apache_beam/utils
copying apache_beam/utils/timestamp_test.py -> apache-beam-2.6.0.dev0/apache_beam/utils
copying apache_beam/utils/urns.py -> apache-beam-2.6.0.dev0/apache_beam/utils
copying apache_beam/utils/windowed_value.pxd -> apache-beam-2.6.0.dev0/apache_beam/utils
copying apache_beam/utils/windowed_value.py -> apache-beam-2.6.0.dev0/apache_beam/utils
copying apache_beam/utils/windowed_value_test.py -> apache-beam-2.6.0.dev0/apache_beam/utils
Writing apache-beam-2.6.0.dev0/setup.cfg
creating dist
Creating tar archive
removing 'apache-beam-2.6.0.dev0' (and everything under it)
SDK_LOCATION=$(find dist/apache-beam-*.tar.gz)
find dist/apache-beam-*.tar.gz

# Run ValidatesRunner tests on Google Cloud Dataflow service
echo ">>> RUNNING DATAFLOW RUNNER VALIDATESCONTAINER TEST"
>>> RUNNING DATAFLOW RUNNER VALIDATESCONTAINER TEST
python setup.py nosetests \
  --attr ValidatesContainer \
  --nocapture \
  --processes=1 \
  --process-timeout=900 \
  --test-pipeline-options=" \
    --runner=TestDataflowRunner \
    --project=$PROJECT \
    --worker_harness_container_image=$CONTAINER:$TAG \
    --staging_location=$GCS_LOCATION/staging-validatesrunner-test \
    --temp_location=$GCS_LOCATION/temp-validatesrunner-test \
    --output=$GCS_LOCATION/output \
    --sdk_location=$SDK_LOCATION \
    --num_workers=1"
<https://builds.apache.org/job/beam_PostCommit_Py_ValCont/ws/src/sdks/python/container/local/lib/python2.7/site-packages/setuptools/dist.py>:398:
UserWarning: Normalizing '2.6.0.dev' to '2.6.0.dev0'
  normalized_version,
running nosetests
running egg_info
<https://builds.apache.org/job/beam_PostCommit_Py_ValCont/ws/src/sdks/python/gen_protos.py>:49:
UserWarning: Installing grpcio-tools is recommended for development.
  warnings.warn('Installing grpcio-tools is recommended for development.')
writing requirements to apache_beam.egg-info/requires.txt
writing apache_beam.egg-info/PKG-INFO
writing top-level names to apache_beam.egg-info/top_level.txt
writing dependency_links to apache_beam.egg-info/dependency_links.txt
writing entry points to apache_beam.egg-info/entry_points.txt
reading manifest file 'apache_beam.egg-info/SOURCES.txt'
reading manifest template 'MANIFEST.in'
warning: no files found matching 'README.md'
warning: no files found matching 'NOTICE'
warning: no files found matching 'LICENSE'
writing manifest file 'apache_beam.egg-info/SOURCES.txt'
<https://builds.apache.org/job/beam_PostCommit_Py_ValCont/ws/src/sdks/python/apache_beam/io/gcp/gcsio.py>:176:
DeprecationWarning: object() takes no parameters
  super(GcsIO, cls).__new__(cls, storage_client))
<https://builds.apache.org/job/beam_PostCommit_Py_ValCont/ws/src/sdks/python/apache_beam/runners/dataflow/test_dataflow_runner.py>:52:
DeprecationWarning: options is deprecated since First stable release.. References to <pipeline>.options
will not be supported
  print('Found: %s.' % self.build_console_url(pipeline.options))
Found: https://console.cloud.google.com/dataflow/jobsDetail/locations/us-central1/jobs/2018-06-24_05_29_53-14979806725346604742?project=apache-beam-testing.
test_wordcount_fnapi_it (apache_beam.examples.wordcount_it_test.WordCountIT) ... ERROR

======================================================================
ERROR: test_wordcount_fnapi_it (apache_beam.examples.wordcount_it_test.WordCountIT)
----------------------------------------------------------------------
Traceback (most recent call last):
  File "<https://builds.apache.org/job/beam_PostCommit_Py_ValCont/ws/src/sdks/python/container/local/lib/python2.7/site-packages/nose/plugins/multiprocess.py",>
line 812, in run
    test(orig)
  File "<https://builds.apache.org/job/beam_PostCommit_Py_ValCont/ws/src/sdks/python/container/local/lib/python2.7/site-packages/nose/case.py",>
line 45, in __call__
    return self.run(*arg, **kwarg)
  File "<https://builds.apache.org/job/beam_PostCommit_Py_ValCont/ws/src/sdks/python/container/local/lib/python2.7/site-packages/nose/case.py",>
line 133, in run
    self.runTest(result)
  File "<https://builds.apache.org/job/beam_PostCommit_Py_ValCont/ws/src/sdks/python/container/local/lib/python2.7/site-packages/nose/case.py",>
line 151, in runTest
    test(result)
  File "/usr/lib/python2.7/unittest/case.py", line 393, in __call__
    return self.run(*args, **kwds)
  File "/usr/lib/python2.7/unittest/case.py", line 329, in run
    testMethod()
  File "<https://builds.apache.org/job/beam_PostCommit_Py_ValCont/ws/src/sdks/python/apache_beam/examples/wordcount_it_test.py",>
line 79, in test_wordcount_fnapi_it
    on_success_matcher=PipelineStateMatcher()))
  File "<https://builds.apache.org/job/beam_PostCommit_Py_ValCont/ws/src/sdks/python/apache_beam/examples/wordcount_fnapi.py",>
line 128, in run
    result = p.run()
  File "<https://builds.apache.org/job/beam_PostCommit_Py_ValCont/ws/src/sdks/python/apache_beam/pipeline.py",>
line 395, in run
    self.to_runner_api(), self.runner, self._options).run(False)
  File "<https://builds.apache.org/job/beam_PostCommit_Py_ValCont/ws/src/sdks/python/apache_beam/pipeline.py",>
line 408, in run
    return self.runner.run_pipeline(self)
  File "<https://builds.apache.org/job/beam_PostCommit_Py_ValCont/ws/src/sdks/python/apache_beam/runners/dataflow/test_dataflow_runner.py",>
line 67, in run_pipeline
    self.wait_until_in_state(PipelineState.CANCELLED, timeout=300)
  File "<https://builds.apache.org/job/beam_PostCommit_Py_ValCont/ws/src/sdks/python/apache_beam/runners/dataflow/test_dataflow_runner.py",>
line 87, in wait_until_in_state
    job_state = self.result.state
  File "<https://builds.apache.org/job/beam_PostCommit_Py_ValCont/ws/src/sdks/python/apache_beam/runners/dataflow/dataflow_runner.py",>
line 1069, in state
    self._update_job()
  File "<https://builds.apache.org/job/beam_PostCommit_Py_ValCont/ws/src/sdks/python/apache_beam/runners/dataflow/dataflow_runner.py",>
line 1047, in _update_job
    self._job = self._runner.dataflow_client.get_job(self.job_id())
  File "<https://builds.apache.org/job/beam_PostCommit_Py_ValCont/ws/src/sdks/python/apache_beam/utils/retry.py",>
line 184, in wrapper
    return fun(*args, **kwargs)
  File "<https://builds.apache.org/job/beam_PostCommit_Py_ValCont/ws/src/sdks/python/apache_beam/runners/dataflow/internal/apiclient.py",>
line 624, in get_job
    response = self._client.projects_locations_jobs.Get(request)
  File "<https://builds.apache.org/job/beam_PostCommit_Py_ValCont/ws/src/sdks/python/apache_beam/runners/dataflow/internal/clients/dataflow/dataflow_v1b3_client.py",>
line 656, in Get
    config, request, global_params=global_params)
  File "<https://builds.apache.org/job/beam_PostCommit_Py_ValCont/ws/src/sdks/python/container/local/lib/python2.7/site-packages/apitools/base/py/base_api.py",>
line 720, in _RunMethod
    http, http_request, **opts)
  File "<https://builds.apache.org/job/beam_PostCommit_Py_ValCont/ws/src/sdks/python/container/local/lib/python2.7/site-packages/apitools/base/py/http_wrapper.py",>
line 346, in MakeRequest
    check_response_func=check_response_func)
  File "<https://builds.apache.org/job/beam_PostCommit_Py_ValCont/ws/src/sdks/python/container/local/lib/python2.7/site-packages/apitools/base/py/http_wrapper.py",>
line 396, in _MakeRequestNoRetry
    redirections=redirections, connection_type=connection_type)
  File "<https://builds.apache.org/job/beam_PostCommit_Py_ValCont/ws/src/sdks/python/container/local/lib/python2.7/site-packages/oauth2client/transport.py",>
line 175, in new_request
    redirections, connection_type)
  File "<https://builds.apache.org/job/beam_PostCommit_Py_ValCont/ws/src/sdks/python/container/local/lib/python2.7/site-packages/oauth2client/transport.py",>
line 282, in request
    connection_type=connection_type)
  File "<https://builds.apache.org/job/beam_PostCommit_Py_ValCont/ws/src/sdks/python/container/local/lib/python2.7/site-packages/httplib2/__init__.py",>
line 1694, in request
    (response, content) = self._request(conn, authority, uri, request_uri, method, body, headers,
redirections, cachekey)
  File "<https://builds.apache.org/job/beam_PostCommit_Py_ValCont/ws/src/sdks/python/container/local/lib/python2.7/site-packages/httplib2/__init__.py",>
line 1434, in _request
    (response, content) = self._conn_request(conn, request_uri, method, body, headers)
  File "<https://builds.apache.org/job/beam_PostCommit_Py_ValCont/ws/src/sdks/python/container/local/lib/python2.7/site-packages/httplib2/__init__.py",>
line 1390, in _conn_request
    response = conn.getresponse()
  File "/usr/lib/python2.7/httplib.py", line 1136, in getresponse
    response.begin()
  File "/usr/lib/python2.7/httplib.py", line 453, in begin
    version, status, reason = self._read_status()
  File "/usr/lib/python2.7/httplib.py", line 409, in _read_status
    line = self.fp.readline(_MAXLINE + 1)
  File "/usr/lib/python2.7/socket.py", line 480, in readline
    data = self._sock.recv(self._rbufsize)
  File "/usr/lib/python2.7/ssl.py", line 756, in recv
    return self.read(buflen)
  File "/usr/lib/python2.7/ssl.py", line 643, in read
    v = self._sslobj.read(len)
  File "<https://builds.apache.org/job/beam_PostCommit_Py_ValCont/ws/src/sdks/python/container/local/lib/python2.7/site-packages/nose/plugins/multiprocess.py",>
line 276, in signalhandler
    raise TimedOutException()
TimedOutException: 'test_wordcount_fnapi_it (apache_beam.examples.wordcount_it_test.WordCountIT)'

----------------------------------------------------------------------
XML: <https://builds.apache.org/job/beam_PostCommit_Py_ValCont/ws/src/sdks/python/nosetests.xml>
----------------------------------------------------------------------
Ran 1 test in 901.502s

FAILED (errors=1)
Build step 'Execute shell' marked build as failure

Mime
View raw message