beam-commits mailing list archives

Site index · List index
Message view « Date » · « Thread »
Top « Date » · « Thread »
From Apache Jenkins Server <jenk...@builds.apache.org>
Subject Build failed in Jenkins: beam_PostCommit_Java_GradleBuild #339
Date Thu, 10 May 2018 04:36:17 GMT
See <https://builds.apache.org/job/beam_PostCommit_Java_GradleBuild/339/display/redirect?page=changes>

Changes:

[apilloud] [SQL] Use Lex.JAVA and drop toLowerCase in DDL

[apilloud] [SQL] Planner is private within BeamQueryPlanner

------------------------------------------
[...truncated 18.32 MB...]
org.apache.beam.examples.WordCountTest > testExtractWordsFn STANDARD_ERROR
    May 10, 2018 4:36:07 AM org.apache.beam.sdk.transforms.DoFnTester of
    WARNING: Your tests use DoFnTester, which may not exercise DoFns correctly. Please use
TestPipeline instead.

org.apache.beam.examples.subprocess.ExampleEchoPipelineTest > testExampleEchoPipeline STANDARD_ERROR
    May 10, 2018 4:36:08 AM org.apache.beam.examples.subprocess.utils.CallingSubProcessUtils
initSemaphore
    INFO: Initialized Semaphore for binary test-Echo1976190095651086343.sh 
    May 10, 2018 4:36:08 AM org.apache.beam.examples.subprocess.utils.CallingSubProcessUtils
setUp
    INFO: Calling filesetup to move Executables to worker.
    May 10, 2018 4:36:08 AM org.apache.beam.examples.subprocess.utils.FileUtils copyFileFromGCSToWorker
    INFO: Moving File /tmp/test-Echo1976190095651086343.sh to /tmp/test-Echoo567756169678219964/test-Echo1976190095651086343.sh

    May 10, 2018 4:36:08 AM org.apache.beam.examples.subprocess.utils.CallingSubProcessUtils
initSemaphore
    INFO: Initialized Semaphore for binary test-EchoAgain9026850191690008179.sh 
    May 10, 2018 4:36:08 AM org.apache.beam.examples.subprocess.utils.CallingSubProcessUtils
setUp
    INFO: Calling filesetup to move Executables to worker.
    May 10, 2018 4:36:08 AM org.apache.beam.examples.subprocess.utils.FileUtils copyFileFromGCSToWorker
    INFO: Moving File /tmp/test-EchoAgain9026850191690008179.sh to /tmp/test-Echoo567756169678219964/test-EchoAgain9026850191690008179.sh


org.apache.beam.examples.complete.game.HourlyTeamScoreTest > testUserScoresFilter STANDARD_OUT
    GOT user18_BananaEmu,BananaEmu,7,1447965690000,2015-11-19 12:41:31.053
    GOT user13_ApricotQuokka,ApricotQuokka,15,1447955630000,2015-11-19 09:53:53.444
    GOT user0_AndroidGreenEchidna,AndroidGreenEchidna,0,1447965690000,2015-11-19 12:41:31.053
    GOT user2_AmberCockatoo,AmberCockatoo,13,1447965690000,2015-11-19 12:41:31.053
    GOT user7_AndroidGreenKookaburra,AndroidGreenKookaburra,12,1447955630000,2015-11-19 09:53:53.444
    GOT user3_BananaEmu,BananaEmu,17,1447965690000,2015-11-19 12:41:31.053
    GOT user18_ApricotCaneToad,ApricotCaneToad,14,1447965690000,2015-11-19 12:41:31.053
    GOT user0_MagentaKangaroo,MagentaKangaroo,3,1447955630000,2015-11-19 09:53:53.444
    GOT user6_AmberNumbat,AmberNumbat,11,1447955630000,2015-11-19 09:53:53.444
    GOT user18_BananaEmu,BananaEmu,1,1447965690000,2015-11-19 12:41:31.053
    GOT user7_AlmondWallaby,AlmondWallaby,15,1447955630000,2015-11-19 09:53:53.444
    GOT user19_BisqueBilby,BisqueBilby,6,1447955630000,2015-11-19 09:53:53.444
    GOT user0_MagentaKangaroo,MagentaKangaroo,4,1447965690000,2015-11-19 12:41:31.053
    GOT user7_AndroidGreenKookaburra,AndroidGreenKookaburra,11,1447955630000,2015-11-19 09:53:53.444
    GOT user19_BisqueBilby,BisqueBilby,8,1447955630000,2015-11-19 09:53:53.444

org.apache.beam.examples.complete.game.UserScoreTest > testTeamScoreSums STANDARD_OUT
    GOT user6_AmberNumbat,AmberNumbat,11,1447955630000,2015-11-19 09:53:53.444
    GOT user7_AndroidGreenKookaburra,AndroidGreenKookaburra,12,1447955630000,2015-11-19 09:53:53.444
    GOT user0_MagentaKangaroo,MagentaKangaroo,3,1447955630000,2015-11-19 09:53:53.444
    GOT user7_AndroidGreenKookaburra,AndroidGreenKookaburra,11,1447955630000,2015-11-19 09:53:53.444
    GOT user7_AlmondWallaby,AlmondWallaby,15,1447955630000,2015-11-19 09:53:53.444
    GOT THIS IS A PARSE ERROR,2015-11-19 09:53:53.444
    GOT user19_BisqueBilby,BisqueBilby,8,1447955630000,2015-11-19 09:53:53.444

org.apache.beam.examples.complete.game.UserScoreTest > testTeamScoreSums STANDARD_ERROR
    May 10, 2018 4:36:09 AM org.apache.beam.examples.complete.game.UserScore$ParseEventFn
processElement
    INFO: Parse error on THIS IS A PARSE ERROR,2015-11-19 09:53:53.444, 2

org.apache.beam.examples.complete.game.UserScoreTest > testTeamScoreSums STANDARD_OUT
    GOT user6_AliceBlueDingo,AliceBlueDingo,4,xxxxxxx,2015-11-19 09:53:53.444

org.apache.beam.examples.complete.game.UserScoreTest > testTeamScoreSums STANDARD_ERROR
    May 10, 2018 4:36:09 AM org.apache.beam.examples.complete.game.UserScore$ParseEventFn
processElement

org.apache.beam.examples.complete.game.UserScoreTest > testTeamScoreSums STANDARD_OUT
    GOT user13_ApricotQuokka,ApricotQuokka,15,1447955630000,2015-11-19 09:53:53.444

org.apache.beam.examples.complete.game.UserScoreTest > testTeamScoreSums STANDARD_ERROR
    INFO: Parse error on user6_AliceBlueDingo,AliceBlueDingo,4,xxxxxxx,2015-11-19 09:53:53.444,
For input string: "xxxxxxx"

org.apache.beam.examples.complete.game.UserScoreTest > testTeamScoreSums STANDARD_OUT
    GOT user19_BisqueBilby,BisqueBilby,6,1447955630000,2015-11-19 09:53:53.444

org.apache.beam.examples.complete.game.UserScoreTest > testUserScoresBadInput STANDARD_OUT
    GOT user6_AliceBlueDingo,AliceBlueDingo,4,xxxxxxx,2015-11-19 09:53:53.444
    GOT user13_BisqueBilby,BisqueBilby,xxx,1447955630000,2015-11-19 09:53:53.444
    GOT THIS IS A PARSE ERROR,2015-11-19 09:53:53.444

org.apache.beam.examples.complete.game.UserScoreTest > testUserScoresBadInput STANDARD_ERROR
    May 10, 2018 4:36:09 AM org.apache.beam.examples.complete.game.UserScore$ParseEventFn
processElement
    INFO: Parse error on user13_BisqueBilby,BisqueBilby,xxx,1447955630000,2015-11-19 09:53:53.444,
For input string: "xxx"
    May 10, 2018 4:36:09 AM org.apache.beam.examples.complete.game.UserScore$ParseEventFn
processElement
    INFO: Parse error on THIS IS A PARSE ERROR,2015-11-19 09:53:53.444, 2
    May 10, 2018 4:36:09 AM org.apache.beam.examples.complete.game.UserScore$ParseEventFn
processElement
    INFO: Parse error on user6_AliceBlueDingo,AliceBlueDingo,4,xxxxxxx,2015-11-19 09:53:53.444,
For input string: "xxxxxxx"

org.apache.beam.examples.complete.game.UserScoreTest > testUserScoreSums STANDARD_OUT
    GOT THIS IS A PARSE ERROR,2015-11-19 09:53:53.444
    GOT user7_AlmondWallaby,AlmondWallaby,15,1447955630000,2015-11-19 09:53:53.444
    GOT user6_AliceBlueDingo,AliceBlueDingo,4,xxxxxxx,2015-11-19 09:53:53.444
    GOT user6_AmberNumbat,AmberNumbat,11,1447955630000,2015-11-19 09:53:53.444
    GOT user7_AndroidGreenKookaburra,AndroidGreenKookaburra,12,1447955630000,2015-11-19 09:53:53.444
    GOT user7_AndroidGreenKookaburra,AndroidGreenKookaburra,11,1447955630000,2015-11-19 09:53:53.444
    GOT user0_MagentaKangaroo,MagentaKangaroo,3,1447955630000,2015-11-19 09:53:53.444

org.apache.beam.examples.complete.game.UserScoreTest > testUserScoreSums STANDARD_ERROR
    May 10, 2018 4:36:09 AM org.apache.beam.examples.complete.game.UserScore$ParseEventFn
processElement

org.apache.beam.examples.complete.game.UserScoreTest > testUserScoreSums STANDARD_OUT
    GOT user13_ApricotQuokka,ApricotQuokka,15,1447955630000,2015-11-19 09:53:53.444
    GOT user19_BisqueBilby,BisqueBilby,8,1447955630000,2015-11-19 09:53:53.444
    GOT user19_BisqueBilby,BisqueBilby,6,1447955630000,2015-11-19 09:53:53.444

org.apache.beam.examples.complete.game.UserScoreTest > testUserScoreSums STANDARD_ERROR
    INFO: Parse error on user6_AliceBlueDingo,AliceBlueDingo,4,xxxxxxx,2015-11-19 09:53:53.444,
For input string: "xxxxxxx"
    May 10, 2018 4:36:09 AM org.apache.beam.examples.complete.game.UserScore$ParseEventFn
processElement
    INFO: Parse error on THIS IS A PARSE ERROR,2015-11-19 09:53:53.444, 2

org.apache.beam.examples.complete.game.UserScoreTest > testParseEventFn STANDARD_ERROR
    May 10, 2018 4:36:09 AM org.apache.beam.sdk.transforms.DoFnTester of
    WARNING: Your tests use DoFnTester, which may not exercise DoFns correctly. Please use
TestPipeline instead.

org.apache.beam.examples.complete.game.UserScoreTest > testParseEventFn STANDARD_OUT
    GOT user0_MagentaKangaroo,MagentaKangaroo,3,1447955630000,2015-11-19 09:53:53.444
    GOT user13_ApricotQuokka,ApricotQuokka,15,1447955630000,2015-11-19 09:53:53.444
    GOT user6_AmberNumbat,AmberNumbat,11,1447955630000,2015-11-19 09:53:53.444
    GOT user7_AlmondWallaby,AlmondWallaby,15,1447955630000,2015-11-19 09:53:53.444
    GOT user7_AndroidGreenKookaburra,AndroidGreenKookaburra,12,1447955630000,2015-11-19 09:53:53.444
    GOT user6_AliceBlueDingo,AliceBlueDingo,4,xxxxxxx,2015-11-19 09:53:53.444

org.apache.beam.examples.complete.game.UserScoreTest > testParseEventFn STANDARD_ERROR
    May 10, 2018 4:36:09 AM org.apache.beam.examples.complete.game.UserScore$ParseEventFn
processElement
    INFO: Parse error on user6_AliceBlueDingo,AliceBlueDingo,4,xxxxxxx,2015-11-19 09:53:53.444,
For input string: "xxxxxxx"

org.apache.beam.examples.complete.game.UserScoreTest > testParseEventFn STANDARD_OUT
    GOT user7_AndroidGreenKookaburra,AndroidGreenKookaburra,11,1447955630000,2015-11-19 09:53:53.444
    GOT THIS IS A PARSE ERROR,2015-11-19 09:53:53.444

org.apache.beam.examples.complete.game.UserScoreTest > testParseEventFn STANDARD_ERROR
    May 10, 2018 4:36:09 AM org.apache.beam.examples.complete.game.UserScore$ParseEventFn
processElement
    INFO: Parse error on THIS IS A PARSE ERROR,2015-11-19 09:53:53.444, 2

org.apache.beam.examples.complete.game.UserScoreTest > testParseEventFn STANDARD_OUT
    GOT user19_BisqueBilby,BisqueBilby,6,1447955630000,2015-11-19 09:53:53.444
    GOT user19_BisqueBilby,BisqueBilby,8,1447955630000,2015-11-19 09:53:53.444

org.apache.beam.examples.complete.game.GameStatsTest > testCalculateSpammyUsers STANDARD_ERROR
    May 10, 2018 4:36:09 AM org.apache.beam.examples.complete.game.GameStats$CalculateSpammyUsers$1
processElement
    INFO: user Robot-2 spammer score 66 with mean 24.923076923076923
    May 10, 2018 4:36:09 AM org.apache.beam.examples.complete.game.GameStats$CalculateSpammyUsers$1
processElement
    INFO: user Robot-1 spammer score 116 with mean 24.923076923076923

Gradle Test Executor 131 finished executing tests.

> Task :beam-examples-java:test
Finished generating test XML results (0.0 secs) into: <https://builds.apache.org/job/beam_PostCommit_Java_GradleBuild/ws/src/examples/java/build/test-results/test>
Generating HTML test report...
Finished generating test html results (0.001 secs) into: <https://builds.apache.org/job/beam_PostCommit_Java_GradleBuild/ws/src/examples/java/build/reports/tests/test>
Packing task ':beam-examples-java:test'
:beam-examples-java:test (Thread[Daemon worker,5,main]) completed. Took 9.16 secs.
:beam-examples-java:check (Thread[Daemon worker,5,main]) started.

> Task :beam-examples-java:check
Skipping task ':beam-examples-java:check' as it has no actions.
:beam-examples-java:check (Thread[Daemon worker,5,main]) completed. Took 0.0 secs.
:beam-examples-java:build (Thread[Task worker for ':' Thread 2,5,main]) started.

> Task :beam-examples-java:build
Skipping task ':beam-examples-java:build' as it has no actions.
:beam-examples-java:build (Thread[Task worker for ':' Thread 2,5,main]) completed. Took 0.0
secs.
:beam-examples-java:buildDependents (Thread[Task worker for ':' Thread 2,5,main]) started.

> Task :beam-examples-java:buildDependents
Caching disabled for task ':beam-examples-java:buildDependents': Caching has not been enabled
for the task
Task ':beam-examples-java:buildDependents' is not up-to-date because:
  Task has not declared any outputs despite executing actions.
:beam-examples-java:buildDependents (Thread[Task worker for ':' Thread 2,5,main]) completed.
Took 0.0 secs.
:beam-sdks-java-io-google-cloud-platform:buildDependents (Thread[Task worker for ':' Thread
2,5,main]) started.

> Task :beam-sdks-java-io-google-cloud-platform:buildDependents
Caching disabled for task ':beam-sdks-java-io-google-cloud-platform:buildDependents': Caching
has not been enabled for the task
Task ':beam-sdks-java-io-google-cloud-platform:buildDependents' is not up-to-date because:
  Task has not declared any outputs despite executing actions.
:beam-sdks-java-io-google-cloud-platform:buildDependents (Thread[Task worker for ':' Thread
2,5,main]) completed. Took 0.0 secs.
:beam-runners-direct-java:buildDependents (Thread[Task worker for ':' Thread 2,5,main]) started.
:beam-sdks-java-extensions-google-cloud-platform-core:buildDependents (Thread[Task worker
for ':' Thread 14,5,main]) started.
:beam-sdks-java-extensions-protobuf:buildDependents (Thread[Task worker for ':',5,main]) started.

> Task :beam-runners-direct-java:buildDependents
Caching disabled for task ':beam-runners-direct-java:buildDependents': Caching has not been
enabled for the task
Task ':beam-runners-direct-java:buildDependents' is not up-to-date because:
  Task has not declared any outputs despite executing actions.
:beam-runners-direct-java:buildDependents (Thread[Task worker for ':' Thread 2,5,main]) completed.
Took 0.0 secs.

> Task :beam-sdks-java-extensions-google-cloud-platform-core:buildDependents
Caching disabled for task ':beam-sdks-java-extensions-google-cloud-platform-core:buildDependents':
Caching has not been enabled for the task
Task ':beam-sdks-java-extensions-google-cloud-platform-core:buildDependents' is not up-to-date
because:
  Task has not declared any outputs despite executing actions.

> Task :beam-sdks-java-extensions-protobuf:buildDependents
Caching disabled for task ':beam-sdks-java-extensions-protobuf:buildDependents': Caching has
not been enabled for the task
Task ':beam-sdks-java-extensions-protobuf:buildDependents' is not up-to-date because:
  Task has not declared any outputs despite executing actions.
:beam-sdks-java-extensions-google-cloud-platform-core:buildDependents (Thread[Task worker
for ':' Thread 14,5,main]) completed. Took 0.0 secs.
:beam-runners-core-java:buildDependents (Thread[Task worker for ':' Thread 2,5,main]) started.
:beam-sdks-java-extensions-protobuf:buildDependents (Thread[Task worker for ':',5,main]) completed.
Took 0.0 secs.
:beam-runners-local-java-core:buildDependents (Thread[Daemon worker,5,main]) started.

> Task :beam-runners-core-java:buildDependents
Caching disabled for task ':beam-runners-core-java:buildDependents': Caching has not been
enabled for the task
Task ':beam-runners-core-java:buildDependents' is not up-to-date because:
  Task has not declared any outputs despite executing actions.
:beam-runners-core-java:buildDependents (Thread[Task worker for ':' Thread 2,5,main]) completed.
Took 0.0 secs.

> Task :beam-runners-local-java-core:buildDependents
Caching disabled for task ':beam-runners-local-java-core:buildDependents': Caching has not
been enabled for the task
Task ':beam-runners-local-java-core:buildDependents' is not up-to-date because:
  Task has not declared any outputs despite executing actions.
:beam-runners-local-java-core:buildDependents (Thread[Daemon worker,5,main]) completed. Took
0.0 secs.
:beam-runners-core-construction-java:buildDependents (Thread[Task worker for ':' Thread 9,5,main])
started.

> Task :beam-runners-core-construction-java:buildDependents
Caching disabled for task ':beam-runners-core-construction-java:buildDependents': Caching
has not been enabled for the task
Task ':beam-runners-core-construction-java:buildDependents' is not up-to-date because:
  Task has not declared any outputs despite executing actions.
:beam-runners-core-construction-java:buildDependents (Thread[Task worker for ':' Thread 9,5,main])
completed. Took 0.0 secs.
:beam-sdks-java-core:buildDependents (Thread[Task worker for ':' Thread 9,5,main]) started.

> Task :beam-sdks-java-core:buildDependents
Caching disabled for task ':beam-sdks-java-core:buildDependents': Caching has not been enabled
for the task
Task ':beam-sdks-java-core:buildDependents' is not up-to-date because:
  Task has not declared any outputs despite executing actions.
:beam-sdks-java-core:buildDependents (Thread[Task worker for ':' Thread 9,5,main]) completed.
Took 0.0 secs.
:javaPreCommit (Thread[Task worker for ':' Thread 9,5,main]) started.

> Task :javaPreCommit
Skipping task ':javaPreCommit' as it has no actions.
:javaPreCommit (Thread[Task worker for ':' Thread 9,5,main]) completed. Took 0.0 secs.

FAILURE: Build failed with an exception.

* What went wrong:
Execution failed for task ':beam-runners-google-cloud-dataflow-java:googleCloudPlatformIntegrationTest'.
> There were failing tests. See the report at: file://<https://builds.apache.org/job/beam_PostCommit_Java_GradleBuild/ws/src/runners/google-cloud-dataflow-java/build/reports/tests/googleCloudPlatformIntegrationTest/index.html>

* Try:
Run with --stacktrace option to get the stack trace. Run with --debug option to get more log
output. Run with --scan to get full insights.

* Get more help at https://help.gradle.org

Deprecated Gradle features were used in this build, making it incompatible with Gradle 5.0.
See https://docs.gradle.org/4.7/userguide/command_line_interface.html#sec:command_line_warnings

BUILD FAILED in 35m 5s
545 actionable tasks: 540 executed, 5 from cache

Publishing build scan...
https://gradle.com/s/tgxygymr6g5ta

Build step 'Invoke Gradle script' changed build result to FAILURE
Build step 'Invoke Gradle script' marked build as failure
Recording test results
Not sending mail to unregistered user kedin@google.com
Not sending mail to unregistered user apilloud@google.com
Not sending mail to unregistered user kirpichov@google.com
Not sending mail to unregistered user mairbek@google.com
Not sending mail to unregistered user yifanzou@yifanzou-linuxworkstation.sea.corp.google.com
Not sending mail to unregistered user aaltay@gmail.com
Not sending mail to unregistered user github@alasdairhodge.co.uk

Mime
View raw message