beam-commits mailing list archives

Site index · List index
Message view « Date » · « Thread »
Top « Date » · « Thread »
From Apache Jenkins Server <jenk...@builds.apache.org>
Subject Build failed in Jenkins: beam_PostCommit_Java_ValidatesRunner_Dataflow_Gradle #192
Date Fri, 04 May 2018 02:25:12 GMT
See <https://builds.apache.org/job/beam_PostCommit_Java_ValidatesRunner_Dataflow_Gradle/192/display/redirect?page=changes>

Changes:

[apilloud] [SQL] Add BeamEnumerableConverter

[mairbek] Templatize host name in SpannerIO

[coheigea] A few small fixes to catch a few regressions - put String literals

[sidhom] Move SyntheticNodes to top-level construction package and rename

[sidhom] Pull Flink execution environment utilities into static methods

[sidhom] Refactor Runner/SDK wire coder creation into a shared utility

[sidhom] [BEAM-3972] Translate portable batch pipelines by proto

[sidhom] FIXUP: Use ModelCoders to create proto coders and use WireCoders to

[sidhom] FIXUP: Use RunnerApi in WireCoders to prepare for coder instantiation

[tgroh] Add additional methods to QueryablePipeline

[tgroh] Expand the ExecutableGraph interface

[tgroh] Add ProtoOverrides

[jasonkuster] Add labels to Go SDK Dataflow Runner.

[jasonkuster] Add verbose error message if unmarshaling fails for label flag.

------------------------------------------
[...truncated 23.36 MB...]
    	at com.google.cloud.dataflow.worker.BatchDataflowWorker.getAndPerformWork(BatchDataflowWorker.java:286)
    	at com.google.cloud.dataflow.worker.DataflowBatchWorkerHarness$WorkerThread.doWork(DataflowBatchWorkerHarness.java:134)
    	at com.google.cloud.dataflow.worker.DataflowBatchWorkerHarness$WorkerThread.call(DataflowBatchWorkerHarness.java:114)
    	at com.google.cloud.dataflow.worker.DataflowBatchWorkerHarness$WorkerThread.call(DataflowBatchWorkerHarness.java:101)
    	at java.util.concurrent.FutureTask.run(FutureTask.java:266)
    	at java.util.concurrent.ThreadPoolExecutor.runWorker(ThreadPoolExecutor.java:1142)
    	at java.util.concurrent.ThreadPoolExecutor$Worker.run(ThreadPoolExecutor.java:617)
    	at java.lang.Thread.run(Thread.java:745)

    May 04, 2018 2:23:40 AM org.apache.beam.runners.dataflow.util.MonitoringUtil$LoggingHandler
process
    SEVERE: 2018-05-04T02:23:37.726Z: java.lang.AbstractMethodError: org.apache.beam.runners.core.SimpleDoFnRunner$DoFnProcessContext.element(Lorg/apache/beam/sdk/transforms/DoFn;)Ljava/lang/Object;
    	at org.apache.beam.sdk.transforms.ParDoTest$TestDoFn$DoFnInvoker.invokeProcessElement(Unknown
Source)
    	at org.apache.beam.runners.core.SimpleDoFnRunner.invokeProcessElement(SimpleDoFnRunner.java:177)
    	at org.apache.beam.runners.core.SimpleDoFnRunner.processElement(SimpleDoFnRunner.java:138)
    	at com.google.cloud.dataflow.worker.SimpleParDoFn.processElement(SimpleParDoFn.java:323)
    	at com.google.cloud.dataflow.worker.util.common.worker.ParDoOperation.process(ParDoOperation.java:43)
    	at com.google.cloud.dataflow.worker.util.common.worker.OutputReceiver.process(OutputReceiver.java:48)
    	at com.google.cloud.dataflow.worker.util.common.worker.ReadOperation.runReadLoop(ReadOperation.java:200)
    	at com.google.cloud.dataflow.worker.util.common.worker.ReadOperation.start(ReadOperation.java:158)
    	at com.google.cloud.dataflow.worker.util.common.worker.MapTaskExecutor.execute(MapTaskExecutor.java:75)
    	at com.google.cloud.dataflow.worker.BatchDataflowWorker.executeWork(BatchDataflowWorker.java:383)
    	at com.google.cloud.dataflow.worker.BatchDataflowWorker.doWork(BatchDataflowWorker.java:355)
    	at com.google.cloud.dataflow.worker.BatchDataflowWorker.getAndPerformWork(BatchDataflowWorker.java:286)
    	at com.google.cloud.dataflow.worker.DataflowBatchWorkerHarness$WorkerThread.doWork(DataflowBatchWorkerHarness.java:134)
    	at com.google.cloud.dataflow.worker.DataflowBatchWorkerHarness$WorkerThread.call(DataflowBatchWorkerHarness.java:114)
    	at com.google.cloud.dataflow.worker.DataflowBatchWorkerHarness$WorkerThread.call(DataflowBatchWorkerHarness.java:101)
    	at java.util.concurrent.FutureTask.run(FutureTask.java:266)
    	at java.util.concurrent.ThreadPoolExecutor.runWorker(ThreadPoolExecutor.java:1142)
    	at java.util.concurrent.ThreadPoolExecutor$Worker.run(ThreadPoolExecutor.java:617)
    	at java.lang.Thread.run(Thread.java:745)

    May 04, 2018 2:23:40 AM org.apache.beam.runners.dataflow.util.MonitoringUtil$LoggingHandler
process
    SEVERE: 2018-05-04T02:23:37.814Z: Workflow failed. Causes: S28:Create.Values/Read(CreateSource)+ParDo(Test)+PAssert$53/GroupGlobally/Window.Into()/Window.Assign+PAssert$53/GroupGlobally/GatherAllOutputs/Reify.Window/ParDo(Anonymous)+PAssert$53/GroupGlobally/GatherAllOutputs/WithKeys/AddKeys/Map+PAssert$53/GroupGlobally/GatherAllOutputs/Window.Into()/Window.Assign+PAssert$53/GroupGlobally/GatherAllOutputs/GroupByKey/Reify+PAssert$53/GroupGlobally/GatherAllOutputs/GroupByKey/Write
failed., A work item was attempted 4 times without success. Each time the worker eventually
lost contact with the service. The work item was attempted on: 
      pardotest0testpardowithsi-05031920-jskb-harness-68k5,
      pardotest0testpardowithsi-05031920-jskb-harness-68k5,
      pardotest0testpardowithsi-05031920-jskb-harness-68k5,
      pardotest0testpardowithsi-05031920-jskb-harness-68k5
    May 04, 2018 2:23:40 AM org.apache.beam.runners.dataflow.util.MonitoringUtil$LoggingHandler
process
    INFO: 2018-05-04T02:23:37.928Z: Cleaning up.
    May 04, 2018 2:23:40 AM org.apache.beam.runners.dataflow.util.MonitoringUtil$LoggingHandler
process
    INFO: 2018-05-04T02:23:38.789Z: Stopping worker pool...
    May 04, 2018 2:23:40 AM org.apache.beam.runners.dataflow.TestDataflowRunner$ErrorMonitorMessagesHandler
process
    INFO: Dataflow job 2018-05-03_19_20_55-9111598299077273891 threw exception. Failure message
was: java.lang.AbstractMethodError: org.apache.beam.runners.core.SimpleDoFnRunner$DoFnProcessContext.element(Lorg/apache/beam/sdk/transforms/DoFn;)Ljava/lang/Object;
    	at org.apache.beam.sdk.transforms.ParDoTest$TestDoFn$DoFnInvoker.invokeProcessElement(Unknown
Source)
    	at org.apache.beam.runners.core.SimpleDoFnRunner.invokeProcessElement(SimpleDoFnRunner.java:177)
    	at org.apache.beam.runners.core.SimpleDoFnRunner.processElement(SimpleDoFnRunner.java:138)
    	at com.google.cloud.dataflow.worker.SimpleParDoFn.processElement(SimpleParDoFn.java:323)
    	at com.google.cloud.dataflow.worker.util.common.worker.ParDoOperation.process(ParDoOperation.java:43)
    	at com.google.cloud.dataflow.worker.util.common.worker.OutputReceiver.process(OutputReceiver.java:48)
    	at com.google.cloud.dataflow.worker.util.common.worker.ReadOperation.runReadLoop(ReadOperation.java:200)
    	at com.google.cloud.dataflow.worker.util.common.worker.ReadOperation.start(ReadOperation.java:158)
    	at com.google.cloud.dataflow.worker.util.common.worker.MapTaskExecutor.execute(MapTaskExecutor.java:75)
    	at com.google.cloud.dataflow.worker.BatchDataflowWorker.executeWork(BatchDataflowWorker.java:383)
    	at com.google.cloud.dataflow.worker.BatchDataflowWorker.doWork(BatchDataflowWorker.java:355)
    	at com.google.cloud.dataflow.worker.BatchDataflowWorker.getAndPerformWork(BatchDataflowWorker.java:286)
    	at com.google.cloud.dataflow.worker.DataflowBatchWorkerHarness$WorkerThread.doWork(DataflowBatchWorkerHarness.java:134)
    	at com.google.cloud.dataflow.worker.DataflowBatchWorkerHarness$WorkerThread.call(DataflowBatchWorkerHarness.java:114)
    	at com.google.cloud.dataflow.worker.DataflowBatchWorkerHarness$WorkerThread.call(DataflowBatchWorkerHarness.java:101)
    	at java.util.concurrent.FutureTask.run(FutureTask.java:266)
    	at java.util.concurrent.ThreadPoolExecutor.runWorker(ThreadPoolExecutor.java:1142)
    	at java.util.concurrent.ThreadPoolExecutor$Worker.run(ThreadPoolExecutor.java:617)
    	at java.lang.Thread.run(Thread.java:745)

    May 04, 2018 2:23:40 AM org.apache.beam.runners.dataflow.TestDataflowRunner$ErrorMonitorMessagesHandler
process
    INFO: Dataflow job 2018-05-03_19_20_55-9111598299077273891 threw exception. Failure message
was: Workflow failed. Causes: S28:Create.Values/Read(CreateSource)+ParDo(Test)+PAssert$53/GroupGlobally/Window.Into()/Window.Assign+PAssert$53/GroupGlobally/GatherAllOutputs/Reify.Window/ParDo(Anonymous)+PAssert$53/GroupGlobally/GatherAllOutputs/WithKeys/AddKeys/Map+PAssert$53/GroupGlobally/GatherAllOutputs/Window.Into()/Window.Assign+PAssert$53/GroupGlobally/GatherAllOutputs/GroupByKey/Reify+PAssert$53/GroupGlobally/GatherAllOutputs/GroupByKey/Write
failed., A work item was attempted 4 times without success. Each time the worker eventually
lost contact with the service. The work item was attempted on: 
      pardotest0testpardowithsi-05031920-jskb-harness-68k5,
      pardotest0testpardowithsi-05031920-jskb-harness-68k5,
      pardotest0testpardowithsi-05031920-jskb-harness-68k5,
      pardotest0testpardowithsi-05031920-jskb-harness-68k5
    May 04, 2018 2:24:55 AM org.apache.beam.runners.dataflow.util.MonitoringUtil$LoggingHandler
process
    INFO: 2018-05-04T02:24:53.819Z: Autoscaling: Resized worker pool from 1 to 0.
    May 04, 2018 2:24:55 AM org.apache.beam.runners.dataflow.util.MonitoringUtil$LoggingHandler
process
    INFO: 2018-05-04T02:24:53.857Z: Autoscaling: Would further reduce the number of workers
but reached the minimum number allowed for the job.
    May 04, 2018 2:24:55 AM org.apache.beam.runners.dataflow.util.MonitoringUtil$LoggingHandler
process
    INFO: 2018-05-04T02:24:53.913Z: Worker pool stopped.
    May 04, 2018 2:25:02 AM org.apache.beam.runners.dataflow.DataflowPipelineJob waitUntilFinish
    INFO: Job 2018-05-03_19_20_55-9111598299077273891 failed with status FAILED.
    May 04, 2018 2:25:02 AM org.apache.beam.runners.dataflow.TestDataflowRunner checkForPAssertSuccess
    INFO: Dataflow job 2018-05-03_19_20_55-9111598299077273891 terminated in failure state
FAILED without reporting a failed assertion
    May 04, 2018 2:25:02 AM org.apache.beam.runners.dataflow.TestDataflowRunner run
    WARNING: Dataflow job 2018-05-03_19_20_55-9111598299077273891 did not output a success
or failure metric.

org.apache.beam.sdk.transforms.ParDoTest > testParDoWithSideInputsIsCumulative FAILED
    java.lang.RuntimeException: java.lang.AbstractMethodError: org.apache.beam.runners.core.SimpleDoFnRunner$DoFnProcessContext.element(Lorg/apache/beam/sdk/transforms/DoFn;)Ljava/lang/Object;
    	at org.apache.beam.sdk.transforms.ParDoTest$TestDoFn$DoFnInvoker.invokeProcessElement(Unknown
Source)
    	at org.apache.beam.runners.core.SimpleDoFnRunner.invokeProcessElement(SimpleDoFnRunner.java:177)
    	at org.apache.beam.runners.core.SimpleDoFnRunner.processElement(SimpleDoFnRunner.java:138)
    	at com.google.cloud.dataflow.worker.SimpleParDoFn.processElement(SimpleParDoFn.java:323)
    	at com.google.cloud.dataflow.worker.util.common.worker.ParDoOperation.process(ParDoOperation.java:43)
    	at com.google.cloud.dataflow.worker.util.common.worker.OutputReceiver.process(OutputReceiver.java:48)
    	at com.google.cloud.dataflow.worker.util.common.worker.ReadOperation.runReadLoop(ReadOperation.java:200)
    	at com.google.cloud.dataflow.worker.util.common.worker.ReadOperation.start(ReadOperation.java:158)
    	at com.google.cloud.dataflow.worker.util.common.worker.MapTaskExecutor.execute(MapTaskExecutor.java:75)
    	at com.google.cloud.dataflow.worker.BatchDataflowWorker.executeWork(BatchDataflowWorker.java:383)
    	at com.google.cloud.dataflow.worker.BatchDataflowWorker.doWork(BatchDataflowWorker.java:355)
    	at com.google.cloud.dataflow.worker.BatchDataflowWorker.getAndPerformWork(BatchDataflowWorker.java:286)
    	at com.google.cloud.dataflow.worker.DataflowBatchWorkerHarness$WorkerThread.doWork(DataflowBatchWorkerHarness.java:134)
    	at com.google.cloud.dataflow.worker.DataflowBatchWorkerHarness$WorkerThread.call(DataflowBatchWorkerHarness.java:114)
    	at com.google.cloud.dataflow.worker.DataflowBatchWorkerHarness$WorkerThread.call(DataflowBatchWorkerHarness.java:101)
    	at java.util.concurrent.FutureTask.run(FutureTask.java:266)
    	at java.util.concurrent.ThreadPoolExecutor.runWorker(ThreadPoolExecutor.java:1142)
    	at java.util.concurrent.ThreadPoolExecutor$Worker.run(ThreadPoolExecutor.java:617)
    	at java.lang.Thread.run(Thread.java:745)
    java.lang.AbstractMethodError: org.apache.beam.runners.core.SimpleDoFnRunner$DoFnProcessContext.element(Lorg/apache/beam/sdk/transforms/DoFn;)Ljava/lang/Object;
    	at org.apache.beam.sdk.transforms.ParDoTest$TestDoFn$DoFnInvoker.invokeProcessElement(Unknown
Source)
    	at org.apache.beam.runners.core.SimpleDoFnRunner.invokeProcessElement(SimpleDoFnRunner.java:177)
    	at org.apache.beam.runners.core.SimpleDoFnRunner.processElement(SimpleDoFnRunner.java:138)
    	at com.google.cloud.dataflow.worker.SimpleParDoFn.processElement(SimpleParDoFn.java:323)
    	at com.google.cloud.dataflow.worker.util.common.worker.ParDoOperation.process(ParDoOperation.java:43)
    	at com.google.cloud.dataflow.worker.util.common.worker.OutputReceiver.process(OutputReceiver.java:48)
    	at com.google.cloud.dataflow.worker.util.common.worker.ReadOperation.runReadLoop(ReadOperation.java:200)
    	at com.google.cloud.dataflow.worker.util.common.worker.ReadOperation.start(ReadOperation.java:158)
    	at com.google.cloud.dataflow.worker.util.common.worker.MapTaskExecutor.execute(MapTaskExecutor.java:75)
    	at com.google.cloud.dataflow.worker.BatchDataflowWorker.executeWork(BatchDataflowWorker.java:383)
    	at com.google.cloud.dataflow.worker.BatchDataflowWorker.doWork(BatchDataflowWorker.java:355)
    	at com.google.cloud.dataflow.worker.BatchDataflowWorker.getAndPerformWork(BatchDataflowWorker.java:286)
    	at com.google.cloud.dataflow.worker.DataflowBatchWorkerHarness$WorkerThread.doWork(DataflowBatchWorkerHarness.java:134)
    	at com.google.cloud.dataflow.worker.DataflowBatchWorkerHarness$WorkerThread.call(DataflowBatchWorkerHarness.java:114)
    	at com.google.cloud.dataflow.worker.DataflowBatchWorkerHarness$WorkerThread.call(DataflowBatchWorkerHarness.java:101)
    	at java.util.concurrent.FutureTask.run(FutureTask.java:266)
    	at java.util.concurrent.ThreadPoolExecutor.runWorker(ThreadPoolExecutor.java:1142)
    	at java.util.concurrent.ThreadPoolExecutor$Worker.run(ThreadPoolExecutor.java:617)
    	at java.lang.Thread.run(Thread.java:745)
    java.lang.AbstractMethodError: org.apache.beam.runners.core.SimpleDoFnRunner$DoFnProcessContext.element(Lorg/apache/beam/sdk/transforms/DoFn;)Ljava/lang/Object;
    	at org.apache.beam.sdk.transforms.ParDoTest$TestDoFn$DoFnInvoker.invokeProcessElement(Unknown
Source)
    	at org.apache.beam.runners.core.SimpleDoFnRunner.invokeProcessElement(SimpleDoFnRunner.java:177)
    	at org.apache.beam.runners.core.SimpleDoFnRunner.processElement(SimpleDoFnRunner.java:138)
    	at com.google.cloud.dataflow.worker.SimpleParDoFn.processElement(SimpleParDoFn.java:323)
    	at com.google.cloud.dataflow.worker.util.common.worker.ParDoOperation.process(ParDoOperation.java:43)
    	at com.google.cloud.dataflow.worker.util.common.worker.OutputReceiver.process(OutputReceiver.java:48)
    	at com.google.cloud.dataflow.worker.util.common.worker.ReadOperation.runReadLoop(ReadOperation.java:200)
    	at com.google.cloud.dataflow.worker.util.common.worker.ReadOperation.start(ReadOperation.java:158)
    	at com.google.cloud.dataflow.worker.util.common.worker.MapTaskExecutor.execute(MapTaskExecutor.java:75)
    	at com.google.cloud.dataflow.worker.BatchDataflowWorker.executeWork(BatchDataflowWorker.java:383)
    	at com.google.cloud.dataflow.worker.BatchDataflowWorker.doWork(BatchDataflowWorker.java:355)
    	at com.google.cloud.dataflow.worker.BatchDataflowWorker.getAndPerformWork(BatchDataflowWorker.java:286)
    	at com.google.cloud.dataflow.worker.DataflowBatchWorkerHarness$WorkerThread.doWork(DataflowBatchWorkerHarness.java:134)
    	at com.google.cloud.dataflow.worker.DataflowBatchWorkerHarness$WorkerThread.call(DataflowBatchWorkerHarness.java:114)
    	at com.google.cloud.dataflow.worker.DataflowBatchWorkerHarness$WorkerThread.call(DataflowBatchWorkerHarness.java:101)
    	at java.util.concurrent.FutureTask.run(FutureTask.java:266)
    	at java.util.concurrent.ThreadPoolExecutor.runWorker(ThreadPoolExecutor.java:1142)
    	at java.util.concurrent.ThreadPoolExecutor$Worker.run(ThreadPoolExecutor.java:617)
    	at java.lang.Thread.run(Thread.java:745)
    java.lang.AbstractMethodError: org.apache.beam.runners.core.SimpleDoFnRunner$DoFnProcessContext.element(Lorg/apache/beam/sdk/transforms/DoFn;)Ljava/lang/Object;
    	at org.apache.beam.sdk.transforms.ParDoTest$TestDoFn$DoFnInvoker.invokeProcessElement(Unknown
Source)
    	at org.apache.beam.runners.core.SimpleDoFnRunner.invokeProcessElement(SimpleDoFnRunner.java:177)
    	at org.apache.beam.runners.core.SimpleDoFnRunner.processElement(SimpleDoFnRunner.java:138)
    	at com.google.cloud.dataflow.worker.SimpleParDoFn.processElement(SimpleParDoFn.java:323)
    	at com.google.cloud.dataflow.worker.util.common.worker.ParDoOperation.process(ParDoOperation.java:43)
    	at com.google.cloud.dataflow.worker.util.common.worker.OutputReceiver.process(OutputReceiver.java:48)
    	at com.google.cloud.dataflow.worker.util.common.worker.ReadOperation.runReadLoop(ReadOperation.java:200)
    	at com.google.cloud.dataflow.worker.util.common.worker.ReadOperation.start(ReadOperation.java:158)
    	at com.google.cloud.dataflow.worker.util.common.worker.MapTaskExecutor.execute(MapTaskExecutor.java:75)
    	at com.google.cloud.dataflow.worker.BatchDataflowWorker.executeWork(BatchDataflowWorker.java:383)
    	at com.google.cloud.dataflow.worker.BatchDataflowWorker.doWork(BatchDataflowWorker.java:355)
    	at com.google.cloud.dataflow.worker.BatchDataflowWorker.getAndPerformWork(BatchDataflowWorker.java:286)
    	at com.google.cloud.dataflow.worker.DataflowBatchWorkerHarness$WorkerThread.doWork(DataflowBatchWorkerHarness.java:134)
    	at com.google.cloud.dataflow.worker.DataflowBatchWorkerHarness$WorkerThread.call(DataflowBatchWorkerHarness.java:114)
    	at com.google.cloud.dataflow.worker.DataflowBatchWorkerHarness$WorkerThread.call(DataflowBatchWorkerHarness.java:101)
    	at java.util.concurrent.FutureTask.run(FutureTask.java:266)
    	at java.util.concurrent.ThreadPoolExecutor.runWorker(ThreadPoolExecutor.java:1142)
    	at java.util.concurrent.ThreadPoolExecutor$Worker.run(ThreadPoolExecutor.java:617)
    	at java.lang.Thread.run(Thread.java:745)
    Workflow failed. Causes: S28:Create.Values/Read(CreateSource)+ParDo(Test)+PAssert$53/GroupGlobally/Window.Into()/Window.Assign+PAssert$53/GroupGlobally/GatherAllOutputs/Reify.Window/ParDo(Anonymous)+PAssert$53/GroupGlobally/GatherAllOutputs/WithKeys/AddKeys/Map+PAssert$53/GroupGlobally/GatherAllOutputs/Window.Into()/Window.Assign+PAssert$53/GroupGlobally/GatherAllOutputs/GroupByKey/Reify+PAssert$53/GroupGlobally/GatherAllOutputs/GroupByKey/Write
failed., A work item was attempted 4 times without success. Each time the worker eventually
lost contact with the service. The work item was attempted on: 
      pardotest0testpardowithsi-05031920-jskb-harness-68k5,
      pardotest0testpardowithsi-05031920-jskb-harness-68k5,
      pardotest0testpardowithsi-05031920-jskb-harness-68k5,
      pardotest0testpardowithsi-05031920-jskb-harness-68k5
        at org.apache.beam.runners.dataflow.TestDataflowRunner.run(TestDataflowRunner.java:134)
        at org.apache.beam.runners.dataflow.TestDataflowRunner.run(TestDataflowRunner.java:90)
        at org.apache.beam.runners.dataflow.TestDataflowRunner.run(TestDataflowRunner.java:55)
        at org.apache.beam.sdk.Pipeline.run(Pipeline.java:311)
        at org.apache.beam.sdk.testing.TestPipeline.run(TestPipeline.java:346)
        at org.apache.beam.sdk.testing.TestPipeline.run(TestPipeline.java:328)
        at org.apache.beam.sdk.transforms.ParDoTest.testParDoWithSideInputsIsCumulative(ParDoTest.java:618)

Gradle Test Executor 48 finished executing tests.

> Task :beam-runners-google-cloud-dataflow-java:validatesRunnerTest FAILED

269 tests completed, 35 failed, 2 skipped
Finished generating test XML results (0.593 secs) into: <https://builds.apache.org/job/beam_PostCommit_Java_ValidatesRunner_Dataflow_Gradle/ws/src/runners/google-cloud-dataflow-java/build/test-results/validatesRunnerTest>
Generating HTML test report...
Finished generating test html results (0.45 secs) into: <https://builds.apache.org/job/beam_PostCommit_Java_ValidatesRunner_Dataflow_Gradle/ws/src/runners/google-cloud-dataflow-java/build/reports/tests/validatesRunnerTest>
:beam-runners-google-cloud-dataflow-java:validatesRunnerTest (Thread[Task worker for ':' Thread
35,5,main]) completed. Took 2 hrs 36 mins 42.237 secs.

FAILURE: Build failed with an exception.

* What went wrong:
Execution failed for task ':beam-runners-google-cloud-dataflow-java:validatesRunnerTest'.
> There were failing tests. See the report at: file://<https://builds.apache.org/job/beam_PostCommit_Java_ValidatesRunner_Dataflow_Gradle/ws/src/runners/google-cloud-dataflow-java/build/reports/tests/validatesRunnerTest/index.html>

* Try:
Run with --stacktrace option to get the stack trace. Run with --debug option to get more log
output. Run with --scan to get full insights.

* Get more help at https://help.gradle.org

Deprecated Gradle features were used in this build, making it incompatible with Gradle 5.0.
See https://docs.gradle.org/4.7/userguide/command_line_interface.html#sec:command_line_warnings

BUILD FAILED in 2h 37m 55s
38 actionable tasks: 34 executed, 4 from cache

Publishing build scan...
https://gradle.com/s/5wl7phi773gvk

Build step 'Invoke Gradle script' changed build result to FAILURE
Build step 'Invoke Gradle script' marked build as failure
Recording test results
Not sending mail to unregistered user sidhom@google.com
Not sending mail to unregistered user ccy@google.com
Not sending mail to unregistered user 7542791+rezarokni@users.noreply.github.com
Not sending mail to unregistered user geet.kumar75@gmail.com
Not sending mail to unregistered user owenzhang1990@gmail.com
Not sending mail to unregistered user swegner2@gmail.com
Not sending mail to unregistered user kirpichov@google.com
Not sending mail to unregistered user mairbek@google.com
Not sending mail to unregistered user pgerver@us.ibm.com
Not sending mail to unregistered user djiofack007@gmail.com
Not sending mail to unregistered user aromanenko.dev@gmail.com
Not sending mail to unregistered user apilloud@google.com
Not sending mail to unregistered user 1147435+chuanyu@users.noreply.github.com
Not sending mail to unregistered user aaltay@gmail.com
Not sending mail to unregistered user szewinho@gmail.com
Not sending mail to unregistered user ehudm@google.com
Not sending mail to unregistered user ankurgoenka@gmail.com
Not sending mail to unregistered user bbassingthwaite@vendasta.com
Not sending mail to unregistered user lukasz.gajowy@polidea.com
Not sending mail to unregistered user rober@frantil.com
Not sending mail to unregistered user relax@relax-macbookpro2.roam.corp.google.com
Not sending mail to unregistered user alan.myrvold@comcast.net
Not sending mail to unregistered user herohde@google.com
Not sending mail to unregistered user timrobertson100@gmail.com
Not sending mail to unregistered user valentyn@google.com
Not sending mail to unregistered user wcn@google.com
Not sending mail to unregistered user github@alasdairhodge.co.uk
Not sending mail to unregistered user aljoscha.krettek@gmail.com
Not sending mail to unregistered user jasonkuster@google.com
Not sending mail to unregistered user axelmagn@gmail.com
Not sending mail to unregistered user swegner@google.com
Not sending mail to unregistered user yifanzou@yifanzou-linuxworkstation.sea.corp.google.com
Not sending mail to unregistered user rezarokni@google.com
Not sending mail to unregistered user XuMingmin@users.noreply.github.com
Not sending mail to unregistered user amyrvold@google.com
Not sending mail to unregistered user kedin@google.com
Not sending mail to unregistered user daniel.o.programmer@gmail.com
Not sending mail to unregistered user ekirpichov@gmail.com
Not sending mail to unregistered user katarzyna.kucharczyk@polidea.com
Not sending mail to unregistered user shoyer@google.com

Mime
View raw message