beam-commits mailing list archives

Site index · List index
Message view « Date » · « Thread »
Top « Date » · « Thread »
From Apache Jenkins Server <jenk...@builds.apache.org>
Subject Build failed in Jenkins: beam_PostCommit_Python_ValidatesRunner_Dataflow #1672
Date Wed, 16 May 2018 22:08:43 GMT
See <https://builds.apache.org/job/beam_PostCommit_Python_ValidatesRunner_Dataflow/1672/display/redirect>

------------------------------------------
[...truncated 154.38 KB...]
  File "<https://builds.apache.org/job/beam_PostCommit_Python_ValidatesRunner_Dataflow/ws/src/sdks/python/apache_beam/testing/test_pipeline.py",>
line 102, in run
    result = super(TestPipeline, self).run(test_runner_api)
  File "<https://builds.apache.org/job/beam_PostCommit_Python_ValidatesRunner_Dataflow/ws/src/sdks/python/apache_beam/pipeline.py",>
line 389, in run
    self.to_runner_api(), self.runner, self._options).run(False)
  File "<https://builds.apache.org/job/beam_PostCommit_Python_ValidatesRunner_Dataflow/ws/src/sdks/python/apache_beam/pipeline.py",>
line 402, in run
    return self.runner.run_pipeline(self)
  File "<https://builds.apache.org/job/beam_PostCommit_Python_ValidatesRunner_Dataflow/ws/src/sdks/python/apache_beam/runners/dataflow/test_dataflow_runner.py",>
line 48, in run_pipeline
    self.result = super(TestDataflowRunner, self).run_pipeline(pipeline)
  File "<https://builds.apache.org/job/beam_PostCommit_Python_ValidatesRunner_Dataflow/ws/src/sdks/python/apache_beam/runners/dataflow/dataflow_runner.py",>
line 362, in run_pipeline
    self.dataflow_client.create_job(self.job), self)
  File "<https://builds.apache.org/job/beam_PostCommit_Python_ValidatesRunner_Dataflow/ws/src/sdks/python/apache_beam/utils/retry.py",>
line 180, in wrapper
    return fun(*args, **kwargs)
  File "<https://builds.apache.org/job/beam_PostCommit_Python_ValidatesRunner_Dataflow/ws/src/sdks/python/apache_beam/runners/dataflow/internal/apiclient.py",>
line 485, in create_job
    self.create_job_description(job)
  File "<https://builds.apache.org/job/beam_PostCommit_Python_ValidatesRunner_Dataflow/ws/src/sdks/python/apache_beam/runners/dataflow/internal/apiclient.py",>
line 511, in create_job_description
    StringIO(job.proto_pipeline.SerializeToString()))
  File "<https://builds.apache.org/job/beam_PostCommit_Python_ValidatesRunner_Dataflow/ws/src/sdks/python/apache_beam/runners/dataflow/internal/apiclient.py",>
line 467, in stage_file
    response = self._storage_client.objects.Insert(request, upload=upload)
  File "<https://builds.apache.org/job/beam_PostCommit_Python_ValidatesRunner_Dataflow/ws/src/sdks/python/apache_beam/io/gcp/internal/clients/storage/storage_v1_client.py",>
line 971, in Insert
    download=download)
  File "<https://builds.apache.org/job/beam_PostCommit_Python_ValidatesRunner_Dataflow/ws/src/sdks/python/local/lib/python2.7/site-packages/apitools/base/py/base_api.py",>
line 720, in _RunMethod
    http, http_request, **opts)
  File "<https://builds.apache.org/job/beam_PostCommit_Python_ValidatesRunner_Dataflow/ws/src/sdks/python/local/lib/python2.7/site-packages/apitools/base/py/http_wrapper.py",>
line 346, in MakeRequest
    check_response_func=check_response_func)
  File "<https://builds.apache.org/job/beam_PostCommit_Python_ValidatesRunner_Dataflow/ws/src/sdks/python/local/lib/python2.7/site-packages/apitools/base/py/http_wrapper.py",>
line 396, in _MakeRequestNoRetry
    redirections=redirections, connection_type=connection_type)
  File "<https://builds.apache.org/job/beam_PostCommit_Python_ValidatesRunner_Dataflow/ws/src/sdks/python/local/lib/python2.7/site-packages/oauth2client/transport.py",>
line 175, in new_request
    redirections, connection_type)
  File "<https://builds.apache.org/job/beam_PostCommit_Python_ValidatesRunner_Dataflow/ws/src/sdks/python/local/lib/python2.7/site-packages/oauth2client/transport.py",>
line 282, in request
    connection_type=connection_type)
  File "<https://builds.apache.org/job/beam_PostCommit_Python_ValidatesRunner_Dataflow/ws/src/sdks/python/local/lib/python2.7/site-packages/httplib2/__init__.py",>
line 1609, in request
    (response, content) = self._request(conn, authority, uri, request_uri, method, body, headers,
redirections, cachekey)
  File "<https://builds.apache.org/job/beam_PostCommit_Python_ValidatesRunner_Dataflow/ws/src/sdks/python/local/lib/python2.7/site-packages/httplib2/__init__.py",>
line 1351, in _request
    (response, content) = self._conn_request(conn, request_uri, method, body, headers)
  File "<https://builds.apache.org/job/beam_PostCommit_Python_ValidatesRunner_Dataflow/ws/src/sdks/python/local/lib/python2.7/site-packages/httplib2/__init__.py",>
line 1307, in _conn_request
    response = conn.getresponse()
  File "/usr/lib/python2.7/httplib.py", line 1136, in getresponse
    response.begin()
  File "/usr/lib/python2.7/httplib.py", line 453, in begin
    version, status, reason = self._read_status()
  File "/usr/lib/python2.7/httplib.py", line 409, in _read_status
    line = self.fp.readline(_MAXLINE + 1)
  File "/usr/lib/python2.7/socket.py", line 480, in readline
    data = self._sock.recv(self._rbufsize)
  File "/usr/lib/python2.7/ssl.py", line 756, in recv
    return self.read(buflen)
  File "/usr/lib/python2.7/ssl.py", line 643, in read
    v = self._sslobj.read(len)
  File "<https://builds.apache.org/job/beam_PostCommit_Python_ValidatesRunner_Dataflow/ws/src/sdks/python/local/lib/python2.7/site-packages/nose/plugins/multiprocess.py",>
line 276, in signalhandler
    raise TimedOutException()
TimedOutException: 'test_multi_valued_singleton_side_input (apache_beam.transforms.sideinputs_test.SideInputsTest)'

======================================================================
ERROR: test_multiple_empty_outputs (apache_beam.transforms.ptransform_test.PTransformTest)
----------------------------------------------------------------------
Traceback (most recent call last):
  File "<https://builds.apache.org/job/beam_PostCommit_Python_ValidatesRunner_Dataflow/ws/src/sdks/python/local/lib/python2.7/site-packages/nose/plugins/multiprocess.py",>
line 812, in run
    test(orig)
  File "<https://builds.apache.org/job/beam_PostCommit_Python_ValidatesRunner_Dataflow/ws/src/sdks/python/local/lib/python2.7/site-packages/nose/case.py",>
line 45, in __call__
    return self.run(*arg, **kwarg)
  File "<https://builds.apache.org/job/beam_PostCommit_Python_ValidatesRunner_Dataflow/ws/src/sdks/python/local/lib/python2.7/site-packages/nose/case.py",>
line 133, in run
    self.runTest(result)
  File "<https://builds.apache.org/job/beam_PostCommit_Python_ValidatesRunner_Dataflow/ws/src/sdks/python/local/lib/python2.7/site-packages/nose/case.py",>
line 151, in runTest
    test(result)
  File "/usr/lib/python2.7/unittest/case.py", line 393, in __call__
    return self.run(*args, **kwds)
  File "/usr/lib/python2.7/unittest/case.py", line 329, in run
    testMethod()
  File "<https://builds.apache.org/job/beam_PostCommit_Python_ValidatesRunner_Dataflow/ws/src/sdks/python/apache_beam/transforms/ptransform_test.py",>
line 271, in test_multiple_empty_outputs
    pipeline.run()
  File "<https://builds.apache.org/job/beam_PostCommit_Python_ValidatesRunner_Dataflow/ws/src/sdks/python/apache_beam/testing/test_pipeline.py",>
line 102, in run
    result = super(TestPipeline, self).run(test_runner_api)
  File "<https://builds.apache.org/job/beam_PostCommit_Python_ValidatesRunner_Dataflow/ws/src/sdks/python/apache_beam/pipeline.py",>
line 389, in run
    self.to_runner_api(), self.runner, self._options).run(False)
  File "<https://builds.apache.org/job/beam_PostCommit_Python_ValidatesRunner_Dataflow/ws/src/sdks/python/apache_beam/pipeline.py",>
line 402, in run
    return self.runner.run_pipeline(self)
  File "<https://builds.apache.org/job/beam_PostCommit_Python_ValidatesRunner_Dataflow/ws/src/sdks/python/apache_beam/runners/dataflow/test_dataflow_runner.py",>
line 67, in run_pipeline
    self.wait_until_in_state(PipelineState.CANCELLED, timeout=300)
  File "<https://builds.apache.org/job/beam_PostCommit_Python_ValidatesRunner_Dataflow/ws/src/sdks/python/apache_beam/runners/dataflow/test_dataflow_runner.py",>
line 87, in wait_until_in_state
    job_state = self.result.state
  File "<https://builds.apache.org/job/beam_PostCommit_Python_ValidatesRunner_Dataflow/ws/src/sdks/python/apache_beam/runners/dataflow/dataflow_runner.py",>
line 1033, in state
    self._update_job()
  File "<https://builds.apache.org/job/beam_PostCommit_Python_ValidatesRunner_Dataflow/ws/src/sdks/python/apache_beam/runners/dataflow/dataflow_runner.py",>
line 1011, in _update_job
    self._job = self._runner.dataflow_client.get_job(self.job_id())
  File "<https://builds.apache.org/job/beam_PostCommit_Python_ValidatesRunner_Dataflow/ws/src/sdks/python/apache_beam/utils/retry.py",>
line 180, in wrapper
    return fun(*args, **kwargs)
  File "<https://builds.apache.org/job/beam_PostCommit_Python_ValidatesRunner_Dataflow/ws/src/sdks/python/apache_beam/runners/dataflow/internal/apiclient.py",>
line 624, in get_job
    response = self._client.projects_locations_jobs.Get(request)
  File "<https://builds.apache.org/job/beam_PostCommit_Python_ValidatesRunner_Dataflow/ws/src/sdks/python/apache_beam/runners/dataflow/internal/clients/dataflow/dataflow_v1b3_client.py",>
line 656, in Get
    config, request, global_params=global_params)
  File "<https://builds.apache.org/job/beam_PostCommit_Python_ValidatesRunner_Dataflow/ws/src/sdks/python/local/lib/python2.7/site-packages/apitools/base/py/base_api.py",>
line 720, in _RunMethod
    http, http_request, **opts)
  File "<https://builds.apache.org/job/beam_PostCommit_Python_ValidatesRunner_Dataflow/ws/src/sdks/python/local/lib/python2.7/site-packages/apitools/base/py/http_wrapper.py",>
line 346, in MakeRequest
    check_response_func=check_response_func)
  File "<https://builds.apache.org/job/beam_PostCommit_Python_ValidatesRunner_Dataflow/ws/src/sdks/python/local/lib/python2.7/site-packages/apitools/base/py/http_wrapper.py",>
line 396, in _MakeRequestNoRetry
    redirections=redirections, connection_type=connection_type)
  File "<https://builds.apache.org/job/beam_PostCommit_Python_ValidatesRunner_Dataflow/ws/src/sdks/python/local/lib/python2.7/site-packages/oauth2client/transport.py",>
line 175, in new_request
    redirections, connection_type)
  File "<https://builds.apache.org/job/beam_PostCommit_Python_ValidatesRunner_Dataflow/ws/src/sdks/python/local/lib/python2.7/site-packages/oauth2client/transport.py",>
line 282, in request
    connection_type=connection_type)
  File "<https://builds.apache.org/job/beam_PostCommit_Python_ValidatesRunner_Dataflow/ws/src/sdks/python/local/lib/python2.7/site-packages/httplib2/__init__.py",>
line 1609, in request
    (response, content) = self._request(conn, authority, uri, request_uri, method, body, headers,
redirections, cachekey)
  File "<https://builds.apache.org/job/beam_PostCommit_Python_ValidatesRunner_Dataflow/ws/src/sdks/python/local/lib/python2.7/site-packages/httplib2/__init__.py",>
line 1351, in _request
    (response, content) = self._conn_request(conn, request_uri, method, body, headers)
  File "<https://builds.apache.org/job/beam_PostCommit_Python_ValidatesRunner_Dataflow/ws/src/sdks/python/local/lib/python2.7/site-packages/httplib2/__init__.py",>
line 1307, in _conn_request
    response = conn.getresponse()
  File "/usr/lib/python2.7/httplib.py", line 1136, in getresponse
    response.begin()
  File "/usr/lib/python2.7/httplib.py", line 453, in begin
    version, status, reason = self._read_status()
  File "/usr/lib/python2.7/httplib.py", line 409, in _read_status
    line = self.fp.readline(_MAXLINE + 1)
  File "/usr/lib/python2.7/socket.py", line 480, in readline
    data = self._sock.recv(self._rbufsize)
  File "/usr/lib/python2.7/ssl.py", line 756, in recv
    return self.read(buflen)
  File "/usr/lib/python2.7/ssl.py", line 643, in read
    v = self._sslobj.read(len)
  File "<https://builds.apache.org/job/beam_PostCommit_Python_ValidatesRunner_Dataflow/ws/src/sdks/python/local/lib/python2.7/site-packages/nose/plugins/multiprocess.py",>
line 276, in signalhandler
    raise TimedOutException()
TimedOutException: 'test_multiple_empty_outputs (apache_beam.transforms.ptransform_test.PTransformTest)'

======================================================================
ERROR: test_par_do_with_multiple_outputs_and_using_return (apache_beam.transforms.ptransform_test.PTransformTest)
----------------------------------------------------------------------
Traceback (most recent call last):
  File "<https://builds.apache.org/job/beam_PostCommit_Python_ValidatesRunner_Dataflow/ws/src/sdks/python/local/lib/python2.7/site-packages/nose/plugins/multiprocess.py",>
line 812, in run
    test(orig)
  File "<https://builds.apache.org/job/beam_PostCommit_Python_ValidatesRunner_Dataflow/ws/src/sdks/python/local/lib/python2.7/site-packages/nose/case.py",>
line 45, in __call__
    return self.run(*arg, **kwarg)
  File "<https://builds.apache.org/job/beam_PostCommit_Python_ValidatesRunner_Dataflow/ws/src/sdks/python/local/lib/python2.7/site-packages/nose/case.py",>
line 133, in run
    self.runTest(result)
  File "<https://builds.apache.org/job/beam_PostCommit_Python_ValidatesRunner_Dataflow/ws/src/sdks/python/local/lib/python2.7/site-packages/nose/case.py",>
line 151, in runTest
    test(result)
  File "/usr/lib/python2.7/unittest/case.py", line 393, in __call__
    return self.run(*args, **kwds)
  File "/usr/lib/python2.7/unittest/case.py", line 329, in run
    testMethod()
  File "<https://builds.apache.org/job/beam_PostCommit_Python_ValidatesRunner_Dataflow/ws/src/sdks/python/apache_beam/transforms/ptransform_test.py",>
line 244, in test_par_do_with_multiple_outputs_and_using_return
    pipeline.run()
  File "<https://builds.apache.org/job/beam_PostCommit_Python_ValidatesRunner_Dataflow/ws/src/sdks/python/apache_beam/testing/test_pipeline.py",>
line 102, in run
    result = super(TestPipeline, self).run(test_runner_api)
  File "<https://builds.apache.org/job/beam_PostCommit_Python_ValidatesRunner_Dataflow/ws/src/sdks/python/apache_beam/pipeline.py",>
line 389, in run
    self.to_runner_api(), self.runner, self._options).run(False)
  File "<https://builds.apache.org/job/beam_PostCommit_Python_ValidatesRunner_Dataflow/ws/src/sdks/python/apache_beam/pipeline.py",>
line 402, in run
    return self.runner.run_pipeline(self)
  File "<https://builds.apache.org/job/beam_PostCommit_Python_ValidatesRunner_Dataflow/ws/src/sdks/python/apache_beam/runners/dataflow/test_dataflow_runner.py",>
line 67, in run_pipeline
    self.wait_until_in_state(PipelineState.CANCELLED, timeout=300)
  File "<https://builds.apache.org/job/beam_PostCommit_Python_ValidatesRunner_Dataflow/ws/src/sdks/python/apache_beam/runners/dataflow/test_dataflow_runner.py",>
line 87, in wait_until_in_state
    job_state = self.result.state
  File "<https://builds.apache.org/job/beam_PostCommit_Python_ValidatesRunner_Dataflow/ws/src/sdks/python/apache_beam/runners/dataflow/dataflow_runner.py",>
line 1033, in state
    self._update_job()
  File "<https://builds.apache.org/job/beam_PostCommit_Python_ValidatesRunner_Dataflow/ws/src/sdks/python/apache_beam/runners/dataflow/dataflow_runner.py",>
line 1011, in _update_job
    self._job = self._runner.dataflow_client.get_job(self.job_id())
  File "<https://builds.apache.org/job/beam_PostCommit_Python_ValidatesRunner_Dataflow/ws/src/sdks/python/apache_beam/utils/retry.py",>
line 180, in wrapper
    return fun(*args, **kwargs)
  File "<https://builds.apache.org/job/beam_PostCommit_Python_ValidatesRunner_Dataflow/ws/src/sdks/python/apache_beam/runners/dataflow/internal/apiclient.py",>
line 624, in get_job
    response = self._client.projects_locations_jobs.Get(request)
  File "<https://builds.apache.org/job/beam_PostCommit_Python_ValidatesRunner_Dataflow/ws/src/sdks/python/apache_beam/runners/dataflow/internal/clients/dataflow/dataflow_v1b3_client.py",>
line 656, in Get
    config, request, global_params=global_params)
  File "<https://builds.apache.org/job/beam_PostCommit_Python_ValidatesRunner_Dataflow/ws/src/sdks/python/local/lib/python2.7/site-packages/apitools/base/py/base_api.py",>
line 720, in _RunMethod
    http, http_request, **opts)
  File "<https://builds.apache.org/job/beam_PostCommit_Python_ValidatesRunner_Dataflow/ws/src/sdks/python/local/lib/python2.7/site-packages/apitools/base/py/http_wrapper.py",>
line 346, in MakeRequest
    check_response_func=check_response_func)
  File "<https://builds.apache.org/job/beam_PostCommit_Python_ValidatesRunner_Dataflow/ws/src/sdks/python/local/lib/python2.7/site-packages/apitools/base/py/http_wrapper.py",>
line 396, in _MakeRequestNoRetry
    redirections=redirections, connection_type=connection_type)
  File "<https://builds.apache.org/job/beam_PostCommit_Python_ValidatesRunner_Dataflow/ws/src/sdks/python/local/lib/python2.7/site-packages/oauth2client/transport.py",>
line 175, in new_request
    redirections, connection_type)
  File "<https://builds.apache.org/job/beam_PostCommit_Python_ValidatesRunner_Dataflow/ws/src/sdks/python/local/lib/python2.7/site-packages/oauth2client/transport.py",>
line 282, in request
    connection_type=connection_type)
  File "<https://builds.apache.org/job/beam_PostCommit_Python_ValidatesRunner_Dataflow/ws/src/sdks/python/local/lib/python2.7/site-packages/httplib2/__init__.py",>
line 1609, in request
    (response, content) = self._request(conn, authority, uri, request_uri, method, body, headers,
redirections, cachekey)
  File "<https://builds.apache.org/job/beam_PostCommit_Python_ValidatesRunner_Dataflow/ws/src/sdks/python/local/lib/python2.7/site-packages/httplib2/__init__.py",>
line 1351, in _request
    (response, content) = self._conn_request(conn, request_uri, method, body, headers)
  File "<https://builds.apache.org/job/beam_PostCommit_Python_ValidatesRunner_Dataflow/ws/src/sdks/python/local/lib/python2.7/site-packages/httplib2/__init__.py",>
line 1307, in _conn_request
    response = conn.getresponse()
  File "/usr/lib/python2.7/httplib.py", line 1136, in getresponse
    response.begin()
  File "/usr/lib/python2.7/httplib.py", line 453, in begin
    version, status, reason = self._read_status()
  File "/usr/lib/python2.7/httplib.py", line 409, in _read_status
    line = self.fp.readline(_MAXLINE + 1)
  File "/usr/lib/python2.7/socket.py", line 480, in readline
    data = self._sock.recv(self._rbufsize)
  File "/usr/lib/python2.7/ssl.py", line 756, in recv
    return self.read(buflen)
  File "/usr/lib/python2.7/ssl.py", line 643, in read
    v = self._sslobj.read(len)
  File "<https://builds.apache.org/job/beam_PostCommit_Python_ValidatesRunner_Dataflow/ws/src/sdks/python/local/lib/python2.7/site-packages/nose/plugins/multiprocess.py",>
line 276, in signalhandler
    raise TimedOutException()
TimedOutException: 'test_par_do_with_multiple_outputs_and_using_return (apache_beam.transforms.ptransform_test.PTransformTest)'

======================================================================
ERROR: test_par_do_with_multiple_outputs_and_using_yield (apache_beam.transforms.ptransform_test.PTransformTest)
----------------------------------------------------------------------
Traceback (most recent call last):
  File "<https://builds.apache.org/job/beam_PostCommit_Python_ValidatesRunner_Dataflow/ws/src/sdks/python/local/lib/python2.7/site-packages/nose/plugins/multiprocess.py",>
line 812, in run
    test(orig)
  File "<https://builds.apache.org/job/beam_PostCommit_Python_ValidatesRunner_Dataflow/ws/src/sdks/python/local/lib/python2.7/site-packages/nose/case.py",>
line 45, in __call__
    return self.run(*arg, **kwarg)
  File "<https://builds.apache.org/job/beam_PostCommit_Python_ValidatesRunner_Dataflow/ws/src/sdks/python/local/lib/python2.7/site-packages/nose/case.py",>
line 133, in run
    self.runTest(result)
  File "<https://builds.apache.org/job/beam_PostCommit_Python_ValidatesRunner_Dataflow/ws/src/sdks/python/local/lib/python2.7/site-packages/nose/case.py",>
line 151, in runTest
    test(result)
  File "/usr/lib/python2.7/unittest/case.py", line 393, in __call__
    return self.run(*args, **kwds)
  File "/usr/lib/python2.7/unittest/case.py", line 329, in run
    testMethod()
  File "<https://builds.apache.org/job/beam_PostCommit_Python_ValidatesRunner_Dataflow/ws/src/sdks/python/apache_beam/transforms/ptransform_test.py",>
line 228, in test_par_do_with_multiple_outputs_and_using_yield
    pipeline.run()
  File "<https://builds.apache.org/job/beam_PostCommit_Python_ValidatesRunner_Dataflow/ws/src/sdks/python/apache_beam/testing/test_pipeline.py",>
line 102, in run
    result = super(TestPipeline, self).run(test_runner_api)
  File "<https://builds.apache.org/job/beam_PostCommit_Python_ValidatesRunner_Dataflow/ws/src/sdks/python/apache_beam/pipeline.py",>
line 389, in run
    self.to_runner_api(), self.runner, self._options).run(False)
  File "<https://builds.apache.org/job/beam_PostCommit_Python_ValidatesRunner_Dataflow/ws/src/sdks/python/apache_beam/pipeline.py",>
line 402, in run
    return self.runner.run_pipeline(self)
  File "<https://builds.apache.org/job/beam_PostCommit_Python_ValidatesRunner_Dataflow/ws/src/sdks/python/apache_beam/runners/dataflow/test_dataflow_runner.py",>
line 66, in run_pipeline
    self.result.cancel()
  File "<https://builds.apache.org/job/beam_PostCommit_Python_ValidatesRunner_Dataflow/ws/src/sdks/python/apache_beam/runners/dataflow/dataflow_runner.py",>
line 1116, in cancel
    return self.state
  File "<https://builds.apache.org/job/beam_PostCommit_Python_ValidatesRunner_Dataflow/ws/src/sdks/python/apache_beam/runners/dataflow/dataflow_runner.py",>
line 1033, in state
    self._update_job()
  File "<https://builds.apache.org/job/beam_PostCommit_Python_ValidatesRunner_Dataflow/ws/src/sdks/python/apache_beam/runners/dataflow/dataflow_runner.py",>
line 1011, in _update_job
    self._job = self._runner.dataflow_client.get_job(self.job_id())
  File "<https://builds.apache.org/job/beam_PostCommit_Python_ValidatesRunner_Dataflow/ws/src/sdks/python/apache_beam/utils/retry.py",>
line 180, in wrapper
    return fun(*args, **kwargs)
  File "<https://builds.apache.org/job/beam_PostCommit_Python_ValidatesRunner_Dataflow/ws/src/sdks/python/apache_beam/runners/dataflow/internal/apiclient.py",>
line 624, in get_job
    response = self._client.projects_locations_jobs.Get(request)
  File "<https://builds.apache.org/job/beam_PostCommit_Python_ValidatesRunner_Dataflow/ws/src/sdks/python/apache_beam/runners/dataflow/internal/clients/dataflow/dataflow_v1b3_client.py",>
line 656, in Get
    config, request, global_params=global_params)
  File "<https://builds.apache.org/job/beam_PostCommit_Python_ValidatesRunner_Dataflow/ws/src/sdks/python/local/lib/python2.7/site-packages/apitools/base/py/base_api.py",>
line 720, in _RunMethod
    http, http_request, **opts)
  File "<https://builds.apache.org/job/beam_PostCommit_Python_ValidatesRunner_Dataflow/ws/src/sdks/python/local/lib/python2.7/site-packages/apitools/base/py/http_wrapper.py",>
line 346, in MakeRequest
    check_response_func=check_response_func)
  File "<https://builds.apache.org/job/beam_PostCommit_Python_ValidatesRunner_Dataflow/ws/src/sdks/python/local/lib/python2.7/site-packages/apitools/base/py/http_wrapper.py",>
line 396, in _MakeRequestNoRetry
    redirections=redirections, connection_type=connection_type)
  File "/usr/lib/python2.7/contextlib.py", line 25, in __exit__
    except StopIteration:
  File "<https://builds.apache.org/job/beam_PostCommit_Python_ValidatesRunner_Dataflow/ws/src/sdks/python/local/lib/python2.7/site-packages/nose/plugins/multiprocess.py",>
line 276, in signalhandler
    raise TimedOutException()
TimedOutException: 'test_par_do_with_multiple_outputs_and_using_yield (apache_beam.transforms.ptransform_test.PTransformTest)'

----------------------------------------------------------------------
XML: <https://builds.apache.org/job/beam_PostCommit_Python_ValidatesRunner_Dataflow/ws/src/sdks/python/nosetests.xml>
----------------------------------------------------------------------
Ran 16 tests in 903.815s

FAILED (errors=16)
Build step 'Execute shell' marked build as failure

Mime
View raw message