beam-commits mailing list archives

Site index · List index
Message view « Date » · « Thread »
Top « Date » · « Thread »
From Apache Jenkins Server <jenk...@builds.apache.org>
Subject Build failed in Jenkins: beam_PostCommit_Python_Verify #4971
Date Tue, 15 May 2018 03:33:41 GMT
See <https://builds.apache.org/job/beam_PostCommit_Python_Verify/4971/display/redirect>

------------------------------------------
[...truncated 1.01 MB...]
copying apache_beam/runners/dataflow/dataflow_runner_test.py -> apache-beam-2.5.0.dev0/apache_beam/runners/dataflow
copying apache_beam/runners/dataflow/ptransform_overrides.py -> apache-beam-2.5.0.dev0/apache_beam/runners/dataflow
copying apache_beam/runners/dataflow/template_runner_test.py -> apache-beam-2.5.0.dev0/apache_beam/runners/dataflow
copying apache_beam/runners/dataflow/test_dataflow_runner.py -> apache-beam-2.5.0.dev0/apache_beam/runners/dataflow
copying apache_beam/runners/dataflow/internal/__init__.py -> apache-beam-2.5.0.dev0/apache_beam/runners/dataflow/internal
copying apache_beam/runners/dataflow/internal/apiclient.py -> apache-beam-2.5.0.dev0/apache_beam/runners/dataflow/internal
copying apache_beam/runners/dataflow/internal/apiclient_test.py -> apache-beam-2.5.0.dev0/apache_beam/runners/dataflow/internal
copying apache_beam/runners/dataflow/internal/dependency.py -> apache-beam-2.5.0.dev0/apache_beam/runners/dataflow/internal
copying apache_beam/runners/dataflow/internal/dependency_test.py -> apache-beam-2.5.0.dev0/apache_beam/runners/dataflow/internal
copying apache_beam/runners/dataflow/internal/names.py -> apache-beam-2.5.0.dev0/apache_beam/runners/dataflow/internal
copying apache_beam/runners/dataflow/internal/clients/__init__.py -> apache-beam-2.5.0.dev0/apache_beam/runners/dataflow/internal/clients
copying apache_beam/runners/dataflow/internal/clients/dataflow/__init__.py -> apache-beam-2.5.0.dev0/apache_beam/runners/dataflow/internal/clients/dataflow
copying apache_beam/runners/dataflow/internal/clients/dataflow/dataflow_v1b3_client.py ->
apache-beam-2.5.0.dev0/apache_beam/runners/dataflow/internal/clients/dataflow
copying apache_beam/runners/dataflow/internal/clients/dataflow/dataflow_v1b3_messages.py ->
apache-beam-2.5.0.dev0/apache_beam/runners/dataflow/internal/clients/dataflow
copying apache_beam/runners/dataflow/internal/clients/dataflow/message_matchers.py -> apache-beam-2.5.0.dev0/apache_beam/runners/dataflow/internal/clients/dataflow
copying apache_beam/runners/dataflow/internal/clients/dataflow/message_matchers_test.py ->
apache-beam-2.5.0.dev0/apache_beam/runners/dataflow/internal/clients/dataflow
copying apache_beam/runners/dataflow/native_io/__init__.py -> apache-beam-2.5.0.dev0/apache_beam/runners/dataflow/native_io
copying apache_beam/runners/dataflow/native_io/iobase.py -> apache-beam-2.5.0.dev0/apache_beam/runners/dataflow/native_io
copying apache_beam/runners/dataflow/native_io/iobase_test.py -> apache-beam-2.5.0.dev0/apache_beam/runners/dataflow/native_io
copying apache_beam/runners/dataflow/native_io/streaming_create.py -> apache-beam-2.5.0.dev0/apache_beam/runners/dataflow/native_io
copying apache_beam/runners/direct/__init__.py -> apache-beam-2.5.0.dev0/apache_beam/runners/direct
copying apache_beam/runners/direct/bundle_factory.py -> apache-beam-2.5.0.dev0/apache_beam/runners/direct
copying apache_beam/runners/direct/clock.py -> apache-beam-2.5.0.dev0/apache_beam/runners/direct
copying apache_beam/runners/direct/consumer_tracking_pipeline_visitor.py -> apache-beam-2.5.0.dev0/apache_beam/runners/direct
copying apache_beam/runners/direct/consumer_tracking_pipeline_visitor_test.py -> apache-beam-2.5.0.dev0/apache_beam/runners/direct
copying apache_beam/runners/direct/direct_metrics.py -> apache-beam-2.5.0.dev0/apache_beam/runners/direct
copying apache_beam/runners/direct/direct_metrics_test.py -> apache-beam-2.5.0.dev0/apache_beam/runners/direct
copying apache_beam/runners/direct/direct_runner.py -> apache-beam-2.5.0.dev0/apache_beam/runners/direct
copying apache_beam/runners/direct/direct_runner_test.py -> apache-beam-2.5.0.dev0/apache_beam/runners/direct
copying apache_beam/runners/direct/evaluation_context.py -> apache-beam-2.5.0.dev0/apache_beam/runners/direct
copying apache_beam/runners/direct/executor.py -> apache-beam-2.5.0.dev0/apache_beam/runners/direct
copying apache_beam/runners/direct/helper_transforms.py -> apache-beam-2.5.0.dev0/apache_beam/runners/direct
copying apache_beam/runners/direct/sdf_direct_runner.py -> apache-beam-2.5.0.dev0/apache_beam/runners/direct
copying apache_beam/runners/direct/sdf_direct_runner_test.py -> apache-beam-2.5.0.dev0/apache_beam/runners/direct
copying apache_beam/runners/direct/transform_evaluator.py -> apache-beam-2.5.0.dev0/apache_beam/runners/direct
copying apache_beam/runners/direct/util.py -> apache-beam-2.5.0.dev0/apache_beam/runners/direct
copying apache_beam/runners/direct/watermark_manager.py -> apache-beam-2.5.0.dev0/apache_beam/runners/direct
copying apache_beam/runners/experimental/__init__.py -> apache-beam-2.5.0.dev0/apache_beam/runners/experimental
copying apache_beam/runners/experimental/python_rpc_direct/__init__.py -> apache-beam-2.5.0.dev0/apache_beam/runners/experimental/python_rpc_direct
copying apache_beam/runners/experimental/python_rpc_direct/python_rpc_direct_runner.py ->
apache-beam-2.5.0.dev0/apache_beam/runners/experimental/python_rpc_direct
copying apache_beam/runners/experimental/python_rpc_direct/server.py -> apache-beam-2.5.0.dev0/apache_beam/runners/experimental/python_rpc_direct
copying apache_beam/runners/job/__init__.py -> apache-beam-2.5.0.dev0/apache_beam/runners/job
copying apache_beam/runners/job/manager.py -> apache-beam-2.5.0.dev0/apache_beam/runners/job
copying apache_beam/runners/job/utils.py -> apache-beam-2.5.0.dev0/apache_beam/runners/job
copying apache_beam/runners/portability/__init__.py -> apache-beam-2.5.0.dev0/apache_beam/runners/portability
copying apache_beam/runners/portability/fn_api_runner.py -> apache-beam-2.5.0.dev0/apache_beam/runners/portability
copying apache_beam/runners/portability/fn_api_runner_test.py -> apache-beam-2.5.0.dev0/apache_beam/runners/portability
copying apache_beam/runners/portability/local_job_service.py -> apache-beam-2.5.0.dev0/apache_beam/runners/portability
copying apache_beam/runners/portability/local_job_service_main.py -> apache-beam-2.5.0.dev0/apache_beam/runners/portability
copying apache_beam/runners/portability/portable_runner.py -> apache-beam-2.5.0.dev0/apache_beam/runners/portability
copying apache_beam/runners/portability/portable_runner_test.py -> apache-beam-2.5.0.dev0/apache_beam/runners/portability
copying apache_beam/runners/test/__init__.py -> apache-beam-2.5.0.dev0/apache_beam/runners/test
copying apache_beam/runners/worker/__init__.py -> apache-beam-2.5.0.dev0/apache_beam/runners/worker
copying apache_beam/runners/worker/bundle_processor.py -> apache-beam-2.5.0.dev0/apache_beam/runners/worker
copying apache_beam/runners/worker/data_plane.py -> apache-beam-2.5.0.dev0/apache_beam/runners/worker
copying apache_beam/runners/worker/data_plane_test.py -> apache-beam-2.5.0.dev0/apache_beam/runners/worker
copying apache_beam/runners/worker/log_handler.py -> apache-beam-2.5.0.dev0/apache_beam/runners/worker
copying apache_beam/runners/worker/log_handler_test.py -> apache-beam-2.5.0.dev0/apache_beam/runners/worker
copying apache_beam/runners/worker/logger.pxd -> apache-beam-2.5.0.dev0/apache_beam/runners/worker
copying apache_beam/runners/worker/logger.py -> apache-beam-2.5.0.dev0/apache_beam/runners/worker
copying apache_beam/runners/worker/logger_test.py -> apache-beam-2.5.0.dev0/apache_beam/runners/worker
copying apache_beam/runners/worker/opcounters.pxd -> apache-beam-2.5.0.dev0/apache_beam/runners/worker
copying apache_beam/runners/worker/opcounters.py -> apache-beam-2.5.0.dev0/apache_beam/runners/worker
copying apache_beam/runners/worker/opcounters_test.py -> apache-beam-2.5.0.dev0/apache_beam/runners/worker
copying apache_beam/runners/worker/operation_specs.py -> apache-beam-2.5.0.dev0/apache_beam/runners/worker
copying apache_beam/runners/worker/operations.pxd -> apache-beam-2.5.0.dev0/apache_beam/runners/worker
copying apache_beam/runners/worker/operations.py -> apache-beam-2.5.0.dev0/apache_beam/runners/worker
copying apache_beam/runners/worker/sdk_worker.py -> apache-beam-2.5.0.dev0/apache_beam/runners/worker
copying apache_beam/runners/worker/sdk_worker_main.py -> apache-beam-2.5.0.dev0/apache_beam/runners/worker
copying apache_beam/runners/worker/sdk_worker_main_test.py -> apache-beam-2.5.0.dev0/apache_beam/runners/worker
copying apache_beam/runners/worker/sdk_worker_test.py -> apache-beam-2.5.0.dev0/apache_beam/runners/worker
copying apache_beam/runners/worker/sideinputs.py -> apache-beam-2.5.0.dev0/apache_beam/runners/worker
copying apache_beam/runners/worker/sideinputs_test.py -> apache-beam-2.5.0.dev0/apache_beam/runners/worker
copying apache_beam/runners/worker/statesampler.py -> apache-beam-2.5.0.dev0/apache_beam/runners/worker
copying apache_beam/runners/worker/statesampler_fast.pyx -> apache-beam-2.5.0.dev0/apache_beam/runners/worker
copying apache_beam/runners/worker/statesampler_slow.py -> apache-beam-2.5.0.dev0/apache_beam/runners/worker
copying apache_beam/runners/worker/statesampler_test.py -> apache-beam-2.5.0.dev0/apache_beam/runners/worker
copying apache_beam/runners/worker/worker_id_interceptor.py -> apache-beam-2.5.0.dev0/apache_beam/runners/worker
copying apache_beam/runners/worker/worker_id_interceptor_test.py -> apache-beam-2.5.0.dev0/apache_beam/runners/worker
copying apache_beam/testing/__init__.py -> apache-beam-2.5.0.dev0/apache_beam/testing
copying apache_beam/testing/pipeline_verifiers.py -> apache-beam-2.5.0.dev0/apache_beam/testing
copying apache_beam/testing/pipeline_verifiers_test.py -> apache-beam-2.5.0.dev0/apache_beam/testing
copying apache_beam/testing/test_pipeline.py -> apache-beam-2.5.0.dev0/apache_beam/testing
copying apache_beam/testing/test_pipeline_test.py -> apache-beam-2.5.0.dev0/apache_beam/testing
copying apache_beam/testing/test_stream.py -> apache-beam-2.5.0.dev0/apache_beam/testing
copying apache_beam/testing/test_stream_test.py -> apache-beam-2.5.0.dev0/apache_beam/testing
copying apache_beam/testing/test_utils.py -> apache-beam-2.5.0.dev0/apache_beam/testing
copying apache_beam/testing/test_utils_test.py -> apache-beam-2.5.0.dev0/apache_beam/testing
copying apache_beam/testing/util.py -> apache-beam-2.5.0.dev0/apache_beam/testing
copying apache_beam/testing/util_test.py -> apache-beam-2.5.0.dev0/apache_beam/testing
copying apache_beam/testing/data/standard_coders.yaml -> apache-beam-2.5.0.dev0/apache_beam/testing/data
copying apache_beam/testing/data/trigger_transcripts.yaml -> apache-beam-2.5.0.dev0/apache_beam/testing/data
copying apache_beam/tools/__init__.py -> apache-beam-2.5.0.dev0/apache_beam/tools
copying apache_beam/tools/distribution_counter_microbenchmark.py -> apache-beam-2.5.0.dev0/apache_beam/tools
copying apache_beam/tools/map_fn_microbenchmark.py -> apache-beam-2.5.0.dev0/apache_beam/tools
copying apache_beam/tools/sideinput_microbenchmark.py -> apache-beam-2.5.0.dev0/apache_beam/tools
copying apache_beam/tools/utils.py -> apache-beam-2.5.0.dev0/apache_beam/tools
copying apache_beam/transforms/__init__.py -> apache-beam-2.5.0.dev0/apache_beam/transforms
copying apache_beam/transforms/combiners.py -> apache-beam-2.5.0.dev0/apache_beam/transforms
copying apache_beam/transforms/combiners_test.py -> apache-beam-2.5.0.dev0/apache_beam/transforms
copying apache_beam/transforms/core.py -> apache-beam-2.5.0.dev0/apache_beam/transforms
copying apache_beam/transforms/create_test.py -> apache-beam-2.5.0.dev0/apache_beam/transforms
copying apache_beam/transforms/cy_combiners.pxd -> apache-beam-2.5.0.dev0/apache_beam/transforms
copying apache_beam/transforms/cy_combiners.py -> apache-beam-2.5.0.dev0/apache_beam/transforms
copying apache_beam/transforms/cy_dataflow_distribution_counter.pxd -> apache-beam-2.5.0.dev0/apache_beam/transforms
copying apache_beam/transforms/cy_dataflow_distribution_counter.pyx -> apache-beam-2.5.0.dev0/apache_beam/transforms
copying apache_beam/transforms/dataflow_distribution_counter_test.py -> apache-beam-2.5.0.dev0/apache_beam/transforms
copying apache_beam/transforms/display.py -> apache-beam-2.5.0.dev0/apache_beam/transforms
copying apache_beam/transforms/display_test.py -> apache-beam-2.5.0.dev0/apache_beam/transforms
copying apache_beam/transforms/ptransform.py -> apache-beam-2.5.0.dev0/apache_beam/transforms
copying apache_beam/transforms/ptransform_test.py -> apache-beam-2.5.0.dev0/apache_beam/transforms
copying apache_beam/transforms/py_dataflow_distribution_counter.py -> apache-beam-2.5.0.dev0/apache_beam/transforms
copying apache_beam/transforms/sideinputs.py -> apache-beam-2.5.0.dev0/apache_beam/transforms
copying apache_beam/transforms/sideinputs_test.py -> apache-beam-2.5.0.dev0/apache_beam/transforms
copying apache_beam/transforms/timeutil.py -> apache-beam-2.5.0.dev0/apache_beam/transforms
copying apache_beam/transforms/trigger.py -> apache-beam-2.5.0.dev0/apache_beam/transforms
copying apache_beam/transforms/trigger_test.py -> apache-beam-2.5.0.dev0/apache_beam/transforms
copying apache_beam/transforms/util.py -> apache-beam-2.5.0.dev0/apache_beam/transforms
copying apache_beam/transforms/util_test.py -> apache-beam-2.5.0.dev0/apache_beam/transforms
copying apache_beam/transforms/window.py -> apache-beam-2.5.0.dev0/apache_beam/transforms
copying apache_beam/transforms/window_test.py -> apache-beam-2.5.0.dev0/apache_beam/transforms
copying apache_beam/transforms/write_ptransform_test.py -> apache-beam-2.5.0.dev0/apache_beam/transforms
copying apache_beam/typehints/__init__.py -> apache-beam-2.5.0.dev0/apache_beam/typehints
copying apache_beam/typehints/decorators.py -> apache-beam-2.5.0.dev0/apache_beam/typehints
copying apache_beam/typehints/native_type_compatibility.py -> apache-beam-2.5.0.dev0/apache_beam/typehints
copying apache_beam/typehints/native_type_compatibility_test.py -> apache-beam-2.5.0.dev0/apache_beam/typehints
copying apache_beam/typehints/opcodes.py -> apache-beam-2.5.0.dev0/apache_beam/typehints
copying apache_beam/typehints/trivial_inference.py -> apache-beam-2.5.0.dev0/apache_beam/typehints
copying apache_beam/typehints/trivial_inference_test.py -> apache-beam-2.5.0.dev0/apache_beam/typehints
copying apache_beam/typehints/typecheck.py -> apache-beam-2.5.0.dev0/apache_beam/typehints
copying apache_beam/typehints/typed_pipeline_test.py -> apache-beam-2.5.0.dev0/apache_beam/typehints
copying apache_beam/typehints/typehints.py -> apache-beam-2.5.0.dev0/apache_beam/typehints
copying apache_beam/typehints/typehints_test.py -> apache-beam-2.5.0.dev0/apache_beam/typehints
copying apache_beam/utils/__init__.py -> apache-beam-2.5.0.dev0/apache_beam/utils
copying apache_beam/utils/annotations.py -> apache-beam-2.5.0.dev0/apache_beam/utils
copying apache_beam/utils/annotations_test.py -> apache-beam-2.5.0.dev0/apache_beam/utils
copying apache_beam/utils/counters.pxd -> apache-beam-2.5.0.dev0/apache_beam/utils
copying apache_beam/utils/counters.py -> apache-beam-2.5.0.dev0/apache_beam/utils
copying apache_beam/utils/counters_test.py -> apache-beam-2.5.0.dev0/apache_beam/utils
copying apache_beam/utils/plugin.py -> apache-beam-2.5.0.dev0/apache_beam/utils
copying apache_beam/utils/processes.py -> apache-beam-2.5.0.dev0/apache_beam/utils
copying apache_beam/utils/processes_test.py -> apache-beam-2.5.0.dev0/apache_beam/utils
copying apache_beam/utils/profiler.py -> apache-beam-2.5.0.dev0/apache_beam/utils
copying apache_beam/utils/proto_utils.py -> apache-beam-2.5.0.dev0/apache_beam/utils
copying apache_beam/utils/retry.py -> apache-beam-2.5.0.dev0/apache_beam/utils
copying apache_beam/utils/retry_test.py -> apache-beam-2.5.0.dev0/apache_beam/utils
copying apache_beam/utils/timestamp.py -> apache-beam-2.5.0.dev0/apache_beam/utils
copying apache_beam/utils/timestamp_test.py -> apache-beam-2.5.0.dev0/apache_beam/utils
copying apache_beam/utils/urns.py -> apache-beam-2.5.0.dev0/apache_beam/utils
copying apache_beam/utils/windowed_value.pxd -> apache-beam-2.5.0.dev0/apache_beam/utils
copying apache_beam/utils/windowed_value.py -> apache-beam-2.5.0.dev0/apache_beam/utils
copying apache_beam/utils/windowed_value_test.py -> apache-beam-2.5.0.dev0/apache_beam/utils
Writing apache-beam-2.5.0.dev0/setup.cfg
creating dist
Creating tar archive
removing 'apache-beam-2.5.0.dev0' (and everything under it)

SDK_LOCATION=$(find dist/apache-beam-*.tar.gz)
find dist/apache-beam-*.tar.gz

# Run integration tests on the Google Cloud Dataflow service
# and validate that jobs finish successfully.
>>> RUNNING TEST DATAFLOW RUNNER it tests
echo ">>> RUNNING TEST DATAFLOW RUNNER it tests"
python setup.py nosetests \
  --attr IT \
  --nocapture \
  --processes=4 \
  --process-timeout=1800 \
  --test-pipeline-options=" \
    --runner=TestDataflowRunner \
    --project=$PROJECT \
    --staging_location=$GCS_LOCATION/staging-it \
    --temp_location=$GCS_LOCATION/temp-it \
    --output=$GCS_LOCATION/py-it-cloud/output \
    --sdk_location=$SDK_LOCATION \
    --num_workers=1 \
    --sleep_secs=20"
<https://builds.apache.org/job/beam_PostCommit_Python_Verify/ws/src/sdks/python/build/gradleenv/local/lib/python2.7/site-packages/setuptools/dist.py>:388:
UserWarning: Normalizing '2.5.0.dev' to '2.5.0.dev0'
  normalized_version,
running nosetests
running egg_info
writing requirements to apache_beam.egg-info/requires.txt
writing apache_beam.egg-info/PKG-INFO
writing top-level names to apache_beam.egg-info/top_level.txt
writing dependency_links to apache_beam.egg-info/dependency_links.txt
writing entry points to apache_beam.egg-info/entry_points.txt
reading manifest file 'apache_beam.egg-info/SOURCES.txt'
reading manifest template 'MANIFEST.in'
warning: no files found matching 'README.md'
warning: no files found matching 'NOTICE'
warning: no files found matching 'LICENSE'
writing manifest file 'apache_beam.egg-info/SOURCES.txt'
<https://builds.apache.org/job/beam_PostCommit_Python_Verify/ws/src/sdks/python/apache_beam/io/gcp/gcsio.py>:176:
DeprecationWarning: object() takes no parameters
  super(GcsIO, cls).__new__(cls, storage_client))
<https://builds.apache.org/job/beam_PostCommit_Python_Verify/ws/src/sdks/python/apache_beam/io/gcp/gcsio.py>:176:
DeprecationWarning: object() takes no parameters
  super(GcsIO, cls).__new__(cls, storage_client))
<https://builds.apache.org/job/beam_PostCommit_Python_Verify/ws/src/sdks/python/apache_beam/runners/dataflow/test_dataflow_runner.py>:52:
DeprecationWarning: options is deprecated since First stable release.. References to <pipeline>.options
will not be supported
  print('Found: %s.' % self.build_console_url(pipeline.options))
<https://builds.apache.org/job/beam_PostCommit_Python_Verify/ws/src/sdks/python/apache_beam/runners/dataflow/test_dataflow_runner.py>:52:
DeprecationWarning: options is deprecated since First stable release.. References to <pipeline>.options
will not be supported
  print('Found: %s.' % self.build_console_url(pipeline.options))
<https://builds.apache.org/job/beam_PostCommit_Python_Verify/ws/src/sdks/python/apache_beam/runners/dataflow/test_dataflow_runner.py>:52:
DeprecationWarning: options is deprecated since First stable release.. References to <pipeline>.options
will not be supported
  print('Found: %s.' % self.build_console_url(pipeline.options))
<https://builds.apache.org/job/beam_PostCommit_Python_Verify/ws/src/sdks/python/apache_beam/runners/dataflow/dataflow_runner.py>:783:
DeprecationWarning: options is deprecated since First stable release.. References to <pipeline>.options
will not be supported
  transform_node.inputs[0].pipeline.options.view_as(StandardOptions))
<https://builds.apache.org/job/beam_PostCommit_Python_Verify/ws/src/sdks/python/apache_beam/runners/dataflow/test_dataflow_runner.py>:52:
DeprecationWarning: options is deprecated since First stable release.. References to <pipeline>.options
will not be supported
  print('Found: %s.' % self.build_console_url(pipeline.options))
test_wordcount_fnapi_it (apache_beam.examples.wordcount_it_test.WordCountIT) ... ok
test_streaming_wordcount_it (apache_beam.examples.streaming_wordcount_it_test.StreamingWordCountIT)
... ok
test_bigquery_tornadoes_it (apache_beam.examples.cookbook.bigquery_tornadoes_it_test.BigqueryTornadoesIT)
... ok
test_wordcount_it (apache_beam.examples.wordcount_it_test.WordCountIT) ... ok

----------------------------------------------------------------------
XML: <https://builds.apache.org/job/beam_PostCommit_Python_Verify/ws/src/sdks/python/nosetests.xml>
----------------------------------------------------------------------
Ran 4 tests in 490.733s

OK
Found: https://console.cloud.google.com/dataflow/jobsDetail/locations/us-central1/jobs/2018-05-14_20_25_31-11758350257181709344?project=apache-beam-testing.
Found: https://console.cloud.google.com/dataflow/jobsDetail/locations/us-central1/jobs/2018-05-14_20_25_31-4884786739874677189?project=apache-beam-testing.
Found: https://console.cloud.google.com/dataflow/jobsDetail/locations/us-central1/jobs/2018-05-14_20_25_39-429470675083692439?project=apache-beam-testing.
Found: https://console.cloud.google.com/dataflow/jobsDetail/locations/us-central1/jobs/2018-05-14_20_25_31-16976285828938274493?project=apache-beam-testing.
:beam-sdks-python:validatesRunnerTests (Thread[Task worker for ':' Thread 3,5,main]) completed.
Took 8 mins 12.06 secs.

FAILURE: Build failed with an exception.

* Where:
Build file '<https://builds.apache.org/job/beam_PostCommit_Python_Verify/ws/src/sdks/python/build.gradle'>
line: 102

* What went wrong:
Execution failed for task ':beam-sdks-python:lintPy3'.
> Process 'command 'sh'' finished with non-zero exit value 1

* Try:
Run with --stacktrace option to get the stack trace. Run with --debug option to get more log
output. Run with --scan to get full insights.

* Get more help at https://help.gradle.org

BUILD FAILED in 33m 28s
11 actionable tasks: 11 executed

Publishing build scan...
https://gradle.com/s/bwr4eknhjh3ry

Build step 'Invoke Gradle script' changed build result to FAILURE
Build step 'Invoke Gradle script' marked build as failure
Not sending mail to unregistered user kirpichov@google.com
Not sending mail to unregistered user ankurgoenka@gmail.com
Not sending mail to unregistered user github@alasdairhodge.co.uk

Mime
View raw message