beam-commits mailing list archives

Site index · List index
Message view « Date » · « Thread »
Top « Date » · « Thread »
From Apache Jenkins Server <jenk...@builds.apache.org>
Subject Build failed in Jenkins: beam_PostCommit_Java_GradleBuild #258
Date Wed, 02 May 2018 18:02:41 GMT
See <https://builds.apache.org/job/beam_PostCommit_Java_GradleBuild/258/display/redirect?page=changes>

Changes:

[github] Fix DynamicDestinations documentation

------------------------------------------
[...truncated 17.90 MB...]
    May 02, 2018 6:02:24 PM org.apache.beam.sdk.io.FileBasedSource split
    INFO: Splitting filepattern /tmp/junit1475608711116988403/junit9128274499579332023.tmp
into bundles of size 3 took 0 ms and produced 1 files and 18 bundles

org.apache.beam.examples.WordCountTest > testExtractWordsFn STANDARD_ERROR
    May 02, 2018 6:02:24 PM org.apache.beam.sdk.transforms.DoFnTester of
    WARNING: Your tests use DoFnTester, which may not exercise DoFns correctly. Please use
TestPipeline instead.

org.apache.beam.examples.subprocess.ExampleEchoPipelineTest > testExampleEchoPipeline STANDARD_ERROR
    May 02, 2018 6:02:25 PM org.apache.beam.examples.subprocess.utils.CallingSubProcessUtils
initSemaphore
    INFO: Initialized Semaphore for binary test-Echo2923726372027294620.sh 
    May 02, 2018 6:02:25 PM org.apache.beam.examples.subprocess.utils.CallingSubProcessUtils
setUp
    INFO: Calling filesetup to move Executables to worker.
    May 02, 2018 6:02:26 PM org.apache.beam.examples.subprocess.utils.FileUtils copyFileFromGCSToWorker
    INFO: Moving File /tmp/test-Echo2923726372027294620.sh to /tmp/test-Echoo5745353248225255550/test-Echo2923726372027294620.sh

    May 02, 2018 6:02:26 PM org.apache.beam.examples.subprocess.utils.CallingSubProcessUtils
initSemaphore
    INFO: Initialized Semaphore for binary test-EchoAgain9207570007618915658.sh 
    May 02, 2018 6:02:26 PM org.apache.beam.examples.subprocess.utils.CallingSubProcessUtils
setUp
    INFO: Calling filesetup to move Executables to worker.
    May 02, 2018 6:02:26 PM org.apache.beam.examples.subprocess.utils.FileUtils copyFileFromGCSToWorker
    INFO: Moving File /tmp/test-EchoAgain9207570007618915658.sh to /tmp/test-Echoo5745353248225255550/test-EchoAgain9207570007618915658.sh


org.apache.beam.examples.complete.game.HourlyTeamScoreTest > testUserScoresFilter STANDARD_OUT
    GOT user18_ApricotCaneToad,ApricotCaneToad,14,1447965690000,2015-11-19 12:41:31.053
    GOT user18_BananaEmu,BananaEmu,1,1447965690000,2015-11-19 12:41:31.053
    GOT user7_AlmondWallaby,AlmondWallaby,15,1447955630000,2015-11-19 09:53:53.444
    GOT user18_BananaEmu,BananaEmu,7,1447965690000,2015-11-19 12:41:31.053
    GOT user0_MagentaKangaroo,MagentaKangaroo,3,1447955630000,2015-11-19 09:53:53.444
    GOT user0_MagentaKangaroo,MagentaKangaroo,4,1447965690000,2015-11-19 12:41:31.053
    GOT user2_AmberCockatoo,AmberCockatoo,13,1447965690000,2015-11-19 12:41:31.053
    GOT user0_AndroidGreenEchidna,AndroidGreenEchidna,0,1447965690000,2015-11-19 12:41:31.053
    GOT user13_ApricotQuokka,ApricotQuokka,15,1447955630000,2015-11-19 09:53:53.444
    GOT user19_BisqueBilby,BisqueBilby,6,1447955630000,2015-11-19 09:53:53.444
    GOT user7_AndroidGreenKookaburra,AndroidGreenKookaburra,11,1447955630000,2015-11-19 09:53:53.444
    GOT user19_BisqueBilby,BisqueBilby,8,1447955630000,2015-11-19 09:53:53.444
    GOT user7_AndroidGreenKookaburra,AndroidGreenKookaburra,12,1447955630000,2015-11-19 09:53:53.444
    GOT user3_BananaEmu,BananaEmu,17,1447965690000,2015-11-19 12:41:31.053
    GOT user6_AmberNumbat,AmberNumbat,11,1447955630000,2015-11-19 09:53:53.444

org.apache.beam.examples.complete.game.UserScoreTest > testTeamScoreSums STANDARD_OUT
    GOT user7_AlmondWallaby,AlmondWallaby,15,1447955630000,2015-11-19 09:53:53.444
    GOT user7_AndroidGreenKookaburra,AndroidGreenKookaburra,11,1447955630000,2015-11-19 09:53:53.444
    GOT user0_MagentaKangaroo,MagentaKangaroo,3,1447955630000,2015-11-19 09:53:53.444
    GOT THIS IS A PARSE ERROR,2015-11-19 09:53:53.444
    GOT user6_AmberNumbat,AmberNumbat,11,1447955630000,2015-11-19 09:53:53.444
    GOT user13_ApricotQuokka,ApricotQuokka,15,1447955630000,2015-11-19 09:53:53.444
    GOT user19_BisqueBilby,BisqueBilby,6,1447955630000,2015-11-19 09:53:53.444
    GOT user7_AndroidGreenKookaburra,AndroidGreenKookaburra,12,1447955630000,2015-11-19 09:53:53.444
    GOT user19_BisqueBilby,BisqueBilby,8,1447955630000,2015-11-19 09:53:53.444

org.apache.beam.examples.complete.game.UserScoreTest > testTeamScoreSums STANDARD_ERROR
    May 02, 2018 6:02:27 PM org.apache.beam.examples.complete.game.UserScore$ParseEventFn
processElement
    INFO: Parse error on THIS IS A PARSE ERROR,2015-11-19 09:53:53.444, 2

org.apache.beam.examples.complete.game.UserScoreTest > testTeamScoreSums STANDARD_OUT
    GOT user6_AliceBlueDingo,AliceBlueDingo,4,xxxxxxx,2015-11-19 09:53:53.444

org.apache.beam.examples.complete.game.UserScoreTest > testTeamScoreSums STANDARD_ERROR
    May 02, 2018 6:02:27 PM org.apache.beam.examples.complete.game.UserScore$ParseEventFn
processElement
    INFO: Parse error on user6_AliceBlueDingo,AliceBlueDingo,4,xxxxxxx,2015-11-19 09:53:53.444,
For input string: "xxxxxxx"

org.apache.beam.examples.complete.game.UserScoreTest > testUserScoresBadInput STANDARD_OUT
    GOT user6_AliceBlueDingo,AliceBlueDingo,4,xxxxxxx,2015-11-19 09:53:53.444
    GOT THIS IS A PARSE ERROR,2015-11-19 09:53:53.444
    GOT user13_BisqueBilby,BisqueBilby,xxx,1447955630000,2015-11-19 09:53:53.444

org.apache.beam.examples.complete.game.UserScoreTest > testUserScoresBadInput STANDARD_ERROR
    May 02, 2018 6:02:27 PM org.apache.beam.examples.complete.game.UserScore$ParseEventFn
processElement
    INFO: Parse error on THIS IS A PARSE ERROR,2015-11-19 09:53:53.444, 2
    May 02, 2018 6:02:27 PM org.apache.beam.examples.complete.game.UserScore$ParseEventFn
processElement
    INFO: Parse error on user13_BisqueBilby,BisqueBilby,xxx,1447955630000,2015-11-19 09:53:53.444,
For input string: "xxx"
    May 02, 2018 6:02:27 PM org.apache.beam.examples.complete.game.UserScore$ParseEventFn
processElement
    INFO: Parse error on user6_AliceBlueDingo,AliceBlueDingo,4,xxxxxxx,2015-11-19 09:53:53.444,
For input string: "xxxxxxx"

org.apache.beam.examples.complete.game.UserScoreTest > testUserScoreSums STANDARD_OUT
    GOT user13_ApricotQuokka,ApricotQuokka,15,1447955630000,2015-11-19 09:53:53.444
    GOT user6_AmberNumbat,AmberNumbat,11,1447955630000,2015-11-19 09:53:53.444
    GOT user0_MagentaKangaroo,MagentaKangaroo,3,1447955630000,2015-11-19 09:53:53.444
    GOT user7_AlmondWallaby,AlmondWallaby,15,1447955630000,2015-11-19 09:53:53.444
    GOT user6_AliceBlueDingo,AliceBlueDingo,4,xxxxxxx,2015-11-19 09:53:53.444
    GOT user7_AndroidGreenKookaburra,AndroidGreenKookaburra,11,1447955630000,2015-11-19 09:53:53.444
    GOT user19_BisqueBilby,BisqueBilby,6,1447955630000,2015-11-19 09:53:53.444
    GOT user7_AndroidGreenKookaburra,AndroidGreenKookaburra,12,1447955630000,2015-11-19 09:53:53.444
    GOT user19_BisqueBilby,BisqueBilby,8,1447955630000,2015-11-19 09:53:53.444

org.apache.beam.examples.complete.game.UserScoreTest > testUserScoreSums STANDARD_ERROR
    May 02, 2018 6:02:27 PM org.apache.beam.examples.complete.game.UserScore$ParseEventFn
processElement
    INFO: Parse error on user6_AliceBlueDingo,AliceBlueDingo,4,xxxxxxx,2015-11-19 09:53:53.444,
For input string: "xxxxxxx"

org.apache.beam.examples.complete.game.UserScoreTest > testUserScoreSums STANDARD_OUT
    GOT THIS IS A PARSE ERROR,2015-11-19 09:53:53.444

org.apache.beam.examples.complete.game.UserScoreTest > testUserScoreSums STANDARD_ERROR
    May 02, 2018 6:02:27 PM org.apache.beam.examples.complete.game.UserScore$ParseEventFn
processElement
    INFO: Parse error on THIS IS A PARSE ERROR,2015-11-19 09:53:53.444, 2

org.apache.beam.examples.complete.game.UserScoreTest > testParseEventFn STANDARD_ERROR
    May 02, 2018 6:02:27 PM org.apache.beam.sdk.transforms.DoFnTester of
    WARNING: Your tests use DoFnTester, which may not exercise DoFns correctly. Please use
TestPipeline instead.

org.apache.beam.examples.complete.game.UserScoreTest > testParseEventFn STANDARD_OUT
    GOT user0_MagentaKangaroo,MagentaKangaroo,3,1447955630000,2015-11-19 09:53:53.444
    GOT user13_ApricotQuokka,ApricotQuokka,15,1447955630000,2015-11-19 09:53:53.444
    GOT user6_AmberNumbat,AmberNumbat,11,1447955630000,2015-11-19 09:53:53.444
    GOT user7_AlmondWallaby,AlmondWallaby,15,1447955630000,2015-11-19 09:53:53.444
    GOT user7_AndroidGreenKookaburra,AndroidGreenKookaburra,12,1447955630000,2015-11-19 09:53:53.444
    GOT user6_AliceBlueDingo,AliceBlueDingo,4,xxxxxxx,2015-11-19 09:53:53.444

org.apache.beam.examples.complete.game.UserScoreTest > testParseEventFn STANDARD_ERROR
    May 02, 2018 6:02:27 PM org.apache.beam.examples.complete.game.UserScore$ParseEventFn
processElement
    INFO: Parse error on user6_AliceBlueDingo,AliceBlueDingo,4,xxxxxxx,2015-11-19 09:53:53.444,
For input string: "xxxxxxx"

org.apache.beam.examples.complete.game.UserScoreTest > testParseEventFn STANDARD_OUT
    GOT user7_AndroidGreenKookaburra,AndroidGreenKookaburra,11,1447955630000,2015-11-19 09:53:53.444
    GOT THIS IS A PARSE ERROR,2015-11-19 09:53:53.444

org.apache.beam.examples.complete.game.UserScoreTest > testParseEventFn STANDARD_ERROR
    May 02, 2018 6:02:27 PM org.apache.beam.examples.complete.game.UserScore$ParseEventFn
processElement
    INFO: Parse error on THIS IS A PARSE ERROR,2015-11-19 09:53:53.444, 2

org.apache.beam.examples.complete.game.UserScoreTest > testParseEventFn STANDARD_OUT
    GOT user19_BisqueBilby,BisqueBilby,6,1447955630000,2015-11-19 09:53:53.444
    GOT user19_BisqueBilby,BisqueBilby,8,1447955630000,2015-11-19 09:53:53.444

org.apache.beam.examples.complete.game.GameStatsTest > testCalculateSpammyUsers STANDARD_ERROR
    May 02, 2018 6:02:27 PM org.apache.beam.examples.complete.game.GameStats$CalculateSpammyUsers$1
processElement
    INFO: user Robot-2 spammer score 66 with mean 24.923076923076923
    May 02, 2018 6:02:27 PM org.apache.beam.examples.complete.game.GameStats$CalculateSpammyUsers$1
processElement
    INFO: user Robot-1 spammer score 116 with mean 24.923076923076923

Gradle Test Executor 132 finished executing tests.

> Task :beam-examples-java:test
Finished generating test XML results (0.001 secs) into: <https://builds.apache.org/job/beam_PostCommit_Java_GradleBuild/ws/src/examples/java/build/test-results/test>
Generating HTML test report...
Finished generating test html results (0.004 secs) into: <https://builds.apache.org/job/beam_PostCommit_Java_GradleBuild/ws/src/examples/java/build/reports/tests/test>
Packing task ':beam-examples-java:test'
:beam-examples-java:test (Thread[Task worker for ':' Thread 12,5,main]) completed. Took 11.116
secs.
:beam-examples-java:check (Thread[Task worker for ':' Thread 12,5,main]) started.

> Task :beam-examples-java:check
Skipping task ':beam-examples-java:check' as it has no actions.
:beam-examples-java:check (Thread[Task worker for ':' Thread 12,5,main]) completed. Took 0.0
secs.
:beam-examples-java:build (Thread[Task worker for ':' Thread 12,5,main]) started.

> Task :beam-examples-java:build
Skipping task ':beam-examples-java:build' as it has no actions.
:beam-examples-java:build (Thread[Task worker for ':' Thread 12,5,main]) completed. Took 0.0
secs.
:beam-examples-java:buildDependents (Thread[Task worker for ':' Thread 12,5,main]) started.

> Task :beam-examples-java:buildDependents
Caching disabled for task ':beam-examples-java:buildDependents': Caching has not been enabled
for the task
Task ':beam-examples-java:buildDependents' is not up-to-date because:
  Task has not declared any outputs despite executing actions.
:beam-examples-java:buildDependents (Thread[Task worker for ':' Thread 12,5,main]) completed.
Took 0.0 secs.
:beam-sdks-java-io-google-cloud-platform:buildDependents (Thread[Task worker for ':' Thread
12,5,main]) started.

> Task :beam-sdks-java-io-google-cloud-platform:buildDependents
Caching disabled for task ':beam-sdks-java-io-google-cloud-platform:buildDependents': Caching
has not been enabled for the task
Task ':beam-sdks-java-io-google-cloud-platform:buildDependents' is not up-to-date because:
  Task has not declared any outputs despite executing actions.
:beam-sdks-java-io-google-cloud-platform:buildDependents (Thread[Task worker for ':' Thread
12,5,main]) completed. Took 0.0 secs.
:beam-sdks-java-extensions-google-cloud-platform-core:buildDependents (Thread[Task worker
for ':',5,main]) started.
:beam-sdks-java-extensions-protobuf:buildDependents (Thread[Task worker for ':' Thread 12,5,main])
started.

> Task :beam-sdks-java-extensions-google-cloud-platform-core:buildDependents
Caching disabled for task ':beam-sdks-java-extensions-google-cloud-platform-core:buildDependents':
Caching has not been enabled for the task
Task ':beam-sdks-java-extensions-google-cloud-platform-core:buildDependents' is not up-to-date
because:
  Task has not declared any outputs despite executing actions.
:beam-sdks-java-extensions-google-cloud-platform-core:buildDependents (Thread[Task worker
for ':',5,main]) completed. Took 0.0 secs.

> Task :beam-sdks-java-extensions-protobuf:buildDependents
Caching disabled for task ':beam-sdks-java-extensions-protobuf:buildDependents': Caching has
not been enabled for the task
Task ':beam-sdks-java-extensions-protobuf:buildDependents' is not up-to-date because:
  Task has not declared any outputs despite executing actions.
:beam-sdks-java-extensions-protobuf:buildDependents (Thread[Task worker for ':' Thread 12,5,main])
completed. Took 0.0 secs.

FAILURE: Build completed with 4 failures.

1: Task failed with an exception.
-----------
* What went wrong:
Execution failed for task ':beam-sdks-java-maven-archetypes-starter:generateAndBuildArchetypeTest'.
> Process 'command '/home/jenkins/tools/maven/apache-maven-3.5.2/bin/mvn'' finished with
non-zero exit value 1

* Try:
Run with --stacktrace option to get the stack trace. Run with --debug option to get more log
output. Run with --scan to get full insights.
==============================================================================

2: Task failed with an exception.
-----------
* What went wrong:
Execution failed for task ':beam-sdks-java-maven-archetypes-examples:generateAndBuildArchetypeTest'.
> Process 'command '/home/jenkins/tools/maven/apache-maven-3.5.2/bin/mvn'' finished with
non-zero exit value 1

* Try:
Run with --stacktrace option to get the stack trace. Run with --debug option to get more log
output. Run with --scan to get full insights.
==============================================================================

3: Task failed with an exception.
-----------
* What went wrong:
Execution failed for task ':beam-runners-direct-java:test'.
> There were failing tests. See the report at: file://<https://builds.apache.org/job/beam_PostCommit_Java_GradleBuild/ws/src/runners/direct-java/build/reports/tests/test/index.html>

* Try:
Run with --stacktrace option to get the stack trace. Run with --debug option to get more log
output. Run with --scan to get full insights.
==============================================================================

4: Task failed with an exception.
-----------
* What went wrong:
Execution failed for task ':beam-runners-google-cloud-dataflow-java:googleCloudPlatformIntegrationTest'.
> There were failing tests. See the report at: file://<https://builds.apache.org/job/beam_PostCommit_Java_GradleBuild/ws/src/runners/google-cloud-dataflow-java/build/reports/tests/googleCloudPlatformIntegrationTest/index.html>

* Try:
Run with --stacktrace option to get the stack trace. Run with --debug option to get more log
output. Run with --scan to get full insights.
==============================================================================

* Get more help at https://help.gradle.org

Deprecated Gradle features were used in this build, making it incompatible with Gradle 5.0.
See https://docs.gradle.org/4.7/userguide/command_line_interface.html#sec:command_line_warnings

BUILD FAILED in 42m 40s
540 actionable tasks: 537 executed, 3 from cache

Publishing build scan...
https://gradle.com/s/d7i3dfaauu3gu

Build step 'Invoke Gradle script' changed build result to FAILURE
Build step 'Invoke Gradle script' marked build as failure
Recording test results
Not sending mail to unregistered user aljoscha.krettek@gmail.com
Not sending mail to unregistered user apilloud@google.com
Not sending mail to unregistered user pgerver@us.ibm.com
Not sending mail to unregistered user szewinho@gmail.com
Not sending mail to unregistered user katarzyna.kucharczyk@polidea.com
Not sending mail to unregistered user ekirpichov@gmail.com
Not sending mail to unregistered user github@alasdairhodge.co.uk
Not sending mail to unregistered user swegner@google.com
Not sending mail to unregistered user herohde@google.com
Not sending mail to unregistered user kedin@google.com
Not sending mail to unregistered user relax@relax-macbookpro2.roam.corp.google.com
Not sending mail to unregistered user sidhom@google.com
Not sending mail to unregistered user wcn@google.com
Not sending mail to unregistered user aaltay@gmail.com
Not sending mail to unregistered user kirpichov@google.com
Not sending mail to unregistered user rober@frantil.com
Not sending mail to unregistered user ankurgoenka@gmail.com

Mime
View raw message