beam-commits mailing list archives

Site index · List index
Message view « Date » · « Thread »
Top « Date » · « Thread »
From Apache Jenkins Server <jenk...@builds.apache.org>
Subject Build failed in Jenkins: beam_PerformanceTests_MongoDBIO_IT #116
Date Tue, 01 May 2018 06:21:46 GMT
See <https://builds.apache.org/job/beam_PerformanceTests_MongoDBIO_IT/116/display/redirect?page=changes>

Changes:

[thw] [BEAM-4131] Include SDK into Python SDK harness container.

[thw] cleanup

------------------------------------------
[...truncated 907.88 KB...]
	at java.lang.Thread.run(Thread.java:745)
Caused by: com.mongodb.MongoTimeoutException: Timed out after 30000 ms while waiting for a
server that matches ReadPreferenceServerSelector{readPreference=primary}. Client view of cluster
state is {type=UNKNOWN, servers=[{address=35.226.189.22:27017, type=UNKNOWN, state=CONNECTING,
exception={com.mongodb.MongoSocketOpenException: Exception opening socket}, caused by {java.net.SocketTimeoutException:
connect timed out}}]
	at com.mongodb.connection.BaseCluster.createTimeoutException(BaseCluster.java:369)
	at com.mongodb.connection.BaseCluster.selectServer(BaseCluster.java:101)
	at com.mongodb.binding.ClusterBinding$ClusterBindingConnectionSource.<init>(ClusterBinding.java:75)
	at com.mongodb.binding.ClusterBinding$ClusterBindingConnectionSource.<init>(ClusterBinding.java:71)
	at com.mongodb.binding.ClusterBinding.getReadConnectionSource(ClusterBinding.java:63)
	at com.mongodb.operation.OperationHelper.withConnection(OperationHelper.java:210)
	at com.mongodb.operation.FindOperation.execute(FindOperation.java:482)
	at com.mongodb.operation.FindOperation.execute(FindOperation.java:79)
	at com.mongodb.Mongo.execute(Mongo.java:772)
	at com.mongodb.Mongo$2.execute(Mongo.java:759)
	at com.mongodb.OperationIterable.iterator(OperationIterable.java:47)
	at com.mongodb.FindIterableImpl.iterator(FindIterableImpl.java:143)
	at org.apache.beam.sdk.io.mongodb.MongoDbIO$BoundedMongoDbReader.start(MongoDbIO.java:456)
	at com.google.cloud.dataflow.worker.WorkerCustomSources$BoundedReaderIterator.start(WorkerCustomSources.java:592)
	... 14 more
java.io.IOException: Failed to start reading from source: org.apache.beam.sdk.io.mongodb.MongoDbIO$BoundedMongoDbSource@11ac8ab7
	at com.google.cloud.dataflow.worker.WorkerCustomSources$BoundedReaderIterator.start(WorkerCustomSources.java:595)
	at com.google.cloud.dataflow.worker.util.common.worker.ReadOperation$SynchronizedReaderIterator.start(ReadOperation.java:360)
	at com.google.cloud.dataflow.worker.util.common.worker.ReadOperation.runReadLoop(ReadOperation.java:193)
	at com.google.cloud.dataflow.worker.util.common.worker.ReadOperation.start(ReadOperation.java:158)
	at com.google.cloud.dataflow.worker.util.common.worker.MapTaskExecutor.execute(MapTaskExecutor.java:75)
	at com.google.cloud.dataflow.worker.BatchDataflowWorker.executeWork(BatchDataflowWorker.java:383)
	at com.google.cloud.dataflow.worker.BatchDataflowWorker.doWork(BatchDataflowWorker.java:355)
	at com.google.cloud.dataflow.worker.BatchDataflowWorker.getAndPerformWork(BatchDataflowWorker.java:286)
	at com.google.cloud.dataflow.worker.DataflowBatchWorkerHarness$WorkerThread.doWork(DataflowBatchWorkerHarness.java:134)
	at com.google.cloud.dataflow.worker.DataflowBatchWorkerHarness$WorkerThread.call(DataflowBatchWorkerHarness.java:114)
	at com.google.cloud.dataflow.worker.DataflowBatchWorkerHarness$WorkerThread.call(DataflowBatchWorkerHarness.java:101)
	at java.util.concurrent.FutureTask.run(FutureTask.java:266)
	at java.util.concurrent.ThreadPoolExecutor.runWorker(ThreadPoolExecutor.java:1142)
	at java.util.concurrent.ThreadPoolExecutor$Worker.run(ThreadPoolExecutor.java:617)
	at java.lang.Thread.run(Thread.java:745)
Caused by: com.mongodb.MongoTimeoutException: Timed out after 30000 ms while waiting for a
server that matches ReadPreferenceServerSelector{readPreference=primary}. Client view of cluster
state is {type=UNKNOWN, servers=[{address=35.226.189.22:27017, type=UNKNOWN, state=CONNECTING,
exception={com.mongodb.MongoSocketOpenException: Exception opening socket}, caused by {java.net.SocketTimeoutException:
connect timed out}}]
	at com.mongodb.connection.BaseCluster.createTimeoutException(BaseCluster.java:369)
	at com.mongodb.connection.BaseCluster.selectServer(BaseCluster.java:101)
	at com.mongodb.binding.ClusterBinding$ClusterBindingConnectionSource.<init>(ClusterBinding.java:75)
	at com.mongodb.binding.ClusterBinding$ClusterBindingConnectionSource.<init>(ClusterBinding.java:71)
	at com.mongodb.binding.ClusterBinding.getReadConnectionSource(ClusterBinding.java:63)
	at com.mongodb.operation.OperationHelper.withConnection(OperationHelper.java:210)
	at com.mongodb.operation.FindOperation.execute(FindOperation.java:482)
	at com.mongodb.operation.FindOperation.execute(FindOperation.java:79)
	at com.mongodb.Mongo.execute(Mongo.java:772)
	at com.mongodb.Mongo$2.execute(Mongo.java:759)
	at com.mongodb.OperationIterable.iterator(OperationIterable.java:47)
	at com.mongodb.FindIterableImpl.iterator(FindIterableImpl.java:143)
	at org.apache.beam.sdk.io.mongodb.MongoDbIO$BoundedMongoDbReader.start(MongoDbIO.java:456)
	at com.google.cloud.dataflow.worker.WorkerCustomSources$BoundedReaderIterator.start(WorkerCustomSources.java:592)
	... 14 more
Workflow failed. Causes: S03:Read all documents/Read(BoundedMongoDbSource)+Map documents to
Strings/Map+Calculate hashcode/WithKeys/AddKeys/Map+Calculate hashcode/Combine.perKey(Hashing)/GroupByKey+Calculate
hashcode/Combine.perKey(Hashing)/Combine.GroupedValues/Partial+Calculate hashcode/Combine.perKey(Hashing)/GroupByKey/Reify+Calculate
hashcode/Combine.perKey(Hashing)/GroupByKey/Write failed., A work item was attempted 4 times
without success. Each time the worker eventually lost contact with the service. The work item
was attempted on: 
  mongodbioit0testwriteandr-04302315-skwb-harness-v6rt,
  mongodbioit0testwriteandr-04302315-skwb-harness-v6rt,
  mongodbioit0testwriteandr-04302315-skwb-harness-v6rt,
  mongodbioit0testwriteandr-04302315-skwb-harness-v6rt
	at org.apache.beam.runners.dataflow.TestDataflowRunner.run(TestDataflowRunner.java:134)
	at org.apache.beam.runners.dataflow.TestDataflowRunner.run(TestDataflowRunner.java:90)
	at org.apache.beam.runners.dataflow.TestDataflowRunner.run(TestDataflowRunner.java:55)
	at org.apache.beam.sdk.Pipeline.run(Pipeline.java:311)
	at org.apache.beam.sdk.testing.TestPipeline.run(TestPipeline.java:346)
	at org.apache.beam.sdk.testing.TestPipeline.run(TestPipeline.java:328)
	at org.apache.beam.sdk.io.mongodb.MongoDBIOIT.testWriteAndRead(MongoDBIOIT.java:131)
	at sun.reflect.NativeMethodAccessorImpl.invoke0(Native Method)
	at sun.reflect.NativeMethodAccessorImpl.invoke(NativeMethodAccessorImpl.java:62)
	at sun.reflect.DelegatingMethodAccessorImpl.invoke(DelegatingMethodAccessorImpl.java:43)
	at java.lang.reflect.Method.invoke(Method.java:498)
	at org.junit.runners.model.FrameworkMethod$1.runReflectiveCall(FrameworkMethod.java:50)
	at org.junit.internal.runners.model.ReflectiveCallable.run(ReflectiveCallable.java:12)
	at org.junit.runners.model.FrameworkMethod.invokeExplosively(FrameworkMethod.java:47)
	at org.junit.internal.runners.statements.InvokeMethod.evaluate(InvokeMethod.java:17)
	at org.junit.internal.runners.statements.RunAfters.evaluate(RunAfters.java:27)
	at org.apache.beam.sdk.testing.TestPipeline$1.evaluate(TestPipeline.java:317)
	at org.apache.beam.sdk.testing.TestPipeline$1.evaluate(TestPipeline.java:317)
	at org.junit.rules.RunRules.evaluate(RunRules.java:20)
	at org.junit.runners.ParentRunner.runLeaf(ParentRunner.java:325)
	at org.junit.runners.BlockJUnit4ClassRunner.runChild(BlockJUnit4ClassRunner.java:78)
	at org.junit.runners.BlockJUnit4ClassRunner.runChild(BlockJUnit4ClassRunner.java:57)
	at org.junit.runners.ParentRunner$3.run(ParentRunner.java:290)
	at org.apache.maven.surefire.junitcore.pc.Scheduler$1.run(Scheduler.java:410)
	at java.util.concurrent.Executors$RunnableAdapter.call(Executors.java:511)
	at java.util.concurrent.FutureTask.run(FutureTask.java:266)
	at java.util.concurrent.ThreadPoolExecutor.runWorker(ThreadPoolExecutor.java:1149)
	at java.util.concurrent.ThreadPoolExecutor$Worker.run(ThreadPoolExecutor.java:624)
	at java.lang.Thread.run(Thread.java:748)

[ERROR] testWriteAndRead(org.apache.beam.sdk.io.mongodb.MongoDBIOIT)  Time elapsed: 0 s  <<<
ERROR!
com.mongodb.MongoTimeoutException: Timed out after 30000 ms while waiting for a server that
matches WritableServerSelector. Client view of cluster state is {type=UNKNOWN, servers=[{address=35.226.189.22:27017,
type=UNKNOWN, state=CONNECTING, exception={com.mongodb.MongoSocketOpenException: Exception
opening socket}, caused by {java.net.SocketTimeoutException: connect timed out}}]
	at com.mongodb.connection.BaseCluster.createTimeoutException(BaseCluster.java:369)
	at com.mongodb.connection.BaseCluster.selectServer(BaseCluster.java:101)
	at com.mongodb.binding.ClusterBinding$ClusterBindingConnectionSource.<init>(ClusterBinding.java:75)
	at com.mongodb.binding.ClusterBinding$ClusterBindingConnectionSource.<init>(ClusterBinding.java:71)
	at com.mongodb.binding.ClusterBinding.getWriteConnectionSource(ClusterBinding.java:68)
	at com.mongodb.operation.CommandOperationHelper.executeWrappedCommandProtocol(CommandOperationHelper.java:158)
	at com.mongodb.operation.CommandOperationHelper.executeWrappedCommandProtocol(CommandOperationHelper.java:133)
	at com.mongodb.operation.CommandOperationHelper.executeWrappedCommandProtocol(CommandOperationHelper.java:128)
	at com.mongodb.operation.DropDatabaseOperation.execute(DropDatabaseOperation.java:51)
	at com.mongodb.operation.DropDatabaseOperation.execute(DropDatabaseOperation.java:36)
	at com.mongodb.Mongo.execute(Mongo.java:781)
	at com.mongodb.Mongo$2.execute(Mongo.java:764)
	at com.mongodb.MongoDatabaseImpl.drop(MongoDatabaseImpl.java:136)
	at org.apache.beam.sdk.io.mongodb.MongoDBIOIT.tearDown(MongoDBIOIT.java:103)
	at sun.reflect.NativeMethodAccessorImpl.invoke0(Native Method)
	at sun.reflect.NativeMethodAccessorImpl.invoke(NativeMethodAccessorImpl.java:62)
	at sun.reflect.DelegatingMethodAccessorImpl.invoke(DelegatingMethodAccessorImpl.java:43)
	at java.lang.reflect.Method.invoke(Method.java:498)
	at org.junit.runners.model.FrameworkMethod$1.runReflectiveCall(FrameworkMethod.java:50)
	at org.junit.internal.runners.model.ReflectiveCallable.run(ReflectiveCallable.java:12)
	at org.junit.runners.model.FrameworkMethod.invokeExplosively(FrameworkMethod.java:47)
	at org.junit.internal.runners.statements.RunAfters.evaluate(RunAfters.java:33)
	at org.apache.beam.sdk.testing.TestPipeline$1.evaluate(TestPipeline.java:317)
	at org.apache.beam.sdk.testing.TestPipeline$1.evaluate(TestPipeline.java:317)
	at org.junit.rules.RunRules.evaluate(RunRules.java:20)
	at org.junit.runners.ParentRunner.runLeaf(ParentRunner.java:325)
	at org.junit.runners.BlockJUnit4ClassRunner.runChild(BlockJUnit4ClassRunner.java:78)
	at org.junit.runners.BlockJUnit4ClassRunner.runChild(BlockJUnit4ClassRunner.java:57)
	at org.junit.runners.ParentRunner$3.run(ParentRunner.java:290)
	at org.apache.maven.surefire.junitcore.pc.Scheduler$1.run(Scheduler.java:410)
	at java.util.concurrent.Executors$RunnableAdapter.call(Executors.java:511)
	at java.util.concurrent.FutureTask.run(FutureTask.java:266)
	at java.util.concurrent.ThreadPoolExecutor.runWorker(ThreadPoolExecutor.java:1149)
	at java.util.concurrent.ThreadPoolExecutor$Worker.run(ThreadPoolExecutor.java:624)
	at java.lang.Thread.run(Thread.java:748)

[INFO] 
[INFO] Results:
[INFO] 
[ERROR] Errors: 
[ERROR] org.apache.beam.sdk.io.mongodb.MongoDBIOIT.testWriteAndRead(org.apache.beam.sdk.io.mongodb.MongoDBIOIT)
[ERROR]   Run 1: MongoDBIOIT.testWriteAndRead:131  Runtime java.io.IOException: Failed to
star...
[ERROR]   Run 2: MongoDBIOIT.tearDown:103  MongoTimeout Timed out after 30000 ms while waiting...
[INFO] 
[INFO] 
[ERROR] Tests run: 1, Failures: 0, Errors: 1, Skipped: 0
[INFO] 
[INFO] 
[INFO] --- maven-dependency-plugin:3.0.2:analyze-only (default) @ beam-sdks-java-io-mongodb
---
[INFO] No dependency problems found
[INFO] 
[INFO] --- maven-failsafe-plugin:2.21.0:verify (default) @ beam-sdks-java-io-mongodb ---
[INFO] Failsafe report directory: <https://builds.apache.org/job/beam_PerformanceTests_MongoDBIO_IT/ws/runs/e2fd53c2/beam/sdks/java/io/mongodb/target/failsafe-reports>
[INFO] ------------------------------------------------------------------------
[INFO] BUILD FAILURE
[INFO] ------------------------------------------------------------------------
[INFO] Total time: 13:15 min
[INFO] Finished at: 2018-05-01T06:21:44Z
[INFO] Final Memory: 95M/3210M
[INFO] ------------------------------------------------------------------------
[ERROR] Failed to execute goal org.apache.maven.plugins:maven-failsafe-plugin:2.21.0:verify
(default) on project beam-sdks-java-io-mongodb: There are test failures.
[ERROR] 
[ERROR] Please refer to <https://builds.apache.org/job/beam_PerformanceTests_MongoDBIO_IT/ws/runs/e2fd53c2/beam/sdks/java/io/mongodb/target/failsafe-reports>
for the individual test results.
[ERROR] Please refer to dump files (if any exist) [date]-jvmRun[N].dump, [date].dumpstream
and [date]-jvmRun[N].dumpstream.
[ERROR] -> [Help 1]
org.apache.maven.lifecycle.LifecycleExecutionException: Failed to execute goal org.apache.maven.plugins:maven-failsafe-plugin:2.21.0:verify
(default) on project beam-sdks-java-io-mongodb: There are test failures.

Please refer to <https://builds.apache.org/job/beam_PerformanceTests_MongoDBIO_IT/ws/runs/e2fd53c2/beam/sdks/java/io/mongodb/target/failsafe-reports>
for the individual test results.
Please refer to dump files (if any exist) [date]-jvmRun[N].dump, [date].dumpstream and [date]-jvmRun[N].dumpstream.
    at org.apache.maven.lifecycle.internal.MojoExecutor.execute (MojoExecutor.java:213)
    at org.apache.maven.lifecycle.internal.MojoExecutor.execute (MojoExecutor.java:154)
    at org.apache.maven.lifecycle.internal.MojoExecutor.execute (MojoExecutor.java:146)
    at org.apache.maven.lifecycle.internal.LifecycleModuleBuilder.buildProject (LifecycleModuleBuilder.java:117)
    at org.apache.maven.lifecycle.internal.LifecycleModuleBuilder.buildProject (LifecycleModuleBuilder.java:81)
    at org.apache.maven.lifecycle.internal.builder.singlethreaded.SingleThreadedBuilder.build
(SingleThreadedBuilder.java:51)
    at org.apache.maven.lifecycle.internal.LifecycleStarter.execute (LifecycleStarter.java:128)
    at org.apache.maven.DefaultMaven.doExecute (DefaultMaven.java:309)
    at org.apache.maven.DefaultMaven.doExecute (DefaultMaven.java:194)
    at org.apache.maven.DefaultMaven.execute (DefaultMaven.java:107)
    at org.apache.maven.cli.MavenCli.execute (MavenCli.java:955)
    at org.apache.maven.cli.MavenCli.doMain (MavenCli.java:290)
    at org.apache.maven.cli.MavenCli.main (MavenCli.java:194)
    at sun.reflect.NativeMethodAccessorImpl.invoke0 (Native Method)
    at sun.reflect.NativeMethodAccessorImpl.invoke (NativeMethodAccessorImpl.java:62)
    at sun.reflect.DelegatingMethodAccessorImpl.invoke (DelegatingMethodAccessorImpl.java:43)
    at java.lang.reflect.Method.invoke (Method.java:498)
    at org.codehaus.plexus.classworlds.launcher.Launcher.launchEnhanced (Launcher.java:289)
    at org.codehaus.plexus.classworlds.launcher.Launcher.launch (Launcher.java:229)
    at org.codehaus.plexus.classworlds.launcher.Launcher.mainWithExitCode (Launcher.java:415)
    at org.codehaus.plexus.classworlds.launcher.Launcher.main (Launcher.java:356)
Caused by: org.apache.maven.plugin.MojoFailureException: There are test failures.

Please refer to <https://builds.apache.org/job/beam_PerformanceTests_MongoDBIO_IT/ws/runs/e2fd53c2/beam/sdks/java/io/mongodb/target/failsafe-reports>
for the individual test results.
Please refer to dump files (if any exist) [date]-jvmRun[N].dump, [date].dumpstream and [date]-jvmRun[N].dumpstream.
    at org.apache.maven.plugin.surefire.SurefireHelper.throwException (SurefireHelper.java:240)
    at org.apache.maven.plugin.surefire.SurefireHelper.reportExecution (SurefireHelper.java:112)
    at org.apache.maven.plugin.failsafe.VerifyMojo.execute (VerifyMojo.java:192)
    at org.apache.maven.plugin.DefaultBuildPluginManager.executeMojo (DefaultBuildPluginManager.java:134)
    at org.apache.maven.lifecycle.internal.MojoExecutor.execute (MojoExecutor.java:208)
    at org.apache.maven.lifecycle.internal.MojoExecutor.execute (MojoExecutor.java:154)
    at org.apache.maven.lifecycle.internal.MojoExecutor.execute (MojoExecutor.java:146)
    at org.apache.maven.lifecycle.internal.LifecycleModuleBuilder.buildProject (LifecycleModuleBuilder.java:117)
    at org.apache.maven.lifecycle.internal.LifecycleModuleBuilder.buildProject (LifecycleModuleBuilder.java:81)
    at org.apache.maven.lifecycle.internal.builder.singlethreaded.SingleThreadedBuilder.build
(SingleThreadedBuilder.java:51)
    at org.apache.maven.lifecycle.internal.LifecycleStarter.execute (LifecycleStarter.java:128)
    at org.apache.maven.DefaultMaven.doExecute (DefaultMaven.java:309)
    at org.apache.maven.DefaultMaven.doExecute (DefaultMaven.java:194)
    at org.apache.maven.DefaultMaven.execute (DefaultMaven.java:107)
    at org.apache.maven.cli.MavenCli.execute (MavenCli.java:955)
    at org.apache.maven.cli.MavenCli.doMain (MavenCli.java:290)
    at org.apache.maven.cli.MavenCli.main (MavenCli.java:194)
    at sun.reflect.NativeMethodAccessorImpl.invoke0 (Native Method)
    at sun.reflect.NativeMethodAccessorImpl.invoke (NativeMethodAccessorImpl.java:62)
    at sun.reflect.DelegatingMethodAccessorImpl.invoke (DelegatingMethodAccessorImpl.java:43)
    at java.lang.reflect.Method.invoke (Method.java:498)
    at org.codehaus.plexus.classworlds.launcher.Launcher.launchEnhanced (Launcher.java:289)
    at org.codehaus.plexus.classworlds.launcher.Launcher.launch (Launcher.java:229)
    at org.codehaus.plexus.classworlds.launcher.Launcher.mainWithExitCode (Launcher.java:415)
    at org.codehaus.plexus.classworlds.launcher.Launcher.main (Launcher.java:356)
[ERROR] 
[ERROR] Re-run Maven using the -X switch to enable full debug logging.
[ERROR] 
[ERROR] For more information about the errors and possible solutions, please read the following
articles:
[ERROR] [Help 1] http://cwiki.apache.org/confluence/display/MAVEN/MojoFailureException

STDERR: 
2018-05-01 06:21:45,382 e2fd53c2 MainThread beam_integration_benchmark(1/1) ERROR    Error
during benchmark beam_integration_benchmark
Traceback (most recent call last):
  File "<https://builds.apache.org/job/beam_PerformanceTests_MongoDBIO_IT/ws/PerfKitBenchmarker/perfkitbenchmarker/pkb.py",>
line 646, in RunBenchmark
    DoRunPhase(spec, collector, detailed_timer)
  File "<https://builds.apache.org/job/beam_PerformanceTests_MongoDBIO_IT/ws/PerfKitBenchmarker/perfkitbenchmarker/pkb.py",>
line 526, in DoRunPhase
    samples = spec.BenchmarkRun(spec)
  File "<https://builds.apache.org/job/beam_PerformanceTests_MongoDBIO_IT/ws/PerfKitBenchmarker/perfkitbenchmarker/linux_benchmarks/beam_integration_benchmark.py",>
line 159, in Run
    job_type=job_type)
  File "<https://builds.apache.org/job/beam_PerformanceTests_MongoDBIO_IT/ws/PerfKitBenchmarker/perfkitbenchmarker/providers/gcp/gcp_dpb_dataflow.py",>
line 90, in SubmitJob
    assert retcode == 0, "Integration Test Failed."
AssertionError: Integration Test Failed.
2018-05-01 06:21:45,383 e2fd53c2 MainThread beam_integration_benchmark(1/1) INFO     Cleaning
up benchmark beam_integration_benchmark
2018-05-01 06:21:45,383 e2fd53c2 MainThread beam_integration_benchmark(1/1) INFO     Running:
kubectl --kubeconfig=<https://builds.apache.org/job/beam_PerformanceTests_MongoDBIO_IT/ws/config-mongodbioit-1525150928284>
delete -f <https://builds.apache.org/job/beam_PerformanceTests_MongoDBIO_IT/ws/src/.test-infra/kubernetes/mongodb/load-balancer/mongo.yml>
--ignore-not-found
2018-05-01 06:21:45,871 e2fd53c2 MainThread beam_integration_benchmark(1/1) ERROR    Exception
running benchmark
Traceback (most recent call last):
  File "<https://builds.apache.org/job/beam_PerformanceTests_MongoDBIO_IT/ws/PerfKitBenchmarker/perfkitbenchmarker/pkb.py",>
line 780, in RunBenchmarkTask
    RunBenchmark(spec, collector)
  File "<https://builds.apache.org/job/beam_PerformanceTests_MongoDBIO_IT/ws/PerfKitBenchmarker/perfkitbenchmarker/pkb.py",>
line 646, in RunBenchmark
    DoRunPhase(spec, collector, detailed_timer)
  File "<https://builds.apache.org/job/beam_PerformanceTests_MongoDBIO_IT/ws/PerfKitBenchmarker/perfkitbenchmarker/pkb.py",>
line 526, in DoRunPhase
    samples = spec.BenchmarkRun(spec)
  File "<https://builds.apache.org/job/beam_PerformanceTests_MongoDBIO_IT/ws/PerfKitBenchmarker/perfkitbenchmarker/linux_benchmarks/beam_integration_benchmark.py",>
line 159, in Run
    job_type=job_type)
  File "<https://builds.apache.org/job/beam_PerformanceTests_MongoDBIO_IT/ws/PerfKitBenchmarker/perfkitbenchmarker/providers/gcp/gcp_dpb_dataflow.py",>
line 90, in SubmitJob
    assert retcode == 0, "Integration Test Failed."
AssertionError: Integration Test Failed.
2018-05-01 06:21:45,871 e2fd53c2 MainThread beam_integration_benchmark(1/1) ERROR    Benchmark
1/1 beam_integration_benchmark (UID: beam_integration_benchmark0) failed. Execution will continue.
2018-05-01 06:21:45,920 e2fd53c2 MainThread INFO     Benchmark run statuses:
---------------------------------------------------------------------------------
Name                        UID                          Status  Failed Substatus
---------------------------------------------------------------------------------
beam_integration_benchmark  beam_integration_benchmark0  FAILED                  
---------------------------------------------------------------------------------
Success rate: 0.00% (0/1)
2018-05-01 06:21:45,921 e2fd53c2 MainThread INFO     Complete logs can be found at: <https://builds.apache.org/job/beam_PerformanceTests_MongoDBIO_IT/ws/runs/e2fd53c2/pkb.log>
2018-05-01 06:21:45,921 e2fd53c2 MainThread INFO     Completion statuses can be found at:
<https://builds.apache.org/job/beam_PerformanceTests_MongoDBIO_IT/ws/runs/e2fd53c2/completion_statuses.json>
Build step 'Execute shell' marked build as failure

Mime
View raw message