beam-commits mailing list archives

Site index · List index
Message view « Date » · « Thread »
Top « Date » · « Thread »
From Apache Jenkins Server <jenk...@builds.apache.org>
Subject Build failed in Jenkins: beam_PerformanceTests_MongoDBIO_IT #184
Date Fri, 18 May 2018 06:13:13 GMT
See <https://builds.apache.org/job/beam_PerformanceTests_MongoDBIO_IT/184/display/redirect?page=changes>

Changes:

[herohde] Add Go integration tests

[matthias] Futurize metrics subpackage

[timrobertson100] Fix error-prone and some static analysis warnings in

[kedin] Fix Maven build

[rober] Update generated protos in Go SDK

------------------------------------------
[...truncated 182.33 KB...]
    INFO: No server chosen by WritableServerSelector from cluster description ClusterDescription{type=UNKNOWN,
connectionMode=SINGLE, all=[ServerDescription{address=104.154.118.62:27017, type=UNKNOWN,
state=CONNECTING}]}. Waiting for 30000 ms before timing out
    May 18, 2018 6:13:00 AM com.mongodb.diagnostics.logging.SLF4JLogger info
    INFO: Exception in monitor thread while connecting to server 104.154.118.62:27017
    com.mongodb.MongoSocketOpenException: Exception opening socket
    	at com.mongodb.connection.SocketStream.open(SocketStream.java:63)
    	at com.mongodb.connection.InternalStreamConnection.open(InternalStreamConnection.java:114)
    	at com.mongodb.connection.DefaultServerMonitor$ServerMonitorRunnable.run(DefaultServerMonitor.java:128)
    	at java.lang.Thread.run(Thread.java:748)
    Caused by: java.net.SocketTimeoutException: connect timed out
    	at java.net.PlainSocketImpl.socketConnect(Native Method)
    	at java.net.AbstractPlainSocketImpl.doConnect(AbstractPlainSocketImpl.java:350)
    	at java.net.AbstractPlainSocketImpl.connectToAddress(AbstractPlainSocketImpl.java:206)
    	at java.net.AbstractPlainSocketImpl.connect(AbstractPlainSocketImpl.java:188)
    	at java.net.SocksSocketImpl.connect(SocksSocketImpl.java:392)
    	at java.net.Socket.connect(Socket.java:589)
    	at com.mongodb.connection.SocketStreamHelper.initialize(SocketStreamHelper.java:50)
    	at com.mongodb.connection.SocketStream.open(SocketStream.java:58)
    	... 3 more


Gradle Test Executor 1 finished executing tests.

> Task :beam-sdks-java-io-mongodb:integrationTest

org.apache.beam.sdk.io.mongodb.MongoDBIOIT > testWriteAndRead FAILED
    java.lang.RuntimeException: com.mongodb.MongoSocketReadException: Prematurely reached
end of stream
    	at com.mongodb.connection.SocketStream.read(SocketStream.java:88)
    	at com.mongodb.connection.InternalStreamConnection.receiveResponseBuffers(InternalStreamConnection.java:491)
    	at com.mongodb.connection.InternalStreamConnection.receiveMessage(InternalStreamConnection.java:221)
    	at com.mongodb.connection.UsageTrackingInternalConnection.receiveMessage(UsageTrackingInternalConnection.java:102)
    	at com.mongodb.connection.DefaultConnectionPool$PooledConnection.receiveMessage(DefaultConnectionPool.java:435)
    	at com.mongodb.connection.WriteCommandProtocol.receiveMessage(WriteCommandProtocol.java:234)
    	at com.mongodb.connection.WriteCommandProtocol.execute(WriteCommandProtocol.java:104)
    	at com.mongodb.connection.InsertCommandProtocol.execute(InsertCommandProtocol.java:67)
    	at com.mongodb.connection.InsertCommandProtocol.execute(InsertCommandProtocol.java:37)
    	at com.mongodb.connection.DefaultServer$DefaultServerProtocolExecutor.execute(DefaultServer.java:159)
    	at com.mongodb.connection.DefaultServerConnection.executeProtocol(DefaultServerConnection.java:286)
    	at com.mongodb.connection.DefaultServerConnection.insertCommand(DefaultServerConnection.java:115)
    	at com.mongodb.operation.MixedBulkWriteOperation$Run$2.executeWriteCommandProtocol(MixedBulkWriteOperation.java:455)
    	at com.mongodb.operation.MixedBulkWriteOperation$Run$RunExecutor.execute(MixedBulkWriteOperation.java:646)
    	at com.mongodb.operation.MixedBulkWriteOperation$Run.execute(MixedBulkWriteOperation.java:401)
    	at com.mongodb.operation.MixedBulkWriteOperation$1.call(MixedBulkWriteOperation.java:179)
    	at com.mongodb.operation.MixedBulkWriteOperation$1.call(MixedBulkWriteOperation.java:168)
    	at com.mongodb.operation.OperationHelper.withConnectionSource(OperationHelper.java:230)
    	at com.mongodb.operation.OperationHelper.withConnection(OperationHelper.java:221)
    	at com.mongodb.operation.MixedBulkWriteOperation.execute(MixedBulkWriteOperation.java:168)
    	at com.mongodb.operation.MixedBulkWriteOperation.execute(MixedBulkWriteOperation.java:74)
    	at com.mongodb.Mongo.execute(Mongo.java:781)
    	at com.mongodb.Mongo$2.execute(Mongo.java:764)
    	at com.mongodb.MongoCollectionImpl.insertMany(MongoCollectionImpl.java:323)
    	at com.mongodb.MongoCollectionImpl.insertMany(MongoCollectionImpl.java:311)
    	at org.apache.beam.sdk.io.mongodb.MongoDbIO$Write$WriteFn.flush(MongoDbIO.java:667)
    	at org.apache.beam.sdk.io.mongodb.MongoDbIO$Write$WriteFn.processElement(MongoDbIO.java:652)
    com.mongodb.MongoTimeoutException: Timed out after 30000 ms while waiting for a server
that matches WritableServerSelector. Client view of cluster state is {type=UNKNOWN, servers=[{address=104.154.118.62:27017,
type=UNKNOWN, state=CONNECTING, exception={com.mongodb.MongoSocketOpenException: Exception
opening socket}, caused by {java.net.SocketTimeoutException: connect timed out}}]
    	at com.mongodb.connection.BaseCluster.createTimeoutException(BaseCluster.java:369)
    	at com.mongodb.connection.BaseCluster.selectServer(BaseCluster.java:101)
    	at com.mongodb.binding.ClusterBinding$ClusterBindingConnectionSource.<init>(ClusterBinding.java:75)
    	at com.mongodb.binding.ClusterBinding$ClusterBindingConnectionSource.<init>(ClusterBinding.java:71)
    	at com.mongodb.binding.ClusterBinding.getWriteConnectionSource(ClusterBinding.java:68)
    	at com.mongodb.operation.OperationHelper.withConnection(OperationHelper.java:219)
    	at com.mongodb.operation.MixedBulkWriteOperation.execute(MixedBulkWriteOperation.java:168)
    	at com.mongodb.operation.MixedBulkWriteOperation.execute(MixedBulkWriteOperation.java:74)
    	at com.mongodb.Mongo.execute(Mongo.java:781)
    	at com.mongodb.Mongo$2.execute(Mongo.java:764)
    	at com.mongodb.MongoCollectionImpl.insertMany(MongoCollectionImpl.java:323)
    	at com.mongodb.MongoCollectionImpl.insertMany(MongoCollectionImpl.java:311)
    	at org.apache.beam.sdk.io.mongodb.MongoDbIO$Write$WriteFn.flush(MongoDbIO.java:667)
    	at org.apache.beam.sdk.io.mongodb.MongoDbIO$Write$WriteFn.processElement(MongoDbIO.java:652)
    com.mongodb.MongoTimeoutException: Timed out after 30000 ms while waiting for a server
that matches WritableServerSelector. Client view of cluster state is {type=UNKNOWN, servers=[{address=104.154.118.62:27017,
type=UNKNOWN, state=CONNECTING, exception={com.mongodb.MongoSocketOpenException: Exception
opening socket}, caused by {java.net.SocketTimeoutException: connect timed out}}]
    	at com.mongodb.connection.BaseCluster.createTimeoutException(BaseCluster.java:369)
    	at com.mongodb.connection.BaseCluster.selectServer(BaseCluster.java:101)
    	at com.mongodb.binding.ClusterBinding$ClusterBindingConnectionSource.<init>(ClusterBinding.java:75)
    	at com.mongodb.binding.ClusterBinding$ClusterBindingConnectionSource.<init>(ClusterBinding.java:71)
    	at com.mongodb.binding.ClusterBinding.getWriteConnectionSource(ClusterBinding.java:68)
    	at com.mongodb.operation.OperationHelper.withConnection(OperationHelper.java:219)
    	at com.mongodb.operation.MixedBulkWriteOperation.execute(MixedBulkWriteOperation.java:168)
    	at com.mongodb.operation.MixedBulkWriteOperation.execute(MixedBulkWriteOperation.java:74)
    	at com.mongodb.Mongo.execute(Mongo.java:781)
    	at com.mongodb.Mongo$2.execute(Mongo.java:764)
    	at com.mongodb.MongoCollectionImpl.insertMany(MongoCollectionImpl.java:323)
    	at com.mongodb.MongoCollectionImpl.insertMany(MongoCollectionImpl.java:311)
    	at org.apache.beam.sdk.io.mongodb.MongoDbIO$Write$WriteFn.flush(MongoDbIO.java:667)
    	at org.apache.beam.sdk.io.mongodb.MongoDbIO$Write$WriteFn.processElement(MongoDbIO.java:652)
    com.mongodb.MongoTimeoutException: Timed out after 30000 ms while waiting for a server
that matches WritableServerSelector. Client view of cluster state is {type=UNKNOWN, servers=[{address=104.154.118.62:27017,
type=UNKNOWN, state=CONNECTING, exception={com.mongodb.MongoSocketOpenException: Exception
opening socket}, caused by {java.net.SocketTimeoutException: connect timed out}}]
    	at com.mongodb.connection.BaseCluster.createTimeoutException(BaseCluster.java:369)
    	at com.mongodb.connection.BaseCluster.selectServer(BaseCluster.java:101)
    	at com.mongodb.binding.ClusterBinding$ClusterBindingConnectionSource.<init>(ClusterBinding.java:75)
    	at com.mongodb.binding.ClusterBinding$ClusterBindingConnectionSource.<init>(ClusterBinding.java:71)
    	at com.mongodb.binding.ClusterBinding.getWriteConnectionSource(ClusterBinding.java:68)
    	at com.mongodb.operation.OperationHelper.withConnection(OperationHelper.java:219)
    	at com.mongodb.operation.MixedBulkWriteOperation.execute(MixedBulkWriteOperation.java:168)
    	at com.mongodb.operation.MixedBulkWriteOperation.execute(MixedBulkWriteOperation.java:74)
    	at com.mongodb.Mongo.execute(Mongo.java:781)
    	at com.mongodb.Mongo$2.execute(Mongo.java:764)
    	at com.mongodb.MongoCollectionImpl.insertMany(MongoCollectionImpl.java:323)
    	at com.mongodb.MongoCollectionImpl.insertMany(MongoCollectionImpl.java:311)
    	at org.apache.beam.sdk.io.mongodb.MongoDbIO$Write$WriteFn.flush(MongoDbIO.java:667)
    	at org.apache.beam.sdk.io.mongodb.MongoDbIO$Write$WriteFn.processElement(MongoDbIO.java:652)
    Workflow failed. Causes: S01:Generate sequence/Read(BoundedCountingSource)+Produce documents/Map+Write
documents to MongoDB/ParDo(Write) failed., A work item was attempted 4 times without success.
Each time the worker eventually lost contact with the service. The work item was attempted
on: 
      mongodbioit0testwriteandr-05172305-xl75-harness-nn1x,
      mongodbioit0testwriteandr-05172305-xl75-harness-nn1x,
      mongodbioit0testwriteandr-05172305-xl75-harness-nn1x,
      mongodbioit0testwriteandr-05172305-xl75-harness-nn1x
        at org.apache.beam.runners.dataflow.TestDataflowRunner.run(TestDataflowRunner.java:134)
        at org.apache.beam.runners.dataflow.TestDataflowRunner.run(TestDataflowRunner.java:90)
        at org.apache.beam.runners.dataflow.TestDataflowRunner.run(TestDataflowRunner.java:55)
        at org.apache.beam.sdk.Pipeline.run(Pipeline.java:311)
        at org.apache.beam.sdk.testing.TestPipeline.run(TestPipeline.java:348)
        at org.apache.beam.sdk.testing.TestPipeline.run(TestPipeline.java:329)
        at org.apache.beam.sdk.io.mongodb.MongoDBIOIT.testWriteAndRead(MongoDBIOIT.java:118)

    com.mongodb.MongoTimeoutException: Timed out after 30000 ms while waiting for a server
that matches WritableServerSelector. Client view of cluster state is {type=UNKNOWN, servers=[{address=104.154.118.62:27017,
type=UNKNOWN, state=CONNECTING, exception={com.mongodb.MongoSocketOpenException: Exception
opening socket}, caused by {java.net.SocketTimeoutException: connect timed out}}]
        at com.mongodb.connection.BaseCluster.createTimeoutException(BaseCluster.java:369)
        at com.mongodb.connection.BaseCluster.selectServer(BaseCluster.java:101)
        at com.mongodb.binding.ClusterBinding$ClusterBindingConnectionSource.<init>(ClusterBinding.java:75)
        at com.mongodb.binding.ClusterBinding$ClusterBindingConnectionSource.<init>(ClusterBinding.java:71)
        at com.mongodb.binding.ClusterBinding.getWriteConnectionSource(ClusterBinding.java:68)
        at com.mongodb.operation.CommandOperationHelper.executeWrappedCommandProtocol(CommandOperationHelper.java:158)
        at com.mongodb.operation.CommandOperationHelper.executeWrappedCommandProtocol(CommandOperationHelper.java:133)
        at com.mongodb.operation.CommandOperationHelper.executeWrappedCommandProtocol(CommandOperationHelper.java:128)
        at com.mongodb.operation.DropDatabaseOperation.execute(DropDatabaseOperation.java:51)
        at com.mongodb.operation.DropDatabaseOperation.execute(DropDatabaseOperation.java:36)
        at com.mongodb.Mongo.execute(Mongo.java:781)
        at com.mongodb.Mongo$2.execute(Mongo.java:764)
        at com.mongodb.MongoDatabaseImpl.drop(MongoDatabaseImpl.java:136)
        at org.apache.beam.sdk.io.mongodb.MongoDBIOIT.tearDown(MongoDBIOIT.java:103)

1 test completed, 1 failed
Finished generating test XML results (0.016 secs) into: <https://builds.apache.org/job/beam_PerformanceTests_MongoDBIO_IT/ws/src/sdks/java/io/mongodb/build/test-results/integrationTest>
Generating HTML test report...
Finished generating test html results (0.023 secs) into: <https://builds.apache.org/job/beam_PerformanceTests_MongoDBIO_IT/ws/src/sdks/java/io/mongodb/build/reports/tests/integrationTest>

> Task :beam-sdks-java-io-mongodb:integrationTest FAILED
:beam-sdks-java-io-mongodb:integrationTest (Thread[Task worker for ':' Thread 10,5,main])
completed. Took 7 mins 31.357 secs.

Deprecated Gradle features were used in this build, making it incompatible with Gradle 5.0.
See https://docs.gradle.org/4.7/userguide/command_line_interface.html#sec:command_line_warnings

BUILD FAILED in 7m 39s
59 actionable tasks: 1 executed, 58 up-to-date

Publishing build scan...
https://gradle.com/s/43h2356cgzydw


STDERR: 
FAILURE: Build failed with an exception.

* What went wrong:
Execution failed for task ':beam-sdks-java-io-mongodb:integrationTest'.
> There were failing tests. See the report at: file://<https://builds.apache.org/job/beam_PerformanceTests_MongoDBIO_IT/ws/src/sdks/java/io/mongodb/build/reports/tests/integrationTest/index.html>

* Try:
Run with --debug option to get more log output. Run with --scan to get full insights.

* Exception is:
org.gradle.api.tasks.TaskExecutionException: Execution failed for task ':beam-sdks-java-io-mongodb:integrationTest'.
	at org.gradle.api.internal.tasks.execution.ExecuteActionsTaskExecuter.executeActions(ExecuteActionsTaskExecuter.java:103)
	at org.gradle.api.internal.tasks.execution.ExecuteActionsTaskExecuter.execute(ExecuteActionsTaskExecuter.java:73)
	at org.gradle.api.internal.tasks.execution.OutputDirectoryCreatingTaskExecuter.execute(OutputDirectoryCreatingTaskExecuter.java:51)
	at org.gradle.api.internal.tasks.execution.SkipCachedTaskExecuter.execute(SkipCachedTaskExecuter.java:105)
	at org.gradle.api.internal.tasks.execution.SkipUpToDateTaskExecuter.execute(SkipUpToDateTaskExecuter.java:59)
	at org.gradle.api.internal.tasks.execution.ResolveTaskOutputCachingStateExecuter.execute(ResolveTaskOutputCachingStateExecuter.java:54)
	at org.gradle.api.internal.tasks.execution.ResolveBuildCacheKeyExecuter.execute(ResolveBuildCacheKeyExecuter.java:66)
	at org.gradle.api.internal.tasks.execution.ValidatingTaskExecuter.execute(ValidatingTaskExecuter.java:59)
	at org.gradle.api.internal.tasks.execution.SkipEmptySourceFilesTaskExecuter.execute(SkipEmptySourceFilesTaskExecuter.java:101)
	at org.gradle.api.internal.tasks.execution.FinalizeInputFilePropertiesTaskExecuter.execute(FinalizeInputFilePropertiesTaskExecuter.java:44)
	at org.gradle.api.internal.tasks.execution.CleanupStaleOutputsExecuter.execute(CleanupStaleOutputsExecuter.java:91)
	at org.gradle.api.internal.tasks.execution.ResolveTaskArtifactStateTaskExecuter.execute(ResolveTaskArtifactStateTaskExecuter.java:62)
	at org.gradle.api.internal.tasks.execution.SkipTaskWithNoActionsExecuter.execute(SkipTaskWithNoActionsExecuter.java:59)
	at org.gradle.api.internal.tasks.execution.SkipOnlyIfTaskExecuter.execute(SkipOnlyIfTaskExecuter.java:54)
	at org.gradle.api.internal.tasks.execution.ExecuteAtMostOnceTaskExecuter.execute(ExecuteAtMostOnceTaskExecuter.java:43)
	at org.gradle.api.internal.tasks.execution.CatchExceptionTaskExecuter.execute(CatchExceptionTaskExecuter.java:34)
	at org.gradle.execution.taskgraph.DefaultTaskGraphExecuter$EventFiringTaskWorker$1.run(DefaultTaskGraphExecuter.java:256)
	at org.gradle.internal.operations.DefaultBuildOperationExecutor$RunnableBuildOperationWorker.execute(DefaultBuildOperationExecutor.java:317)
	at org.gradle.internal.operations.DefaultBuildOperationExecutor$RunnableBuildOperationWorker.execute(DefaultBuildOperationExecutor.java:309)
	at org.gradle.internal.operations.DefaultBuildOperationExecutor.execute(DefaultBuildOperationExecutor.java:185)
	at org.gradle.internal.operations.DefaultBuildOperationExecutor.run(DefaultBuildOperationExecutor.java:97)
	at org.gradle.internal.operations.DelegatingBuildOperationExecutor.run(DelegatingBuildOperationExecutor.java:31)
	at org.gradle.execution.taskgraph.DefaultTaskGraphExecuter$EventFiringTaskWorker.execute(DefaultTaskGraphExecuter.java:249)
	at org.gradle.execution.taskgraph.DefaultTaskGraphExecuter$EventFiringTaskWorker.execute(DefaultTaskGraphExecuter.java:238)
	at org.gradle.execution.taskgraph.DefaultTaskPlanExecutor$TaskExecutorWorker$1.execute(DefaultTaskPlanExecutor.java:104)
	at org.gradle.execution.taskgraph.DefaultTaskPlanExecutor$TaskExecutorWorker$1.execute(DefaultTaskPlanExecutor.java:98)
	at org.gradle.execution.taskgraph.DefaultTaskExecutionPlan.execute(DefaultTaskExecutionPlan.java:663)
	at org.gradle.execution.taskgraph.DefaultTaskExecutionPlan.executeWithTask(DefaultTaskExecutionPlan.java:596)
	at org.gradle.execution.taskgraph.DefaultTaskPlanExecutor$TaskExecutorWorker.run(DefaultTaskPlanExecutor.java:98)
	at org.gradle.internal.concurrent.ExecutorPolicy$CatchAndRecordFailures.onExecute(ExecutorPolicy.java:63)
	at org.gradle.internal.concurrent.ManagedExecutorImpl$1.run(ManagedExecutorImpl.java:46)
	at org.gradle.internal.concurrent.ThreadFactoryImpl$ManagedThreadRunnable.run(ThreadFactoryImpl.java:55)
Caused by: org.gradle.api.GradleException: There were failing tests. See the report at: file://<https://builds.apache.org/job/beam_PerformanceTests_MongoDBIO_IT/ws/src/sdks/java/io/mongodb/build/reports/tests/integrationTest/index.html>
	at org.gradle.api.tasks.testing.AbstractTestTask.handleTestFailures(AbstractTestTask.java:612)
	at org.gradle.api.tasks.testing.AbstractTestTask.executeTests(AbstractTestTask.java:484)
	at org.gradle.api.tasks.testing.Test.executeTests(Test.java:583)
	at org.gradle.internal.reflect.JavaMethod.invoke(JavaMethod.java:73)
	at org.gradle.api.internal.project.taskfactory.StandardTaskAction.doExecute(StandardTaskAction.java:46)
	at org.gradle.api.internal.project.taskfactory.StandardTaskAction.execute(StandardTaskAction.java:39)
	at org.gradle.api.internal.project.taskfactory.StandardTaskAction.execute(StandardTaskAction.java:26)
	at org.gradle.api.internal.AbstractTask$TaskActionWrapper.execute(AbstractTask.java:794)
	at org.gradle.api.internal.AbstractTask$TaskActionWrapper.execute(AbstractTask.java:761)
	at org.gradle.api.internal.tasks.execution.ExecuteActionsTaskExecuter$1.run(ExecuteActionsTaskExecuter.java:124)
	at org.gradle.internal.operations.DefaultBuildOperationExecutor$RunnableBuildOperationWorker.execute(DefaultBuildOperationExecutor.java:317)
	at org.gradle.internal.operations.DefaultBuildOperationExecutor$RunnableBuildOperationWorker.execute(DefaultBuildOperationExecutor.java:309)
	at org.gradle.internal.operations.DefaultBuildOperationExecutor.execute(DefaultBuildOperationExecutor.java:185)
	at org.gradle.internal.operations.DefaultBuildOperationExecutor.run(DefaultBuildOperationExecutor.java:97)
	at org.gradle.internal.operations.DelegatingBuildOperationExecutor.run(DelegatingBuildOperationExecutor.java:31)
	at org.gradle.api.internal.tasks.execution.ExecuteActionsTaskExecuter.executeAction(ExecuteActionsTaskExecuter.java:113)
	at org.gradle.api.internal.tasks.execution.ExecuteActionsTaskExecuter.executeActions(ExecuteActionsTaskExecuter.java:95)
	... 31 more


* Get more help at https://help.gradle.org

2018-05-18 06:13:11,991 7d380761 MainThread beam_integration_benchmark(1/1) ERROR    Error
during benchmark beam_integration_benchmark
Traceback (most recent call last):
  File "<https://builds.apache.org/job/beam_PerformanceTests_MongoDBIO_IT/ws/PerfKitBenchmarker/perfkitbenchmarker/pkb.py",>
line 660, in RunBenchmark
    DoRunPhase(spec, collector, detailed_timer)
  File "<https://builds.apache.org/job/beam_PerformanceTests_MongoDBIO_IT/ws/PerfKitBenchmarker/perfkitbenchmarker/pkb.py",>
line 540, in DoRunPhase
    samples = spec.BenchmarkRun(spec)
  File "<https://builds.apache.org/job/beam_PerformanceTests_MongoDBIO_IT/ws/PerfKitBenchmarker/perfkitbenchmarker/linux_benchmarks/beam_integration_benchmark.py",>
line 159, in Run
    job_type=job_type)
  File "<https://builds.apache.org/job/beam_PerformanceTests_MongoDBIO_IT/ws/PerfKitBenchmarker/perfkitbenchmarker/providers/gcp/gcp_dpb_dataflow.py",>
line 90, in SubmitJob
    assert retcode == 0, "Integration Test Failed."
AssertionError: Integration Test Failed.
2018-05-18 06:13:11,992 7d380761 MainThread beam_integration_benchmark(1/1) INFO     Cleaning
up benchmark beam_integration_benchmark
2018-05-18 06:13:11,993 7d380761 MainThread beam_integration_benchmark(1/1) INFO     Running:
kubectl --kubeconfig=<https://builds.apache.org/job/beam_PerformanceTests_MongoDBIO_IT/ws/config-mongodbioit-1526619678816>
delete -f <https://builds.apache.org/job/beam_PerformanceTests_MongoDBIO_IT/ws/src/.test-infra/kubernetes/mongodb/load-balancer/mongo.yml>
--ignore-not-found
2018-05-18 06:13:12,498 7d380761 MainThread beam_integration_benchmark(1/1) ERROR    Exception
running benchmark
Traceback (most recent call last):
  File "<https://builds.apache.org/job/beam_PerformanceTests_MongoDBIO_IT/ws/PerfKitBenchmarker/perfkitbenchmarker/pkb.py",>
line 794, in RunBenchmarkTask
    RunBenchmark(spec, collector)
  File "<https://builds.apache.org/job/beam_PerformanceTests_MongoDBIO_IT/ws/PerfKitBenchmarker/perfkitbenchmarker/pkb.py",>
line 660, in RunBenchmark
    DoRunPhase(spec, collector, detailed_timer)
  File "<https://builds.apache.org/job/beam_PerformanceTests_MongoDBIO_IT/ws/PerfKitBenchmarker/perfkitbenchmarker/pkb.py",>
line 540, in DoRunPhase
    samples = spec.BenchmarkRun(spec)
  File "<https://builds.apache.org/job/beam_PerformanceTests_MongoDBIO_IT/ws/PerfKitBenchmarker/perfkitbenchmarker/linux_benchmarks/beam_integration_benchmark.py",>
line 159, in Run
    job_type=job_type)
  File "<https://builds.apache.org/job/beam_PerformanceTests_MongoDBIO_IT/ws/PerfKitBenchmarker/perfkitbenchmarker/providers/gcp/gcp_dpb_dataflow.py",>
line 90, in SubmitJob
    assert retcode == 0, "Integration Test Failed."
AssertionError: Integration Test Failed.
2018-05-18 06:13:12,498 7d380761 MainThread beam_integration_benchmark(1/1) ERROR    Benchmark
1/1 beam_integration_benchmark (UID: beam_integration_benchmark0) failed. Execution will continue.
2018-05-18 06:13:12,510 7d380761 MainThread INFO     Benchmark run statuses:
---------------------------------------------------------------------------------
Name                        UID                          Status  Failed Substatus
---------------------------------------------------------------------------------
beam_integration_benchmark  beam_integration_benchmark0  FAILED                  
---------------------------------------------------------------------------------
Success rate: 0.00% (0/1)
2018-05-18 06:13:12,511 7d380761 MainThread INFO     Complete logs can be found at: <https://builds.apache.org/job/beam_PerformanceTests_MongoDBIO_IT/ws/runs/7d380761/pkb.log>
2018-05-18 06:13:12,511 7d380761 MainThread INFO     Completion statuses can be found at:
<https://builds.apache.org/job/beam_PerformanceTests_MongoDBIO_IT/ws/runs/7d380761/completion_statuses.json>
Build step 'Execute shell' marked build as failure

Mime
View raw message