beam-commits mailing list archives

Site index · List index
Message view « Date » · « Thread »
Top « Date » · « Thread »
From Apache Jenkins Server <jenk...@builds.apache.org>
Subject Build failed in Jenkins: beam_PostCommit_Java_GradleBuild #308
Date Tue, 08 May 2018 17:52:55 GMT
See <https://builds.apache.org/job/beam_PostCommit_Java_GradleBuild/308/display/redirect>

------------------------------------------
[...truncated 18.09 MB...]
    WARNING: Reporting metrics are not supported in the current execution environment.

org.apache.beam.examples.cookbook.MaxPerKeyExamplesTest > testFormatMaxesFn STANDARD_ERROR
    May 08, 2018 5:52:22 PM org.apache.beam.sdk.transforms.DoFnTester of
    WARNING: Your tests use DoFnTester, which may not exercise DoFns correctly. Please use
TestPipeline instead.

org.apache.beam.examples.cookbook.MaxPerKeyExamplesTest > testExtractTempFn STANDARD_ERROR
    May 08, 2018 5:52:22 PM org.apache.beam.sdk.transforms.DoFnTester of
    WARNING: Your tests use DoFnTester, which may not exercise DoFns correctly. Please use
TestPipeline instead.

org.apache.beam.examples.cookbook.BigQueryTornadoesTest > testFormatCounts STANDARD_ERROR
    May 08, 2018 5:52:22 PM org.apache.beam.sdk.transforms.DoFnTester of
    WARNING: Your tests use DoFnTester, which may not exercise DoFns correctly. Please use
TestPipeline instead.

org.apache.beam.examples.cookbook.BigQueryTornadoesTest > testExtractTornadoes STANDARD_ERROR
    May 08, 2018 5:52:22 PM org.apache.beam.sdk.transforms.DoFnTester of
    WARNING: Your tests use DoFnTester, which may not exercise DoFns correctly. Please use
TestPipeline instead.

org.apache.beam.examples.cookbook.BigQueryTornadoesTest > testNoTornadoes STANDARD_ERROR
    May 08, 2018 5:52:22 PM org.apache.beam.sdk.transforms.DoFnTester of
    WARNING: Your tests use DoFnTester, which may not exercise DoFns correctly. Please use
TestPipeline instead.

org.apache.beam.examples.cookbook.TriggerExampleTest > testExtractTotalFlow STANDARD_ERROR
    May 08, 2018 5:52:27 PM org.apache.beam.sdk.transforms.DoFnTester of
    WARNING: Your tests use DoFnTester, which may not exercise DoFns correctly. Please use
TestPipeline instead.

org.apache.beam.examples.cookbook.FilterExamplesTest > testFilterSingleMonthDataFn STANDARD_ERROR
    May 08, 2018 5:52:27 PM org.apache.beam.sdk.transforms.DoFnTester of
    WARNING: Your tests use DoFnTester, which may not exercise DoFns correctly. Please use
TestPipeline instead.

org.apache.beam.examples.cookbook.FilterExamplesTest > testProjectionFn STANDARD_ERROR
    May 08, 2018 5:52:27 PM org.apache.beam.sdk.transforms.DoFnTester of
    WARNING: Your tests use DoFnTester, which may not exercise DoFns correctly. Please use
TestPipeline instead.

org.apache.beam.examples.cookbook.JoinExamplesTest > testExtractCountryInfoFn STANDARD_ERROR
    May 08, 2018 5:52:27 PM org.apache.beam.sdk.transforms.DoFnTester of
    WARNING: Your tests use DoFnTester, which may not exercise DoFns correctly. Please use
TestPipeline instead.

org.apache.beam.examples.cookbook.JoinExamplesTest > testExtractEventDataFn STANDARD_ERROR
    May 08, 2018 5:52:28 PM org.apache.beam.sdk.transforms.DoFnTester of
    WARNING: Your tests use DoFnTester, which may not exercise DoFns correctly. Please use
TestPipeline instead.

org.apache.beam.examples.DebuggingWordCountTest > testDebuggingWordCount STANDARD_ERROR
    May 08, 2018 5:52:28 PM org.apache.beam.sdk.io.FileBasedSource getEstimatedSizeBytes
    INFO: Filepattern /tmp/junit5271652553285159826/junit3029053575552396707.tmp matched 1
files with total size 54
    May 08, 2018 5:52:28 PM org.apache.beam.sdk.io.FileBasedSource split
    INFO: Splitting filepattern /tmp/junit5271652553285159826/junit3029053575552396707.tmp
into bundles of size 3 took 2 ms and produced 1 files and 18 bundles

org.apache.beam.examples.WordCountTest > testExtractWordsFn STANDARD_ERROR
    May 08, 2018 5:52:29 PM org.apache.beam.sdk.transforms.DoFnTester of
    WARNING: Your tests use DoFnTester, which may not exercise DoFns correctly. Please use
TestPipeline instead.

org.apache.beam.examples.subprocess.ExampleEchoPipelineTest > testExampleEchoPipeline STANDARD_ERROR
    May 08, 2018 5:52:32 PM org.apache.beam.examples.subprocess.utils.CallingSubProcessUtils
initSemaphore
    INFO: Initialized Semaphore for binary test-Echo5360505919515959406.sh 
    May 08, 2018 5:52:32 PM org.apache.beam.examples.subprocess.utils.CallingSubProcessUtils
setUp
    INFO: Calling filesetup to move Executables to worker.
    May 08, 2018 5:52:32 PM org.apache.beam.examples.subprocess.utils.FileUtils copyFileFromGCSToWorker
    INFO: Moving File /tmp/test-Echo5360505919515959406.sh to /tmp/test-Echoo649354037778845984/test-Echo5360505919515959406.sh

    May 08, 2018 5:52:32 PM org.apache.beam.examples.subprocess.utils.CallingSubProcessUtils
initSemaphore
    INFO: Initialized Semaphore for binary test-EchoAgain6303941799675434799.sh 
    May 08, 2018 5:52:32 PM org.apache.beam.examples.subprocess.utils.CallingSubProcessUtils
setUp
    INFO: Calling filesetup to move Executables to worker.
    May 08, 2018 5:52:32 PM org.apache.beam.examples.subprocess.utils.FileUtils copyFileFromGCSToWorker
    INFO: Moving File /tmp/test-EchoAgain6303941799675434799.sh to /tmp/test-Echoo649354037778845984/test-EchoAgain6303941799675434799.sh


org.apache.beam.examples.complete.game.HourlyTeamScoreTest > testUserScoresFilter STANDARD_OUT
    GOT user0_AndroidGreenEchidna,AndroidGreenEchidna,0,1447965690000,2015-11-19 12:41:31.053
    GOT user7_AndroidGreenKookaburra,AndroidGreenKookaburra,11,1447955630000,2015-11-19 09:53:53.444
    GOT user19_BisqueBilby,BisqueBilby,6,1447955630000,2015-11-19 09:53:53.444
    GOT user2_AmberCockatoo,AmberCockatoo,13,1447965690000,2015-11-19 12:41:31.053
    GOT user3_BananaEmu,BananaEmu,17,1447965690000,2015-11-19 12:41:31.053
    GOT user13_ApricotQuokka,ApricotQuokka,15,1447955630000,2015-11-19 09:53:53.444
    GOT user18_ApricotCaneToad,ApricotCaneToad,14,1447965690000,2015-11-19 12:41:31.053
    GOT user6_AmberNumbat,AmberNumbat,11,1447955630000,2015-11-19 09:53:53.444
    GOT user18_BananaEmu,BananaEmu,7,1447965690000,2015-11-19 12:41:31.053
    GOT user0_MagentaKangaroo,MagentaKangaroo,3,1447955630000,2015-11-19 09:53:53.444
    GOT user0_MagentaKangaroo,MagentaKangaroo,4,1447965690000,2015-11-19 12:41:31.053
    GOT user19_BisqueBilby,BisqueBilby,8,1447955630000,2015-11-19 09:53:53.444
    GOT user7_AndroidGreenKookaburra,AndroidGreenKookaburra,12,1447955630000,2015-11-19 09:53:53.444
    GOT user7_AlmondWallaby,AlmondWallaby,15,1447955630000,2015-11-19 09:53:53.444
    GOT user18_BananaEmu,BananaEmu,1,1447965690000,2015-11-19 12:41:31.053

org.apache.beam.examples.complete.game.UserScoreTest > testTeamScoreSums STANDARD_OUT
    GOT user6_AmberNumbat,AmberNumbat,11,1447955630000,2015-11-19 09:53:53.444
    GOT user7_AlmondWallaby,AlmondWallaby,15,1447955630000,2015-11-19 09:53:53.444
    GOT user7_AndroidGreenKookaburra,AndroidGreenKookaburra,12,1447955630000,2015-11-19 09:53:53.444
    GOT THIS IS A PARSE ERROR,2015-11-19 09:53:53.444

org.apache.beam.examples.complete.game.UserScoreTest > testTeamScoreSums STANDARD_ERROR
    May 08, 2018 5:52:36 PM org.apache.beam.examples.complete.game.UserScore$ParseEventFn
processElement
    INFO: Parse error on THIS IS A PARSE ERROR,2015-11-19 09:53:53.444, 2

org.apache.beam.examples.complete.game.UserScoreTest > testTeamScoreSums STANDARD_OUT
    GOT user13_ApricotQuokka,ApricotQuokka,15,1447955630000,2015-11-19 09:53:53.444
    GOT user0_MagentaKangaroo,MagentaKangaroo,3,1447955630000,2015-11-19 09:53:53.444
    GOT user6_AliceBlueDingo,AliceBlueDingo,4,xxxxxxx,2015-11-19 09:53:53.444

org.apache.beam.examples.complete.game.UserScoreTest > testTeamScoreSums STANDARD_ERROR
    May 08, 2018 5:52:36 PM org.apache.beam.examples.complete.game.UserScore$ParseEventFn
processElement
    INFO: Parse error on user6_AliceBlueDingo,AliceBlueDingo,4,xxxxxxx,2015-11-19 09:53:53.444,
For input string: "xxxxxxx"

org.apache.beam.examples.complete.game.UserScoreTest > testTeamScoreSums STANDARD_OUT
    GOT user19_BisqueBilby,BisqueBilby,8,1447955630000,2015-11-19 09:53:53.444
    GOT user7_AndroidGreenKookaburra,AndroidGreenKookaburra,11,1447955630000,2015-11-19 09:53:53.444
    GOT user19_BisqueBilby,BisqueBilby,6,1447955630000,2015-11-19 09:53:53.444

org.apache.beam.examples.complete.game.UserScoreTest > testUserScoresBadInput STANDARD_OUT
    GOT user6_AliceBlueDingo,AliceBlueDingo,4,xxxxxxx,2015-11-19 09:53:53.444

org.apache.beam.examples.complete.game.UserScoreTest > testUserScoresBadInput STANDARD_ERROR
    May 08, 2018 5:52:36 PM org.apache.beam.examples.complete.game.UserScore$ParseEventFn
processElement
    INFO: Parse error on user6_AliceBlueDingo,AliceBlueDingo,4,xxxxxxx,2015-11-19 09:53:53.444,
For input string: "xxxxxxx"

org.apache.beam.examples.complete.game.UserScoreTest > testUserScoresBadInput STANDARD_OUT
    GOT THIS IS A PARSE ERROR,2015-11-19 09:53:53.444

org.apache.beam.examples.complete.game.UserScoreTest > testUserScoresBadInput STANDARD_ERROR
    May 08, 2018 5:52:36 PM org.apache.beam.examples.complete.game.UserScore$ParseEventFn
processElement
    INFO: Parse error on THIS IS A PARSE ERROR,2015-11-19 09:53:53.444, 2

org.apache.beam.examples.complete.game.UserScoreTest > testUserScoresBadInput STANDARD_OUT
    GOT user13_BisqueBilby,BisqueBilby,xxx,1447955630000,2015-11-19 09:53:53.444

org.apache.beam.examples.complete.game.UserScoreTest > testUserScoresBadInput STANDARD_ERROR
    May 08, 2018 5:52:36 PM org.apache.beam.examples.complete.game.UserScore$ParseEventFn
processElement
    INFO: Parse error on user13_BisqueBilby,BisqueBilby,xxx,1447955630000,2015-11-19 09:53:53.444,
For input string: "xxx"

org.apache.beam.examples.complete.game.UserScoreTest > testUserScoreSums STANDARD_OUT
    GOT user7_AndroidGreenKookaburra,AndroidGreenKookaburra,11,1447955630000,2015-11-19 09:53:53.444
    GOT user7_AlmondWallaby,AlmondWallaby,15,1447955630000,2015-11-19 09:53:53.444
    GOT user19_BisqueBilby,BisqueBilby,6,1447955630000,2015-11-19 09:53:53.444
    GOT user6_AliceBlueDingo,AliceBlueDingo,4,xxxxxxx,2015-11-19 09:53:53.444

org.apache.beam.examples.complete.game.UserScoreTest > testUserScoreSums STANDARD_ERROR
    May 08, 2018 5:52:37 PM org.apache.beam.examples.complete.game.UserScore$ParseEventFn
processElement
    INFO: Parse error on user6_AliceBlueDingo,AliceBlueDingo,4,xxxxxxx,2015-11-19 09:53:53.444,
For input string: "xxxxxxx"

org.apache.beam.examples.complete.game.UserScoreTest > testUserScoreSums STANDARD_OUT
    GOT user19_BisqueBilby,BisqueBilby,8,1447955630000,2015-11-19 09:53:53.444
    GOT user0_MagentaKangaroo,MagentaKangaroo,3,1447955630000,2015-11-19 09:53:53.444
    GOT user13_ApricotQuokka,ApricotQuokka,15,1447955630000,2015-11-19 09:53:53.444
    GOT user6_AmberNumbat,AmberNumbat,11,1447955630000,2015-11-19 09:53:53.444
    GOT THIS IS A PARSE ERROR,2015-11-19 09:53:53.444

org.apache.beam.examples.complete.game.UserScoreTest > testUserScoreSums STANDARD_ERROR
    May 08, 2018 5:52:37 PM org.apache.beam.examples.complete.game.UserScore$ParseEventFn
processElement
    INFO: Parse error on THIS IS A PARSE ERROR,2015-11-19 09:53:53.444, 2

org.apache.beam.examples.complete.game.UserScoreTest > testUserScoreSums STANDARD_OUT
    GOT user7_AndroidGreenKookaburra,AndroidGreenKookaburra,12,1447955630000,2015-11-19 09:53:53.444

org.apache.beam.examples.complete.game.UserScoreTest > testParseEventFn STANDARD_ERROR
    May 08, 2018 5:52:37 PM org.apache.beam.sdk.transforms.DoFnTester of
    WARNING: Your tests use DoFnTester, which may not exercise DoFns correctly. Please use
TestPipeline instead.

org.apache.beam.examples.complete.game.UserScoreTest > testParseEventFn STANDARD_OUT
    GOT user0_MagentaKangaroo,MagentaKangaroo,3,1447955630000,2015-11-19 09:53:53.444
    GOT user13_ApricotQuokka,ApricotQuokka,15,1447955630000,2015-11-19 09:53:53.444
    GOT user6_AmberNumbat,AmberNumbat,11,1447955630000,2015-11-19 09:53:53.444
    GOT user7_AlmondWallaby,AlmondWallaby,15,1447955630000,2015-11-19 09:53:53.444
    GOT user7_AndroidGreenKookaburra,AndroidGreenKookaburra,12,1447955630000,2015-11-19 09:53:53.444
    GOT user6_AliceBlueDingo,AliceBlueDingo,4,xxxxxxx,2015-11-19 09:53:53.444

org.apache.beam.examples.complete.game.UserScoreTest > testParseEventFn STANDARD_ERROR
    May 08, 2018 5:52:37 PM org.apache.beam.examples.complete.game.UserScore$ParseEventFn
processElement
    INFO: Parse error on user6_AliceBlueDingo,AliceBlueDingo,4,xxxxxxx,2015-11-19 09:53:53.444,
For input string: "xxxxxxx"

org.apache.beam.examples.complete.game.UserScoreTest > testParseEventFn STANDARD_OUT
    GOT user7_AndroidGreenKookaburra,AndroidGreenKookaburra,11,1447955630000,2015-11-19 09:53:53.444
    GOT THIS IS A PARSE ERROR,2015-11-19 09:53:53.444

org.apache.beam.examples.complete.game.UserScoreTest > testParseEventFn STANDARD_ERROR
    May 08, 2018 5:52:37 PM org.apache.beam.examples.complete.game.UserScore$ParseEventFn
processElement
    INFO: Parse error on THIS IS A PARSE ERROR,2015-11-19 09:53:53.444, 2

org.apache.beam.examples.complete.game.UserScoreTest > testParseEventFn STANDARD_OUT
    GOT user19_BisqueBilby,BisqueBilby,6,1447955630000,2015-11-19 09:53:53.444
    GOT user19_BisqueBilby,BisqueBilby,8,1447955630000,2015-11-19 09:53:53.444

org.apache.beam.examples.complete.game.GameStatsTest > testCalculateSpammyUsers STANDARD_ERROR
    May 08, 2018 5:52:38 PM org.apache.beam.examples.complete.game.GameStats$CalculateSpammyUsers$1
processElement
    INFO: user Robot-2 spammer score 66 with mean 24.923076923076923
    May 08, 2018 5:52:38 PM org.apache.beam.examples.complete.game.GameStats$CalculateSpammyUsers$1
processElement
    INFO: user Robot-1 spammer score 116 with mean 24.923076923076923

Gradle Test Executor 127 finished executing tests.

> Task :beam-examples-java:test
Finished generating test XML results (0.004 secs) into: <https://builds.apache.org/job/beam_PostCommit_Java_GradleBuild/ws/src/examples/java/build/test-results/test>
Generating HTML test report...
Finished generating test html results (0.012 secs) into: <https://builds.apache.org/job/beam_PostCommit_Java_GradleBuild/ws/src/examples/java/build/reports/tests/test>
Packing task ':beam-examples-java:test'
:beam-examples-java:test (Thread[Task worker for ':' Thread 2,5,main]) completed. Took 29.282
secs.
:beam-examples-java:check (Thread[Task worker for ':' Thread 10,5,main]) started.

> Task :beam-examples-java:check
Skipping task ':beam-examples-java:check' as it has no actions.
:beam-examples-java:check (Thread[Task worker for ':' Thread 10,5,main]) completed. Took 0.0
secs.
:beam-examples-java:build (Thread[Task worker for ':' Thread 10,5,main]) started.

> Task :beam-examples-java:build
Skipping task ':beam-examples-java:build' as it has no actions.
:beam-examples-java:build (Thread[Task worker for ':' Thread 10,5,main]) completed. Took 0.0
secs.
:beam-examples-java:buildDependents (Thread[Task worker for ':' Thread 10,5,main]) started.

> Task :beam-examples-java:buildDependents
Caching disabled for task ':beam-examples-java:buildDependents': Caching has not been enabled
for the task
Task ':beam-examples-java:buildDependents' is not up-to-date because:
  Task has not declared any outputs despite executing actions.
:beam-examples-java:buildDependents (Thread[Task worker for ':' Thread 10,5,main]) completed.
Took 0.001 secs.

FAILURE: Build completed with 2 failures.

1: Task failed with an exception.
-----------
* What went wrong:
Execution failed for task ':beam-sdks-java-extensions-sql:compileJava'.
> Compilation failed with exit code 1; see the compiler error output for details.

* Try:
Run with --stacktrace option to get the stack trace. Run with --debug option to get more log
output. Run with --scan to get full insights.
==============================================================================

2: Task failed with an exception.
-----------
* What went wrong:
Execution failed for task ':beam-runners-direct-java:test'.
> There were failing tests. See the report at: file://<https://builds.apache.org/job/beam_PostCommit_Java_GradleBuild/ws/src/runners/direct-java/build/reports/tests/test/index.html>

* Try:
Run with --stacktrace option to get the stack trace. Run with --debug option to get more log
output. Run with --scan to get full insights.
==============================================================================

* Get more help at https://help.gradle.org

Deprecated Gradle features were used in this build, making it incompatible with Gradle 5.0.
See https://docs.gradle.org/4.7/userguide/command_line_interface.html#sec:command_line_warnings

BUILD FAILED in 38m 25s
517 actionable tasks: 512 executed, 5 from cache

Publishing build scan...
https://gradle.com/s/jqazfut2s7lm6

Build step 'Invoke Gradle script' changed build result to FAILURE
Build step 'Invoke Gradle script' marked build as failure
Recording test results
Not sending mail to unregistered user schroederc@google.com

Mime
View raw message