beam-commits mailing list archives

Site index · List index
Message view « Date » · « Thread »
Top « Date » · « Thread »
From Apache Jenkins Server <jenk...@builds.apache.org>
Subject Build failed in Jenkins: beam_PerformanceTests_MongoDBIO_IT #124
Date Thu, 03 May 2018 06:14:59 GMT
See <https://builds.apache.org/job/beam_PerformanceTests_MongoDBIO_IT/124/display/redirect?page=changes>

Changes:

[tgroh] Add KV and Window Coder Utilities to ModelCoders

[tgroh] Use ModelCoders in ProcessBundleDescriptors

[sidhom] Remove StateRequestHandler from JobBundleFactory

------------------------------------------
[...truncated 461.89 KB...]
    	at com.mongodb.operation.OperationHelper.withConnectionSource(OperationHelper.java:230)
    	at com.mongodb.operation.OperationHelper.withConnection(OperationHelper.java:221)
    	at com.mongodb.operation.MixedBulkWriteOperation.execute(MixedBulkWriteOperation.java:168)
    	at com.mongodb.operation.MixedBulkWriteOperation.execute(MixedBulkWriteOperation.java:74)
    	at com.mongodb.Mongo.execute(Mongo.java:781)
    	at com.mongodb.Mongo$2.execute(Mongo.java:764)
    	at com.mongodb.MongoCollectionImpl.insertMany(MongoCollectionImpl.java:323)
    	at com.mongodb.MongoCollectionImpl.insertMany(MongoCollectionImpl.java:311)
    	at org.apache.beam.sdk.io.mongodb.MongoDbIO$Write$WriteFn.flush(MongoDbIO.java:667)
    	at org.apache.beam.sdk.io.mongodb.MongoDbIO$Write$WriteFn.processElement(MongoDbIO.java:652)
    	at org.apache.beam.sdk.io.mongodb.MongoDbIO$Write$WriteFn$DoFnInvoker.invokeProcessElement(Unknown
Source)
    	at org.apache.beam.runners.core.SimpleDoFnRunner.invokeProcessElement(SimpleDoFnRunner.java:177)
    	at org.apache.beam.runners.core.SimpleDoFnRunner.processElement(SimpleDoFnRunner.java:141)
    	at com.google.cloud.dataflow.worker.SimpleParDoFn.processElement(SimpleParDoFn.java:323)
    	at com.google.cloud.dataflow.worker.util.common.worker.ParDoOperation.process(ParDoOperation.java:43)
    	at com.google.cloud.dataflow.worker.util.common.worker.OutputReceiver.process(OutputReceiver.java:48)
    	at com.google.cloud.dataflow.worker.SimpleParDoFn$1.output(SimpleParDoFn.java:271)
    	at org.apache.beam.runners.core.SimpleDoFnRunner.outputWindowedValue(SimpleDoFnRunner.java:211)
    	at org.apache.beam.runners.core.SimpleDoFnRunner.access$700(SimpleDoFnRunner.java:66)
    	at org.apache.beam.runners.core.SimpleDoFnRunner$DoFnProcessContext.output(SimpleDoFnRunner.java:436)
    	at org.apache.beam.runners.core.SimpleDoFnRunner$DoFnProcessContext.output(SimpleDoFnRunner.java:424)
    	at org.apache.beam.sdk.transforms.MapElements$1.processElement(MapElements.java:129)
    	at org.apache.beam.sdk.transforms.MapElements$1$DoFnInvoker.invokeProcessElement(Unknown
Source)
    	at org.apache.beam.runners.core.SimpleDoFnRunner.invokeProcessElement(SimpleDoFnRunner.java:177)
    	at org.apache.beam.runners.core.SimpleDoFnRunner.processElement(SimpleDoFnRunner.java:141)
    	at com.google.cloud.dataflow.worker.SimpleParDoFn.processElement(SimpleParDoFn.java:323)
    	at com.google.cloud.dataflow.worker.util.common.worker.ParDoOperation.process(ParDoOperation.java:43)
    	at com.google.cloud.dataflow.worker.util.common.worker.OutputReceiver.process(OutputReceiver.java:48)
    	at com.google.cloud.dataflow.worker.util.common.worker.ReadOperation.runReadLoop(ReadOperation.java:200)
    	at com.google.cloud.dataflow.worker.util.common.worker.ReadOperation.start(ReadOperation.java:158)
    	at com.google.cloud.dataflow.worker.util.common.worker.MapTaskExecutor.execute(MapTaskExecutor.java:75)
    	at com.google.cloud.dataflow.worker.BatchDataflowWorker.executeWork(BatchDataflowWorker.java:383)
    	at com.google.cloud.dataflow.worker.BatchDataflowWorker.doWork(BatchDataflowWorker.java:355)
    	at com.google.cloud.dataflow.worker.BatchDataflowWorker.getAndPerformWork(BatchDataflowWorker.java:286)
    	at com.google.cloud.dataflow.worker.DataflowBatchWorkerHarness$WorkerThread.doWork(DataflowBatchWorkerHarness.java:134)
    	at com.google.cloud.dataflow.worker.DataflowBatchWorkerHarness$WorkerThread.call(DataflowBatchWorkerHarness.java:114)
    	at com.google.cloud.dataflow.worker.DataflowBatchWorkerHarness$WorkerThread.call(DataflowBatchWorkerHarness.java:101)
    	at java.util.concurrent.FutureTask.run(FutureTask.java:266)
    	at java.util.concurrent.ThreadPoolExecutor.runWorker(ThreadPoolExecutor.java:1142)
    	at java.util.concurrent.ThreadPoolExecutor$Worker.run(ThreadPoolExecutor.java:617)
    	at java.lang.Thread.run(Thread.java:745)
    com.mongodb.MongoTimeoutException: Timed out after 30000 ms while waiting for a server
that matches WritableServerSelector. Client view of cluster state is {type=UNKNOWN, servers=[{address=35.202.200.85:27017,
type=UNKNOWN, state=CONNECTING, exception={com.mongodb.MongoSocketOpenException: Exception
opening socket}, caused by {java.net.SocketTimeoutException: connect timed out}}]
    	at com.mongodb.connection.BaseCluster.createTimeoutException(BaseCluster.java:369)
    	at com.mongodb.connection.BaseCluster.selectServer(BaseCluster.java:101)
    	at com.mongodb.binding.ClusterBinding$ClusterBindingConnectionSource.<init>(ClusterBinding.java:75)
    	at com.mongodb.binding.ClusterBinding$ClusterBindingConnectionSource.<init>(ClusterBinding.java:71)
    	at com.mongodb.binding.ClusterBinding.getWriteConnectionSource(ClusterBinding.java:68)
    	at com.mongodb.operation.OperationHelper.withConnection(OperationHelper.java:219)
    	at com.mongodb.operation.MixedBulkWriteOperation.execute(MixedBulkWriteOperation.java:168)
    	at com.mongodb.operation.MixedBulkWriteOperation.execute(MixedBulkWriteOperation.java:74)
    	at com.mongodb.Mongo.execute(Mongo.java:781)
    	at com.mongodb.Mongo$2.execute(Mongo.java:764)
    	at com.mongodb.MongoCollectionImpl.insertMany(MongoCollectionImpl.java:323)
    	at com.mongodb.MongoCollectionImpl.insertMany(MongoCollectionImpl.java:311)
    	at org.apache.beam.sdk.io.mongodb.MongoDbIO$Write$WriteFn.flush(MongoDbIO.java:667)
    	at org.apache.beam.sdk.io.mongodb.MongoDbIO$Write$WriteFn.processElement(MongoDbIO.java:652)
    com.mongodb.MongoTimeoutException: Timed out after 30000 ms while waiting for a server
that matches WritableServerSelector. Client view of cluster state is {type=UNKNOWN, servers=[{address=35.202.200.85:27017,
type=UNKNOWN, state=CONNECTING, exception={com.mongodb.MongoSocketOpenException: Exception
opening socket}, caused by {java.net.SocketTimeoutException: connect timed out}}]
    	at com.mongodb.connection.BaseCluster.createTimeoutException(BaseCluster.java:369)
    	at com.mongodb.connection.BaseCluster.selectServer(BaseCluster.java:101)
    	at com.mongodb.binding.ClusterBinding$ClusterBindingConnectionSource.<init>(ClusterBinding.java:75)
    	at com.mongodb.binding.ClusterBinding$ClusterBindingConnectionSource.<init>(ClusterBinding.java:71)
    	at com.mongodb.binding.ClusterBinding.getWriteConnectionSource(ClusterBinding.java:68)
    	at com.mongodb.operation.OperationHelper.withConnection(OperationHelper.java:219)
    	at com.mongodb.operation.MixedBulkWriteOperation.execute(MixedBulkWriteOperation.java:168)
    	at com.mongodb.operation.MixedBulkWriteOperation.execute(MixedBulkWriteOperation.java:74)
    	at com.mongodb.Mongo.execute(Mongo.java:781)
    	at com.mongodb.Mongo$2.execute(Mongo.java:764)
    	at com.mongodb.MongoCollectionImpl.insertMany(MongoCollectionImpl.java:323)
    	at com.mongodb.MongoCollectionImpl.insertMany(MongoCollectionImpl.java:311)
    	at org.apache.beam.sdk.io.mongodb.MongoDbIO$Write$WriteFn.flush(MongoDbIO.java:667)
    	at org.apache.beam.sdk.io.mongodb.MongoDbIO$Write$WriteFn.processElement(MongoDbIO.java:652)
    com.mongodb.MongoTimeoutException: Timed out after 30000 ms while waiting for a server
that matches WritableServerSelector. Client view of cluster state is {type=UNKNOWN, servers=[{address=35.202.200.85:27017,
type=UNKNOWN, state=CONNECTING, exception={com.mongodb.MongoSocketOpenException: Exception
opening socket}, caused by {java.net.SocketTimeoutException: connect timed out}}]
    	at com.mongodb.connection.BaseCluster.createTimeoutException(BaseCluster.java:369)
    	at com.mongodb.connection.BaseCluster.selectServer(BaseCluster.java:101)
    	at com.mongodb.binding.ClusterBinding$ClusterBindingConnectionSource.<init>(ClusterBinding.java:75)
    	at com.mongodb.binding.ClusterBinding$ClusterBindingConnectionSource.<init>(ClusterBinding.java:71)
    	at com.mongodb.binding.ClusterBinding.getWriteConnectionSource(ClusterBinding.java:68)
    	at com.mongodb.operation.OperationHelper.withConnection(OperationHelper.java:219)
    	at com.mongodb.operation.MixedBulkWriteOperation.execute(MixedBulkWriteOperation.java:168)
    	at com.mongodb.operation.MixedBulkWriteOperation.execute(MixedBulkWriteOperation.java:74)
    	at com.mongodb.Mongo.execute(Mongo.java:781)
    	at com.mongodb.Mongo$2.execute(Mongo.java:764)
    	at com.mongodb.MongoCollectionImpl.insertMany(MongoCollectionImpl.java:323)
    	at com.mongodb.MongoCollectionImpl.insertMany(MongoCollectionImpl.java:311)
    	at org.apache.beam.sdk.io.mongodb.MongoDbIO$Write$WriteFn.flush(MongoDbIO.java:667)
    	at org.apache.beam.sdk.io.mongodb.MongoDbIO$Write$WriteFn.processElement(MongoDbIO.java:652)
    com.mongodb.MongoTimeoutException: Timed out after 30000 ms while waiting for a server
that matches WritableServerSelector. Client view of cluster state is {type=UNKNOWN, servers=[{address=35.202.200.85:27017,
type=UNKNOWN, state=CONNECTING, exception={com.mongodb.MongoSocketOpenException: Exception
opening socket}, caused by {java.net.SocketTimeoutException: connect timed out}}]
    	at com.mongodb.connection.BaseCluster.createTimeoutException(BaseCluster.java:369)
    	at com.mongodb.connection.BaseCluster.selectServer(BaseCluster.java:101)
    	at com.mongodb.binding.ClusterBinding$ClusterBindingConnectionSource.<init>(ClusterBinding.java:75)
    	at com.mongodb.binding.ClusterBinding$ClusterBindingConnectionSource.<init>(ClusterBinding.java:71)
    	at com.mongodb.binding.ClusterBinding.getWriteConnectionSource(ClusterBinding.java:68)
    	at com.mongodb.operation.OperationHelper.withConnection(OperationHelper.java:219)
    	at com.mongodb.operation.MixedBulkWriteOperation.execute(MixedBulkWriteOperation.java:168)
    	at com.mongodb.operation.MixedBulkWriteOperation.execute(MixedBulkWriteOperation.java:74)
    	at com.mongodb.Mongo.execute(Mongo.java:781)
    	at com.mongodb.Mongo$2.execute(Mongo.java:764)
    	at com.mongodb.MongoCollectionImpl.insertMany(MongoCollectionImpl.java:323)
    	at com.mongodb.MongoCollectionImpl.insertMany(MongoCollectionImpl.java:311)
    	at org.apache.beam.sdk.io.mongodb.MongoDbIO$Write$WriteFn.flush(MongoDbIO.java:667)
    	at org.apache.beam.sdk.io.mongodb.MongoDbIO$Write$WriteFn.processElement(MongoDbIO.java:652)
    com.mongodb.MongoTimeoutException: Timed out after 30000 ms while waiting for a server
that matches WritableServerSelector. Client view of cluster state is {type=UNKNOWN, servers=[{address=35.202.200.85:27017,
type=UNKNOWN, state=CONNECTING, exception={com.mongodb.MongoSocketOpenException: Exception
opening socket}, caused by {java.net.SocketTimeoutException: connect timed out}}]
    	at com.mongodb.connection.BaseCluster.createTimeoutException(BaseCluster.java:369)
    	at com.mongodb.connection.BaseCluster.selectServer(BaseCluster.java:101)
    	at com.mongodb.binding.ClusterBinding$ClusterBindingConnectionSource.<init>(ClusterBinding.java:75)
    	at com.mongodb.binding.ClusterBinding$ClusterBindingConnectionSource.<init>(ClusterBinding.java:71)
    	at com.mongodb.binding.ClusterBinding.getWriteConnectionSource(ClusterBinding.java:68)
    	at com.mongodb.operation.OperationHelper.withConnection(OperationHelper.java:219)
    	at com.mongodb.operation.MixedBulkWriteOperation.execute(MixedBulkWriteOperation.java:168)
    	at com.mongodb.operation.MixedBulkWriteOperation.execute(MixedBulkWriteOperation.java:74)
    	at com.mongodb.Mongo.execute(Mongo.java:781)
    	at com.mongodb.Mongo$2.execute(Mongo.java:764)
    	at com.mongodb.MongoCollectionImpl.insertMany(MongoCollectionImpl.java:323)
    	at com.mongodb.MongoCollectionImpl.insertMany(MongoCollectionImpl.java:311)
    	at org.apache.beam.sdk.io.mongodb.MongoDbIO$Write$WriteFn.flush(MongoDbIO.java:667)
    	at org.apache.beam.sdk.io.mongodb.MongoDbIO$Write$WriteFn.processElement(MongoDbIO.java:652)
    Workflow failed. Causes: S01:Generate sequence/Read(BoundedCountingSource)+Produce documents/Map+Write
documents to MongoDB/ParDo(Write) failed., A work item was attempted 4 times without success.
Each time the worker eventually lost contact with the service. The work item was attempted
on: 
      mongodbioit0testwriteandr-05022306-5b5d-harness-5f6t,
      mongodbioit0testwriteandr-05022306-5b5d-harness-5f6t,
      mongodbioit0testwriteandr-05022306-5b5d-harness-5f6t,
      mongodbioit0testwriteandr-05022306-5b5d-harness-5f6t
        at org.apache.beam.runners.dataflow.TestDataflowRunner.run(TestDataflowRunner.java:134)
        at org.apache.beam.runners.dataflow.TestDataflowRunner.run(TestDataflowRunner.java:90)
        at org.apache.beam.runners.dataflow.TestDataflowRunner.run(TestDataflowRunner.java:55)
        at org.apache.beam.sdk.Pipeline.run(Pipeline.java:311)
        at org.apache.beam.sdk.testing.TestPipeline.run(TestPipeline.java:346)
        at org.apache.beam.sdk.testing.TestPipeline.run(TestPipeline.java:328)
        at org.apache.beam.sdk.io.mongodb.MongoDBIOIT.testWriteAndRead(MongoDBIOIT.java:118)

1 test completed, 1 failed
Finished generating test XML results (0.046 secs) into: <https://builds.apache.org/job/beam_PerformanceTests_MongoDBIO_IT/ws/runs/ba322f69/beam/sdks/java/io/mongodb/build/test-results/integrationTest>
Generating HTML test report...
Finished generating test html results (0.039 secs) into: <https://builds.apache.org/job/beam_PerformanceTests_MongoDBIO_IT/ws/runs/ba322f69/beam/sdks/java/io/mongodb/build/reports/tests/integrationTest>
:beam-sdks-java-io-mongodb:integrationTest (Thread[Task worker for ':' Thread 9,5,main]) completed.
Took 8 mins 11.143 secs.

Deprecated Gradle features were used in this build, making it incompatible with Gradle 5.0.
See https://docs.gradle.org/4.7/userguide/command_line_interface.html#sec:command_line_warnings

BUILD FAILED in 9m 52s
55 actionable tasks: 42 executed, 13 up-to-date

Publishing build scan...
https://gradle.com/s/m5dimtl72dop2


STDERR: 
FAILURE: Build failed with an exception.

* What went wrong:
Execution failed for task ':beam-sdks-java-io-mongodb:integrationTest'.
> There were failing tests. See the report at: file://<https://builds.apache.org/job/beam_PerformanceTests_MongoDBIO_IT/ws/runs/ba322f69/beam/sdks/java/io/mongodb/build/reports/tests/integrationTest/index.html>

* Try:
Run with --debug option to get more log output. Run with --scan to get full insights.

* Exception is:
org.gradle.api.tasks.TaskExecutionException: Execution failed for task ':beam-sdks-java-io-mongodb:integrationTest'.
	at org.gradle.api.internal.tasks.execution.ExecuteActionsTaskExecuter.executeActions(ExecuteActionsTaskExecuter.java:103)
	at org.gradle.api.internal.tasks.execution.ExecuteActionsTaskExecuter.execute(ExecuteActionsTaskExecuter.java:73)
	at org.gradle.api.internal.tasks.execution.OutputDirectoryCreatingTaskExecuter.execute(OutputDirectoryCreatingTaskExecuter.java:51)
	at org.gradle.api.internal.tasks.execution.SkipCachedTaskExecuter.execute(SkipCachedTaskExecuter.java:105)
	at org.gradle.api.internal.tasks.execution.SkipUpToDateTaskExecuter.execute(SkipUpToDateTaskExecuter.java:59)
	at org.gradle.api.internal.tasks.execution.ResolveTaskOutputCachingStateExecuter.execute(ResolveTaskOutputCachingStateExecuter.java:54)
	at org.gradle.api.internal.tasks.execution.ResolveBuildCacheKeyExecuter.execute(ResolveBuildCacheKeyExecuter.java:66)
	at org.gradle.api.internal.tasks.execution.ValidatingTaskExecuter.execute(ValidatingTaskExecuter.java:59)
	at org.gradle.api.internal.tasks.execution.SkipEmptySourceFilesTaskExecuter.execute(SkipEmptySourceFilesTaskExecuter.java:101)
	at org.gradle.api.internal.tasks.execution.FinalizeInputFilePropertiesTaskExecuter.execute(FinalizeInputFilePropertiesTaskExecuter.java:44)
	at org.gradle.api.internal.tasks.execution.CleanupStaleOutputsExecuter.execute(CleanupStaleOutputsExecuter.java:91)
	at org.gradle.api.internal.tasks.execution.ResolveTaskArtifactStateTaskExecuter.execute(ResolveTaskArtifactStateTaskExecuter.java:62)
	at org.gradle.api.internal.tasks.execution.SkipTaskWithNoActionsExecuter.execute(SkipTaskWithNoActionsExecuter.java:59)
	at org.gradle.api.internal.tasks.execution.SkipOnlyIfTaskExecuter.execute(SkipOnlyIfTaskExecuter.java:54)
	at org.gradle.api.internal.tasks.execution.ExecuteAtMostOnceTaskExecuter.execute(ExecuteAtMostOnceTaskExecuter.java:43)
	at org.gradle.api.internal.tasks.execution.CatchExceptionTaskExecuter.execute(CatchExceptionTaskExecuter.java:34)
	at org.gradle.execution.taskgraph.DefaultTaskGraphExecuter$EventFiringTaskWorker$1.run(DefaultTaskGraphExecuter.java:256)
	at org.gradle.internal.operations.DefaultBuildOperationExecutor$RunnableBuildOperationWorker.execute(DefaultBuildOperationExecutor.java:317)
	at org.gradle.internal.operations.DefaultBuildOperationExecutor$RunnableBuildOperationWorker.execute(DefaultBuildOperationExecutor.java:309)
	at org.gradle.internal.operations.DefaultBuildOperationExecutor.execute(DefaultBuildOperationExecutor.java:185)
	at org.gradle.internal.operations.DefaultBuildOperationExecutor.run(DefaultBuildOperationExecutor.java:97)
	at org.gradle.internal.operations.DelegatingBuildOperationExecutor.run(DelegatingBuildOperationExecutor.java:31)
	at org.gradle.execution.taskgraph.DefaultTaskGraphExecuter$EventFiringTaskWorker.execute(DefaultTaskGraphExecuter.java:249)
	at org.gradle.execution.taskgraph.DefaultTaskGraphExecuter$EventFiringTaskWorker.execute(DefaultTaskGraphExecuter.java:238)
	at org.gradle.execution.taskgraph.DefaultTaskPlanExecutor$TaskExecutorWorker$1.execute(DefaultTaskPlanExecutor.java:104)
	at org.gradle.execution.taskgraph.DefaultTaskPlanExecutor$TaskExecutorWorker$1.execute(DefaultTaskPlanExecutor.java:98)
	at org.gradle.execution.taskgraph.DefaultTaskExecutionPlan.execute(DefaultTaskExecutionPlan.java:663)
	at org.gradle.execution.taskgraph.DefaultTaskExecutionPlan.executeWithTask(DefaultTaskExecutionPlan.java:596)
	at org.gradle.execution.taskgraph.DefaultTaskPlanExecutor$TaskExecutorWorker.run(DefaultTaskPlanExecutor.java:98)
	at org.gradle.internal.concurrent.ExecutorPolicy$CatchAndRecordFailures.onExecute(ExecutorPolicy.java:63)
	at org.gradle.internal.concurrent.ManagedExecutorImpl$1.run(ManagedExecutorImpl.java:46)
	at org.gradle.internal.concurrent.ThreadFactoryImpl$ManagedThreadRunnable.run(ThreadFactoryImpl.java:55)
Caused by: org.gradle.api.GradleException: There were failing tests. See the report at: file://<https://builds.apache.org/job/beam_PerformanceTests_MongoDBIO_IT/ws/runs/ba322f69/beam/sdks/java/io/mongodb/build/reports/tests/integrationTest/index.html>
	at org.gradle.api.tasks.testing.AbstractTestTask.handleTestFailures(AbstractTestTask.java:612)
	at org.gradle.api.tasks.testing.AbstractTestTask.executeTests(AbstractTestTask.java:484)
	at org.gradle.api.tasks.testing.Test.executeTests(Test.java:583)
	at org.gradle.internal.reflect.JavaMethod.invoke(JavaMethod.java:73)
	at org.gradle.api.internal.project.taskfactory.StandardTaskAction.doExecute(StandardTaskAction.java:46)
	at org.gradle.api.internal.project.taskfactory.StandardTaskAction.execute(StandardTaskAction.java:39)
	at org.gradle.api.internal.project.taskfactory.StandardTaskAction.execute(StandardTaskAction.java:26)
	at org.gradle.api.internal.AbstractTask$TaskActionWrapper.execute(AbstractTask.java:794)
	at org.gradle.api.internal.AbstractTask$TaskActionWrapper.execute(AbstractTask.java:761)
	at org.gradle.api.internal.tasks.execution.ExecuteActionsTaskExecuter$1.run(ExecuteActionsTaskExecuter.java:124)
	at org.gradle.internal.operations.DefaultBuildOperationExecutor$RunnableBuildOperationWorker.execute(DefaultBuildOperationExecutor.java:317)
	at org.gradle.internal.operations.DefaultBuildOperationExecutor$RunnableBuildOperationWorker.execute(DefaultBuildOperationExecutor.java:309)
	at org.gradle.internal.operations.DefaultBuildOperationExecutor.execute(DefaultBuildOperationExecutor.java:185)
	at org.gradle.internal.operations.DefaultBuildOperationExecutor.run(DefaultBuildOperationExecutor.java:97)
	at org.gradle.internal.operations.DelegatingBuildOperationExecutor.run(DelegatingBuildOperationExecutor.java:31)
	at org.gradle.api.internal.tasks.execution.ExecuteActionsTaskExecuter.executeAction(ExecuteActionsTaskExecuter.java:113)
	at org.gradle.api.internal.tasks.execution.ExecuteActionsTaskExecuter.executeActions(ExecuteActionsTaskExecuter.java:95)
	... 31 more


* Get more help at https://help.gradle.org

2018-05-03 06:14:58,214 ba322f69 MainThread beam_integration_benchmark(1/1) ERROR    Error
during benchmark beam_integration_benchmark
Traceback (most recent call last):
  File "<https://builds.apache.org/job/beam_PerformanceTests_MongoDBIO_IT/ws/PerfKitBenchmarker/perfkitbenchmarker/pkb.py",>
line 646, in RunBenchmark
    DoRunPhase(spec, collector, detailed_timer)
  File "<https://builds.apache.org/job/beam_PerformanceTests_MongoDBIO_IT/ws/PerfKitBenchmarker/perfkitbenchmarker/pkb.py",>
line 526, in DoRunPhase
    samples = spec.BenchmarkRun(spec)
  File "<https://builds.apache.org/job/beam_PerformanceTests_MongoDBIO_IT/ws/PerfKitBenchmarker/perfkitbenchmarker/linux_benchmarks/beam_integration_benchmark.py",>
line 159, in Run
    job_type=job_type)
  File "<https://builds.apache.org/job/beam_PerformanceTests_MongoDBIO_IT/ws/PerfKitBenchmarker/perfkitbenchmarker/providers/gcp/gcp_dpb_dataflow.py",>
line 90, in SubmitJob
    assert retcode == 0, "Integration Test Failed."
AssertionError: Integration Test Failed.
2018-05-03 06:14:58,215 ba322f69 MainThread beam_integration_benchmark(1/1) INFO     Cleaning
up benchmark beam_integration_benchmark
2018-05-03 06:14:58,216 ba322f69 MainThread beam_integration_benchmark(1/1) INFO     Running:
kubectl --kubeconfig=<https://builds.apache.org/job/beam_PerformanceTests_MongoDBIO_IT/ws/config-mongodbioit-1525323738309>
delete -f <https://builds.apache.org/job/beam_PerformanceTests_MongoDBIO_IT/ws/src/.test-infra/kubernetes/mongodb/load-balancer/mongo.yml>
--ignore-not-found
2018-05-03 06:14:58,924 ba322f69 MainThread beam_integration_benchmark(1/1) ERROR    Exception
running benchmark
Traceback (most recent call last):
  File "<https://builds.apache.org/job/beam_PerformanceTests_MongoDBIO_IT/ws/PerfKitBenchmarker/perfkitbenchmarker/pkb.py",>
line 780, in RunBenchmarkTask
    RunBenchmark(spec, collector)
  File "<https://builds.apache.org/job/beam_PerformanceTests_MongoDBIO_IT/ws/PerfKitBenchmarker/perfkitbenchmarker/pkb.py",>
line 646, in RunBenchmark
    DoRunPhase(spec, collector, detailed_timer)
  File "<https://builds.apache.org/job/beam_PerformanceTests_MongoDBIO_IT/ws/PerfKitBenchmarker/perfkitbenchmarker/pkb.py",>
line 526, in DoRunPhase
    samples = spec.BenchmarkRun(spec)
  File "<https://builds.apache.org/job/beam_PerformanceTests_MongoDBIO_IT/ws/PerfKitBenchmarker/perfkitbenchmarker/linux_benchmarks/beam_integration_benchmark.py",>
line 159, in Run
    job_type=job_type)
  File "<https://builds.apache.org/job/beam_PerformanceTests_MongoDBIO_IT/ws/PerfKitBenchmarker/perfkitbenchmarker/providers/gcp/gcp_dpb_dataflow.py",>
line 90, in SubmitJob
    assert retcode == 0, "Integration Test Failed."
AssertionError: Integration Test Failed.
2018-05-03 06:14:58,925 ba322f69 MainThread beam_integration_benchmark(1/1) ERROR    Benchmark
1/1 beam_integration_benchmark (UID: beam_integration_benchmark0) failed. Execution will continue.
2018-05-03 06:14:58,977 ba322f69 MainThread INFO     Benchmark run statuses:
---------------------------------------------------------------------------------
Name                        UID                          Status  Failed Substatus
---------------------------------------------------------------------------------
beam_integration_benchmark  beam_integration_benchmark0  FAILED                  
---------------------------------------------------------------------------------
Success rate: 0.00% (0/1)
2018-05-03 06:14:58,978 ba322f69 MainThread INFO     Complete logs can be found at: <https://builds.apache.org/job/beam_PerformanceTests_MongoDBIO_IT/ws/runs/ba322f69/pkb.log>
2018-05-03 06:14:58,978 ba322f69 MainThread INFO     Completion statuses can be found at:
<https://builds.apache.org/job/beam_PerformanceTests_MongoDBIO_IT/ws/runs/ba322f69/completion_statuses.json>
Build step 'Execute shell' marked build as failure

Mime
View raw message