beam-commits mailing list archives

Site index · List index
Message view « Date » · « Thread »
Top « Date » · « Thread »
From Apache Jenkins Server <jenk...@builds.apache.org>
Subject Build failed in Jenkins: beam_PerformanceTests_JDBC #558
Date Fri, 11 May 2018 06:07:48 GMT
See <https://builds.apache.org/job/beam_PerformanceTests_JDBC/558/display/redirect?page=changes>

Changes:

[kedin] [SQL] Wire up PubsubIO to SQL

[kedin] [SQL] Remove explicit timestamp parsing from PubsubIOJsonTable

[kedin] [SQL] Wrap Pubsub payload into a message schema

[mariagh] Call assert_that per window via reify_windows flag

[github] [BEAM-4268] Improving the separation between Metrics API and Execution

------------------------------------------
[...truncated 91.03 KB...]

> Task :beam-sdks-java-io-google-cloud-platform:compileTestJava UP-TO-DATE
Build cache key for task ':beam-sdks-java-io-google-cloud-platform:compileTestJava' is 3a416ca6db371e220b2fc22a97c1812d
Skipping task ':beam-sdks-java-io-google-cloud-platform:compileTestJava' as it is up-to-date.
:beam-sdks-java-io-google-cloud-platform:compileTestJava (Thread[Task worker for ':' Thread
8,5,main]) completed. Took 0.134 secs.
:beam-sdks-java-io-google-cloud-platform:testClasses (Thread[Task worker for ':' Thread 8,5,main])
started.

> Task :beam-sdks-java-io-google-cloud-platform:testClasses UP-TO-DATE
Skipping task ':beam-sdks-java-io-google-cloud-platform:testClasses' as it has no actions.
:beam-sdks-java-io-google-cloud-platform:testClasses (Thread[Task worker for ':' Thread 8,5,main])
completed. Took 0.0 secs.
:beam-runners-google-cloud-dataflow-java:classes (Thread[Task worker for ':' Thread 5,5,main])
completed. Took 0.0 secs.
:beam-sdks-java-io-google-cloud-platform:shadowTestJar (Thread[Task worker for ':' Thread
8,5,main]) started.
:beam-runners-google-cloud-dataflow-java:shadowJar (Thread[Task worker for ':' Thread 5,5,main])
started.

> Task :beam-runners-google-cloud-dataflow-java:shadowJar UP-TO-DATE
Build cache key for task ':beam-runners-google-cloud-dataflow-java:shadowJar' is e5fe40015dd15c316bd35f3bcc4d22fc
Caching disabled for task ':beam-runners-google-cloud-dataflow-java:shadowJar': Caching has
not been enabled for the task
Skipping task ':beam-runners-google-cloud-dataflow-java:shadowJar' as it is up-to-date.
:beam-runners-google-cloud-dataflow-java:shadowJar (Thread[Task worker for ':' Thread 5,5,main])
completed. Took 0.113 secs.

> Task :beam-sdks-java-io-google-cloud-platform:shadowTestJar UP-TO-DATE
Build cache key for task ':beam-sdks-java-io-google-cloud-platform:shadowTestJar' is eb52149b5fe1e03b876c0e9df7f5e029
Caching disabled for task ':beam-sdks-java-io-google-cloud-platform:shadowTestJar': Caching
has not been enabled for the task
Skipping task ':beam-sdks-java-io-google-cloud-platform:shadowTestJar' as it is up-to-date.
:beam-sdks-java-io-google-cloud-platform:shadowTestJar (Thread[Task worker for ':' Thread
8,5,main]) completed. Took 0.131 secs.
:beam-runners-google-cloud-dataflow-java:compileTestJava (Thread[Task worker for ':' Thread
8,5,main]) started.

> Task :beam-runners-google-cloud-dataflow-java:compileTestJava UP-TO-DATE
Build cache key for task ':beam-runners-google-cloud-dataflow-java:compileTestJava' is 7b9077318da339a011ea6b06634a9441
Skipping task ':beam-runners-google-cloud-dataflow-java:compileTestJava' as it is up-to-date.
:beam-runners-google-cloud-dataflow-java:compileTestJava (Thread[Task worker for ':' Thread
8,5,main]) completed. Took 0.118 secs.
:beam-runners-google-cloud-dataflow-java:testClasses (Thread[Task worker for ':' Thread 5,5,main])
started.

> Task :beam-runners-google-cloud-dataflow-java:testClasses UP-TO-DATE
Skipping task ':beam-runners-google-cloud-dataflow-java:testClasses' as it has no actions.
:beam-runners-google-cloud-dataflow-java:testClasses (Thread[Task worker for ':' Thread 5,5,main])
completed. Took 0.0 secs.
:beam-runners-google-cloud-dataflow-java:shadowTestJar (Thread[Task worker for ':' Thread
5,5,main]) started.

> Task :beam-runners-google-cloud-dataflow-java:shadowTestJar UP-TO-DATE
Build cache key for task ':beam-runners-google-cloud-dataflow-java:shadowTestJar' is e18ba0b753a37ffb30619e8e38350609
Caching disabled for task ':beam-runners-google-cloud-dataflow-java:shadowTestJar': Caching
has not been enabled for the task
Skipping task ':beam-runners-google-cloud-dataflow-java:shadowTestJar' as it is up-to-date.
:beam-runners-google-cloud-dataflow-java:shadowTestJar (Thread[Task worker for ':' Thread
5,5,main]) completed. Took 0.078 secs.
:beam-sdks-java-io-jdbc:compileTestJava (Thread[Task worker for ':' Thread 11,5,main]) started.

> Task :beam-sdks-java-io-jdbc:compileTestJava UP-TO-DATE
Build cache key for task ':beam-sdks-java-io-jdbc:compileTestJava' is 7b2a08deb3452fb11d4a0b777f98ef8a
Skipping task ':beam-sdks-java-io-jdbc:compileTestJava' as it is up-to-date.
:beam-sdks-java-io-jdbc:compileTestJava (Thread[Task worker for ':' Thread 11,5,main]) completed.
Took 0.084 secs.
:beam-sdks-java-io-jdbc:testClasses (Thread[Task worker for ':',5,main]) started.

> Task :beam-sdks-java-io-jdbc:testClasses UP-TO-DATE
Skipping task ':beam-sdks-java-io-jdbc:testClasses' as it has no actions.
:beam-sdks-java-io-jdbc:testClasses (Thread[Task worker for ':',5,main]) completed. Took 0.0
secs.
:beam-sdks-java-io-jdbc:integrationTest (Thread[Task worker for ':',5,main]) started.
Gradle Test Executor 1 started executing tests.

> Task :beam-sdks-java-io-jdbc:integrationTest
Build cache key for task ':beam-sdks-java-io-jdbc:integrationTest' is 2d4fb9063c862de1a51d67fa690a9c58
Task ':beam-sdks-java-io-jdbc:integrationTest' is not up-to-date because:
  No history is available.
Starting process 'Gradle Test Executor 1'. Working directory: <https://builds.apache.org/job/beam_PerformanceTests_JDBC/ws/runs/d8994aad/beam/sdks/java/io/jdbc>
Command: /usr/local/asfpackages/java/jdk1.8.0_152/bin/java -DbeamTestPipelineOptions=["--tempRoot=gs://temp-storage-for-perf-tests","--project=apache-beam-testing","--postgresPort=5432","--numberOfRecords=5000000","--postgresServerName=35.184.84.53","--postgresUsername=postgres","--postgresPassword=uuinkks","--postgresDatabaseName=postgres","--postgresSsl=False","--runner=TestDataflowRunner"]
-Djava.security.manager=worker.org.gradle.process.internal.worker.child.BootstrapSecurityManager
-Dorg.gradle.native=false -Dfile.encoding=UTF-8 -Duser.country=US -Duser.language=en -Duser.variant
-ea -cp /home/jenkins/.gradle/caches/4.7/workerMain/gradle-worker.jar worker.org.gradle.process.internal.worker.GradleWorkerMain
'Gradle Test Executor 1'
Successfully started process 'Gradle Test Executor 1'

org.apache.beam.sdk.io.jdbc.JdbcIOIT STANDARD_ERROR
    SLF4J: Class path contains multiple SLF4J bindings.
    SLF4J: Found binding in [jar:<https://builds.apache.org/job/beam_PerformanceTests_JDBC/ws/runs/d8994aad/beam/sdks/java/io/google-cloud-platform/build/libs/beam-sdks-java-io-google-cloud-platform-2.5.0-SNAPSHOT-shaded-tests.jar!/org/slf4j/impl/StaticLoggerBinder.class]>
    SLF4J: Found binding in [jar:file:/home/jenkins/.m2/repository/org/slf4j/slf4j-jdk14/1.7.25/slf4j-jdk14-1.7.25.jar!/org/slf4j/impl/StaticLoggerBinder.class]
    SLF4J: See http://www.slf4j.org/codes.html#multiple_bindings for an explanation.
    SLF4J: Actual binding is of type [org.slf4j.impl.JDK14LoggerFactory]

Gradle Test Executor 1 finished executing tests.

> Task :beam-sdks-java-io-jdbc:integrationTest

org.apache.beam.sdk.io.jdbc.JdbcIOIT > classMethod FAILED
    org.postgresql.util.PSQLException: The connection attempt failed.
        at org.postgresql.core.v3.ConnectionFactoryImpl.openConnectionImpl(ConnectionFactoryImpl.java:272)
        at org.postgresql.core.ConnectionFactory.openConnection(ConnectionFactory.java:51)
        at org.postgresql.jdbc.PgConnection.<init>(PgConnection.java:215)
        at org.postgresql.Driver.makeConnection(Driver.java:404)
        at org.postgresql.Driver.connect(Driver.java:272)
        at java.sql.DriverManager.getConnection(DriverManager.java:664)
        at java.sql.DriverManager.getConnection(DriverManager.java:247)
        at org.postgresql.ds.common.BaseDataSource.getConnection(BaseDataSource.java:86)
        at org.postgresql.ds.common.BaseDataSource.getConnection(BaseDataSource.java:71)
        at org.apache.beam.sdk.io.common.DatabaseTestHelper.createTable(DatabaseTestHelper.java:46)
        at org.apache.beam.sdk.io.jdbc.JdbcIOIT.setup(JdbcIOIT.java:85)

        Caused by:
        java.net.SocketTimeoutException: connect timed out
            at java.net.PlainSocketImpl.socketConnect(Native Method)
            at java.net.AbstractPlainSocketImpl.doConnect(AbstractPlainSocketImpl.java:350)
            at java.net.AbstractPlainSocketImpl.connectToAddress(AbstractPlainSocketImpl.java:206)
            at java.net.AbstractPlainSocketImpl.connect(AbstractPlainSocketImpl.java:188)
            at java.net.SocksSocketImpl.connect(SocksSocketImpl.java:392)
            at java.net.Socket.connect(Socket.java:589)
            at org.postgresql.core.PGStream.<init>(PGStream.java:61)
            at org.postgresql.core.v3.ConnectionFactoryImpl.openConnectionImpl(ConnectionFactoryImpl.java:144)
            ... 10 more

org.apache.beam.sdk.io.jdbc.JdbcIOIT > classMethod FAILED
    org.postgresql.util.PSQLException: The connection attempt failed.
        at org.postgresql.core.v3.ConnectionFactoryImpl.openConnectionImpl(ConnectionFactoryImpl.java:272)
        at org.postgresql.core.ConnectionFactory.openConnection(ConnectionFactory.java:51)
        at org.postgresql.jdbc.PgConnection.<init>(PgConnection.java:215)
        at org.postgresql.Driver.makeConnection(Driver.java:404)
        at org.postgresql.Driver.connect(Driver.java:272)
        at java.sql.DriverManager.getConnection(DriverManager.java:664)
        at java.sql.DriverManager.getConnection(DriverManager.java:247)
        at org.postgresql.ds.common.BaseDataSource.getConnection(BaseDataSource.java:86)
        at org.postgresql.ds.common.BaseDataSource.getConnection(BaseDataSource.java:71)
        at org.apache.beam.sdk.io.common.DatabaseTestHelper.deleteTable(DatabaseTestHelper.java:57)
        at org.apache.beam.sdk.io.jdbc.JdbcIOIT.tearDown(JdbcIOIT.java:90)

        Caused by:
        java.net.SocketTimeoutException: connect timed out
            at java.net.PlainSocketImpl.socketConnect(Native Method)
            at java.net.AbstractPlainSocketImpl.doConnect(AbstractPlainSocketImpl.java:350)
            at java.net.AbstractPlainSocketImpl.connectToAddress(AbstractPlainSocketImpl.java:206)
            at java.net.AbstractPlainSocketImpl.connect(AbstractPlainSocketImpl.java:188)
            at java.net.SocksSocketImpl.connect(SocksSocketImpl.java:392)
            at java.net.Socket.connect(Socket.java:589)
            at org.postgresql.core.PGStream.<init>(PGStream.java:61)
            at org.postgresql.core.v3.ConnectionFactoryImpl.openConnectionImpl(ConnectionFactoryImpl.java:144)
            ... 10 more

2 tests completed, 2 failed
Finished generating test XML results (0.017 secs) into: <https://builds.apache.org/job/beam_PerformanceTests_JDBC/ws/runs/d8994aad/beam/sdks/java/io/jdbc/build/test-results/integrationTest>
Generating HTML test report...
Finished generating test html results (0.031 secs) into: <https://builds.apache.org/job/beam_PerformanceTests_JDBC/ws/runs/d8994aad/beam/sdks/java/io/jdbc/build/reports/tests/integrationTest>

> Task :beam-sdks-java-io-jdbc:integrationTest FAILED
:beam-sdks-java-io-jdbc:integrationTest (Thread[Task worker for ':',5,main]) completed. Took
22.437 secs.

Deprecated Gradle features were used in this build, making it incompatible with Gradle 5.0.
See https://docs.gradle.org/4.7/userguide/command_line_interface.html#sec:command_line_warnings

BUILD FAILED in 36s
55 actionable tasks: 1 executed, 54 up-to-date

Publishing build scan...
https://gradle.com/s/l3imapxf2cd66


STDERR: 
FAILURE: Build failed with an exception.

* What went wrong:
Execution failed for task ':beam-sdks-java-io-jdbc:integrationTest'.
> There were failing tests. See the report at: file://<https://builds.apache.org/job/beam_PerformanceTests_JDBC/ws/runs/d8994aad/beam/sdks/java/io/jdbc/build/reports/tests/integrationTest/index.html>

* Try:
Run with --debug option to get more log output. Run with --scan to get full insights.

* Exception is:
org.gradle.api.tasks.TaskExecutionException: Execution failed for task ':beam-sdks-java-io-jdbc:integrationTest'.
	at org.gradle.api.internal.tasks.execution.ExecuteActionsTaskExecuter.executeActions(ExecuteActionsTaskExecuter.java:103)
	at org.gradle.api.internal.tasks.execution.ExecuteActionsTaskExecuter.execute(ExecuteActionsTaskExecuter.java:73)
	at org.gradle.api.internal.tasks.execution.OutputDirectoryCreatingTaskExecuter.execute(OutputDirectoryCreatingTaskExecuter.java:51)
	at org.gradle.api.internal.tasks.execution.SkipCachedTaskExecuter.execute(SkipCachedTaskExecuter.java:105)
	at org.gradle.api.internal.tasks.execution.SkipUpToDateTaskExecuter.execute(SkipUpToDateTaskExecuter.java:59)
	at org.gradle.api.internal.tasks.execution.ResolveTaskOutputCachingStateExecuter.execute(ResolveTaskOutputCachingStateExecuter.java:54)
	at org.gradle.api.internal.tasks.execution.ResolveBuildCacheKeyExecuter.execute(ResolveBuildCacheKeyExecuter.java:66)
	at org.gradle.api.internal.tasks.execution.ValidatingTaskExecuter.execute(ValidatingTaskExecuter.java:59)
	at org.gradle.api.internal.tasks.execution.SkipEmptySourceFilesTaskExecuter.execute(SkipEmptySourceFilesTaskExecuter.java:101)
	at org.gradle.api.internal.tasks.execution.FinalizeInputFilePropertiesTaskExecuter.execute(FinalizeInputFilePropertiesTaskExecuter.java:44)
	at org.gradle.api.internal.tasks.execution.CleanupStaleOutputsExecuter.execute(CleanupStaleOutputsExecuter.java:91)
	at org.gradle.api.internal.tasks.execution.ResolveTaskArtifactStateTaskExecuter.execute(ResolveTaskArtifactStateTaskExecuter.java:62)
	at org.gradle.api.internal.tasks.execution.SkipTaskWithNoActionsExecuter.execute(SkipTaskWithNoActionsExecuter.java:59)
	at org.gradle.api.internal.tasks.execution.SkipOnlyIfTaskExecuter.execute(SkipOnlyIfTaskExecuter.java:54)
	at org.gradle.api.internal.tasks.execution.ExecuteAtMostOnceTaskExecuter.execute(ExecuteAtMostOnceTaskExecuter.java:43)
	at org.gradle.api.internal.tasks.execution.CatchExceptionTaskExecuter.execute(CatchExceptionTaskExecuter.java:34)
	at org.gradle.execution.taskgraph.DefaultTaskGraphExecuter$EventFiringTaskWorker$1.run(DefaultTaskGraphExecuter.java:256)
	at org.gradle.internal.operations.DefaultBuildOperationExecutor$RunnableBuildOperationWorker.execute(DefaultBuildOperationExecutor.java:317)
	at org.gradle.internal.operations.DefaultBuildOperationExecutor$RunnableBuildOperationWorker.execute(DefaultBuildOperationExecutor.java:309)
	at org.gradle.internal.operations.DefaultBuildOperationExecutor.execute(DefaultBuildOperationExecutor.java:185)
	at org.gradle.internal.operations.DefaultBuildOperationExecutor.run(DefaultBuildOperationExecutor.java:97)
	at org.gradle.internal.operations.DelegatingBuildOperationExecutor.run(DelegatingBuildOperationExecutor.java:31)
	at org.gradle.execution.taskgraph.DefaultTaskGraphExecuter$EventFiringTaskWorker.execute(DefaultTaskGraphExecuter.java:249)
	at org.gradle.execution.taskgraph.DefaultTaskGraphExecuter$EventFiringTaskWorker.execute(DefaultTaskGraphExecuter.java:238)
	at org.gradle.execution.taskgraph.DefaultTaskPlanExecutor$TaskExecutorWorker$1.execute(DefaultTaskPlanExecutor.java:104)
	at org.gradle.execution.taskgraph.DefaultTaskPlanExecutor$TaskExecutorWorker$1.execute(DefaultTaskPlanExecutor.java:98)
	at org.gradle.execution.taskgraph.DefaultTaskExecutionPlan.execute(DefaultTaskExecutionPlan.java:663)
	at org.gradle.execution.taskgraph.DefaultTaskExecutionPlan.executeWithTask(DefaultTaskExecutionPlan.java:596)
	at org.gradle.execution.taskgraph.DefaultTaskPlanExecutor$TaskExecutorWorker.run(DefaultTaskPlanExecutor.java:98)
	at org.gradle.internal.concurrent.ExecutorPolicy$CatchAndRecordFailures.onExecute(ExecutorPolicy.java:63)
	at org.gradle.internal.concurrent.ManagedExecutorImpl$1.run(ManagedExecutorImpl.java:46)
	at org.gradle.internal.concurrent.ThreadFactoryImpl$ManagedThreadRunnable.run(ThreadFactoryImpl.java:55)
Caused by: org.gradle.api.GradleException: There were failing tests. See the report at: file://<https://builds.apache.org/job/beam_PerformanceTests_JDBC/ws/runs/d8994aad/beam/sdks/java/io/jdbc/build/reports/tests/integrationTest/index.html>
	at org.gradle.api.tasks.testing.AbstractTestTask.handleTestFailures(AbstractTestTask.java:612)
	at org.gradle.api.tasks.testing.AbstractTestTask.executeTests(AbstractTestTask.java:484)
	at org.gradle.api.tasks.testing.Test.executeTests(Test.java:583)
	at org.gradle.internal.reflect.JavaMethod.invoke(JavaMethod.java:73)
	at org.gradle.api.internal.project.taskfactory.StandardTaskAction.doExecute(StandardTaskAction.java:46)
	at org.gradle.api.internal.project.taskfactory.StandardTaskAction.execute(StandardTaskAction.java:39)
	at org.gradle.api.internal.project.taskfactory.StandardTaskAction.execute(StandardTaskAction.java:26)
	at org.gradle.api.internal.AbstractTask$TaskActionWrapper.execute(AbstractTask.java:794)
	at org.gradle.api.internal.AbstractTask$TaskActionWrapper.execute(AbstractTask.java:761)
	at org.gradle.api.internal.tasks.execution.ExecuteActionsTaskExecuter$1.run(ExecuteActionsTaskExecuter.java:124)
	at org.gradle.internal.operations.DefaultBuildOperationExecutor$RunnableBuildOperationWorker.execute(DefaultBuildOperationExecutor.java:317)
	at org.gradle.internal.operations.DefaultBuildOperationExecutor$RunnableBuildOperationWorker.execute(DefaultBuildOperationExecutor.java:309)
	at org.gradle.internal.operations.DefaultBuildOperationExecutor.execute(DefaultBuildOperationExecutor.java:185)
	at org.gradle.internal.operations.DefaultBuildOperationExecutor.run(DefaultBuildOperationExecutor.java:97)
	at org.gradle.internal.operations.DelegatingBuildOperationExecutor.run(DelegatingBuildOperationExecutor.java:31)
	at org.gradle.api.internal.tasks.execution.ExecuteActionsTaskExecuter.executeAction(ExecuteActionsTaskExecuter.java:113)
	at org.gradle.api.internal.tasks.execution.ExecuteActionsTaskExecuter.executeActions(ExecuteActionsTaskExecuter.java:95)
	... 31 more


* Get more help at https://help.gradle.org

2018-05-11 06:07:46,922 d8994aad MainThread beam_integration_benchmark(1/1) ERROR    Error
during benchmark beam_integration_benchmark
Traceback (most recent call last):
  File "<https://builds.apache.org/job/beam_PerformanceTests_JDBC/ws/PerfKitBenchmarker/perfkitbenchmarker/pkb.py",>
line 647, in RunBenchmark
    DoRunPhase(spec, collector, detailed_timer)
  File "<https://builds.apache.org/job/beam_PerformanceTests_JDBC/ws/PerfKitBenchmarker/perfkitbenchmarker/pkb.py",>
line 527, in DoRunPhase
    samples = spec.BenchmarkRun(spec)
  File "<https://builds.apache.org/job/beam_PerformanceTests_JDBC/ws/PerfKitBenchmarker/perfkitbenchmarker/linux_benchmarks/beam_integration_benchmark.py",>
line 159, in Run
    job_type=job_type)
  File "<https://builds.apache.org/job/beam_PerformanceTests_JDBC/ws/PerfKitBenchmarker/perfkitbenchmarker/providers/gcp/gcp_dpb_dataflow.py",>
line 90, in SubmitJob
    assert retcode == 0, "Integration Test Failed."
AssertionError: Integration Test Failed.
2018-05-11 06:07:46,923 d8994aad MainThread beam_integration_benchmark(1/1) INFO     Cleaning
up benchmark beam_integration_benchmark
2018-05-11 06:07:46,923 d8994aad MainThread beam_integration_benchmark(1/1) INFO     Running:
kubectl --kubeconfig=<https://builds.apache.org/job/beam_PerformanceTests_JDBC/ws/config-jdbcioit-1526014890740>
delete -f <https://builds.apache.org/job/beam_PerformanceTests_JDBC/ws/src/.test-infra/kubernetes/postgres/postgres-service-for-local-dev.yml>
--ignore-not-found
2018-05-11 06:07:47,344 d8994aad MainThread beam_integration_benchmark(1/1) ERROR    Exception
running benchmark
Traceback (most recent call last):
  File "<https://builds.apache.org/job/beam_PerformanceTests_JDBC/ws/PerfKitBenchmarker/perfkitbenchmarker/pkb.py",>
line 781, in RunBenchmarkTask
    RunBenchmark(spec, collector)
  File "<https://builds.apache.org/job/beam_PerformanceTests_JDBC/ws/PerfKitBenchmarker/perfkitbenchmarker/pkb.py",>
line 647, in RunBenchmark
    DoRunPhase(spec, collector, detailed_timer)
  File "<https://builds.apache.org/job/beam_PerformanceTests_JDBC/ws/PerfKitBenchmarker/perfkitbenchmarker/pkb.py",>
line 527, in DoRunPhase
    samples = spec.BenchmarkRun(spec)
  File "<https://builds.apache.org/job/beam_PerformanceTests_JDBC/ws/PerfKitBenchmarker/perfkitbenchmarker/linux_benchmarks/beam_integration_benchmark.py",>
line 159, in Run
    job_type=job_type)
  File "<https://builds.apache.org/job/beam_PerformanceTests_JDBC/ws/PerfKitBenchmarker/perfkitbenchmarker/providers/gcp/gcp_dpb_dataflow.py",>
line 90, in SubmitJob
    assert retcode == 0, "Integration Test Failed."
AssertionError: Integration Test Failed.
2018-05-11 06:07:47,345 d8994aad MainThread beam_integration_benchmark(1/1) ERROR    Benchmark
1/1 beam_integration_benchmark (UID: beam_integration_benchmark0) failed. Execution will continue.
2018-05-11 06:07:47,399 d8994aad MainThread INFO     Benchmark run statuses:
---------------------------------------------------------------------------------
Name                        UID                          Status  Failed Substatus
---------------------------------------------------------------------------------
beam_integration_benchmark  beam_integration_benchmark0  FAILED                  
---------------------------------------------------------------------------------
Success rate: 0.00% (0/1)
2018-05-11 06:07:47,400 d8994aad MainThread INFO     Complete logs can be found at: <https://builds.apache.org/job/beam_PerformanceTests_JDBC/ws/runs/d8994aad/pkb.log>
2018-05-11 06:07:47,400 d8994aad MainThread INFO     Completion statuses can be found at:
<https://builds.apache.org/job/beam_PerformanceTests_JDBC/ws/runs/d8994aad/completion_statuses.json>
Build step 'Execute shell' marked build as failure

Mime
View raw message