beam-commits mailing list archives

Site index · List index
Message view « Date » · « Thread »
Top « Date » · « Thread »
From Apache Jenkins Server <jenk...@builds.apache.org>
Subject Build failed in Jenkins: beam_PostCommit_Python_ValidatesContainer_Dataflow #138
Date Tue, 08 May 2018 22:23:50 GMT
See <https://builds.apache.org/job/beam_PostCommit_Python_ValidatesContainer_Dataflow/138/display/redirect>

------------------------------------------
GitHub pull request #5283 of commit 902b357bd9bc48de738c81b67463a0e275c4a7b2, no merge conflicts.
Setting status of 902b357bd9bc48de738c81b67463a0e275c4a7b2 to PENDING with url https://builds.apache.org/job/beam_PostCommit_Python_ValidatesContainer_Dataflow/138/
and message: 'Build started sha1 is merged.'
Using context: Jenkins: Google Cloud Dataflow Runner Python ValidatesContainer Tests
[EnvInject] - Loading node environment variables.
Building remotely on beam4 (beam) in workspace <https://builds.apache.org/job/beam_PostCommit_Python_ValidatesContainer_Dataflow/ws/>
 > git rev-parse --is-inside-work-tree # timeout=10
Fetching changes from the remote Git repository
 > git config remote.origin.url https://github.com/apache/beam.git # timeout=10
Fetching upstream changes from https://github.com/apache/beam.git
 > git --version # timeout=10
 > git fetch --tags --progress https://github.com/apache/beam.git +refs/heads/*:refs/remotes/origin/*
+refs/pull/5283/*:refs/remotes/origin/pr/5283/*
 > git rev-parse refs/remotes/origin/pr/5283/merge^{commit} # timeout=10
 > git rev-parse refs/remotes/origin/origin/pr/5283/merge^{commit} # timeout=10
Checking out Revision b47d54dc80952c109c51e73d20190a39377ddc2b (refs/remotes/origin/pr/5283/merge)
 > git config core.sparsecheckout # timeout=10
 > git checkout -f b47d54dc80952c109c51e73d20190a39377ddc2b
Commit message: "Merge 902b357bd9bc48de738c81b67463a0e275c4a7b2 into e7a3578abb919021be95c9c7148fd2d4fc6331fd"
First time build. Skipping changelog.
Cleaning workspace
 > git rev-parse --verify HEAD # timeout=10
Resetting working tree
 > git reset --hard # timeout=10
 > git clean -fdx # timeout=10
[EnvInject] - Executing scripts and injecting environment variables after the SCM step.
[EnvInject] - Injecting as environment variables the properties content 
SPARK_LOCAL_IP=127.0.0.1

[EnvInject] - Variables injected successfully.
[beam_PostCommit_Python_ValidatesContainer_Dataflow] $ /bin/bash -xe /tmp/jenkins330929832631580181.sh
+ cd src
+ bash sdks/python/container/run_validatescontainer.sh

# Where to store integration test outputs.
GCS_LOCATION=gs://temp-storage-for-end-to-end-tests

# Project for the container and integration test
PROJECT=apache-beam-testing

# Verify in the root of the repository
test -d sdks/python/container

# Verify docker and gcloud commands exist
command -v docker
/usr/bin/docker
command -v gcloud
/usr/bin/gcloud
docker -v
Docker version 17.05.0-ce, build 89658be
gcloud -v
Google Cloud SDK 191.0.0
alpha 2018.02.23
beta 2018.02.23
bq 2.0.29
core 2018.02.23
gsutil 4.28

# Create a tarball
./gradlew :beam-sdks-python:clean --info
Initialized native services in: /home/jenkins/.gradle/native
Using 16 worker leases.
Starting Build
Settings evaluated using settings file '<https://builds.apache.org/job/beam_PostCommit_Python_ValidatesContainer_Dataflow/ws/src/settings.gradle'.>
Using local directory build cache for the root build (location = /home/jenkins/.gradle/caches/build-cache-1,
removeUnusedEntriesAfter = 7 days).
Projects loaded. Root project using build file '<https://builds.apache.org/job/beam_PostCommit_Python_ValidatesContainer_Dataflow/ws/src/build.gradle'.>
Included projects: [root project 'beam', project ':beam-examples-java', project ':beam-local-artifact-service-java',
project ':beam-model-fn-execution', project ':beam-model-job-management', project ':beam-model-pipeline',
project ':beam-runners-apex', project ':beam-runners-core-construction-java', project ':beam-runners-core-java',
project ':beam-runners-direct-java', project ':beam-runners-extensions-java-metrics', project
':beam-runners-flink_2.11', project ':beam-runners-gcp-gcemd', project ':beam-runners-gcp-gcsproxy',
project ':beam-runners-gearpump', project ':beam-runners-google-cloud-dataflow-java', project
':beam-runners-java-fn-execution', project ':beam-runners-local-java-core', project ':beam-runners-reference-java',
project ':beam-runners-reference-job-server', project ':beam-runners-spark', project ':beam-sdks-go',
project ':beam-sdks-go-container', project ':beam-sdks-go-examples', project ':beam-sdks-java-build-tools',
project ':beam-sdks-java-container', project ':beam-sdks-java-core', project ':beam-sdks-java-extensions-google-cloud-platform-core',
project ':beam-sdks-java-extensions-join-library', project ':beam-sdks-java-extensions-json-jackson',
project ':beam-sdks-java-extensions-protobuf', project ':beam-sdks-java-extensions-sketching',
project ':beam-sdks-java-extensions-sorter', project ':beam-sdks-java-extensions-sql', project
':beam-sdks-java-fn-execution', project ':beam-sdks-java-harness', project ':beam-sdks-java-io-amazon-web-services',
project ':beam-sdks-java-io-amqp', project ':beam-sdks-java-io-cassandra', project ':beam-sdks-java-io-common',
project ':beam-sdks-java-io-elasticsearch', project ':beam-sdks-java-io-elasticsearch-tests-2',
project ':beam-sdks-java-io-elasticsearch-tests-5', project ':beam-sdks-java-io-elasticsearch-tests-common',
project ':beam-sdks-java-io-file-based-io-tests', project ':beam-sdks-java-io-google-cloud-platform',
project ':beam-sdks-java-io-hadoop-common', project ':beam-sdks-java-io-hadoop-file-system',
project ':beam-sdks-java-io-hadoop-input-format', project ':beam-sdks-java-io-hbase', project
':beam-sdks-java-io-hcatalog', project ':beam-sdks-java-io-jdbc', project ':beam-sdks-java-io-jms',
project ':beam-sdks-java-io-kafka', project ':beam-sdks-java-io-kinesis', project ':beam-sdks-java-io-mongodb',
project ':beam-sdks-java-io-mqtt', project ':beam-sdks-java-io-redis', project ':beam-sdks-java-io-solr',
project ':beam-sdks-java-io-tika', project ':beam-sdks-java-io-xml', project ':beam-sdks-java-javadoc',
project ':beam-sdks-java-maven-archetypes-examples', project ':beam-sdks-java-maven-archetypes-starter',
project ':beam-sdks-java-nexmark', project ':beam-sdks-python', project ':beam-sdks-python-container',
project ':release']
Parallel execution with configuration on demand is an incubating feature.

> Configure project :
Evaluating root project 'beam' using build file '<https://builds.apache.org/job/beam_PostCommit_Python_ValidatesContainer_Dataflow/ws/src/build.gradle'.>
Applying build_rules.gradle to beam
Offline dependencies root configured at 'offline-repository'
createPerformanceTestHarness with default configuration for project beam
Adding 47 .gitignore exclusions to Apache Rat

> Configure project :beam-sdks-python
Evaluating project ':beam-sdks-python' using build file '<https://builds.apache.org/job/beam_PostCommit_Python_ValidatesContainer_Dataflow/ws/src/sdks/python/build.gradle'.>
Selected primary task ':beam-sdks-python:clean' from project :beam-sdks-python
All projects evaluated.
Tasks to be executed: [task ':beam-sdks-python:setupVirtualenv', task ':beam-sdks-python:cleanPython',
task ':beam-sdks-python:clean']
VisTEG: Dependency graph written into <https://builds.apache.org/job/beam_PostCommit_Python_ValidatesContainer_Dataflow/ws/src/build/reports/visteg.dot>
:beam-sdks-python:setupVirtualenv (Thread[Task worker for ':' Thread 8,5,main]) started.

> Task :beam-sdks-python:setupVirtualenv
Build cache key for task ':beam-sdks-python:setupVirtualenv' is 31cae668966c5d8617e691a55f1cd828
Caching disabled for task ':beam-sdks-python:setupVirtualenv': Caching has not been enabled
for the task
Task ':beam-sdks-python:setupVirtualenv' is not up-to-date because:
  No history is available.
Starting process 'command 'sh''. Working directory: <https://builds.apache.org/job/beam_PostCommit_Python_ValidatesContainer_Dataflow/ws/src/sdks/python>
Command: sh setup_virtualenv.sh <https://builds.apache.org/job/beam_PostCommit_Python_ValidatesContainer_Dataflow/ws/src/sdks/python/build/gradleenv>
Successfully started process 'command 'sh''
+ envdir=<https://builds.apache.org/job/beam_PostCommit_Python_ValidatesContainer_Dataflow/ws/src/sdks/python/build/gradleenv>
+ virtualenv <https://builds.apache.org/job/beam_PostCommit_Python_ValidatesContainer_Dataflow/ws/src/sdks/python/build/gradleenv>
New python executable in <https://builds.apache.org/job/beam_PostCommit_Python_ValidatesContainer_Dataflow/ws/src/sdks/python/build/gradleenv/bin/python2>
Also creating executable in <https://builds.apache.org/job/beam_PostCommit_Python_ValidatesContainer_Dataflow/ws/src/sdks/python/build/gradleenv/bin/python>
Installing setuptools, pkg_resources, pip, wheel...done.
Running virtualenv with interpreter /usr/bin/python2
+ . <https://builds.apache.org/job/beam_PostCommit_Python_ValidatesContainer_Dataflow/ws/src/sdks/python/build/gradleenv/bin/activate>
+ deactivate nondestructive
+ unset -f pydoc
+ [ -z  ]
+ [ -z  ]
+ [ -n  ]
+ [ -n  ]
+ [ -z  ]
+ unset VIRTUAL_ENV
+ [ ! nondestructive = nondestructive ]
+ VIRTUAL_ENV=<https://builds.apache.org/job/beam_PostCommit_Python_ValidatesContainer_Dataflow/ws/src/sdks/python/build/gradleenv>
+ export VIRTUAL_ENV
+ _OLD_VIRTUAL_PATH=/home/jenkins/tools/java/latest1.8/bin:/usr/local/sbin:/usr/local/bin:/usr/sbin:/usr/bin:/sbin:/bin:/usr/games:/usr/local/games
+ PATH=<https://builds.apache.org/job/beam_PostCommit_Python_ValidatesContainer_Dataflow/ws/src/sdks/python/build/gradleenv/bin>:/home/jenkins/tools/java/latest1.8/bin:/usr/local/sbin:/usr/local/bin:/usr/sbin:/usr/bin:/sbin:/bin:/usr/games:/usr/local/games
+ export PATH
+ [ -z  ]
+ [ -z  ]
+ _OLD_VIRTUAL_PS1=$ 
+ [ x != x ]
+ basename <https://builds.apache.org/job/beam_PostCommit_Python_ValidatesContainer_Dataflow/ws/src/sdks/python/build/gradleenv>
+ PS1=(gradleenv) $ 
+ export PS1
+ alias pydoc
+ [ -n  ]
+ [ -n  ]
+ ls -l <https://builds.apache.org/job/beam_PostCommit_Python_ValidatesContainer_Dataflow/ws/src/sdks/python/build/gradleenv/bin>
total 3456
-rw-r--r-- 1 jenkins jenkins    2179 May  8 22:23 activate
-rw-r--r-- 1 jenkins jenkins    1121 May  8 22:23 activate.csh
-rw-r--r-- 1 jenkins jenkins    2319 May  8 22:23 activate.fish
-rw-r--r-- 1 jenkins jenkins    1137 May  8 22:23 activate_this.py
+ cat <https://builds.apache.org/job/beam_PostCommit_Python_ValidatesContainer_Dataflow/ws/src/sdks/python/build/gradleenv/bin/pip>
-rwxr-xr-x 1 jenkins jenkins     349 May  8 22:23 easy_install
-rwxr-xr-x 1 jenkins jenkins     349 May  8 22:23 easy_install-2.7
-rwxr-xr-x 1 jenkins jenkins     331 May  8 22:23 pip
-rwxr-xr-x 1 jenkins jenkins     331 May  8 22:23 pip2
-rwxr-xr-x 1 jenkins jenkins     331 May  8 22:23 pip2.7
lrwxrwxrwx 1 jenkins jenkins       7 May  8 22:23 python -> python2
-rwxr-xr-x 1 jenkins jenkins 3492656 May  8 22:23 python2
lrwxrwxrwx 1 jenkins jenkins       7 May  8 22:23 python2.7 -> python2
-rwxr-xr-x 1 jenkins jenkins    2438 May  8 22:23 python-config
-rwxr-xr-x 1 jenkins jenkins     328 May  8 22:23 wheel
#!<https://builds.apache.org/job/beam_PostCommit_Python_ValidatesContainer_Dataflow/ws/src/sdks/python/build/gradleenv/bin/python2>

# -*- coding: utf-8 -*-
+ <https://builds.apache.org/job/beam_PostCommit_Python_ValidatesContainer_Dataflow/ws/src/sdks/python/build/gradleenv/bin/pip>
-V
import re
import sys

from pip._internal import main

if __name__ == '__main__':
    sys.argv[0] = re.sub(r'(-script\.pyw|\.exe)?$', '', sys.argv[0])
    sys.exit(main())
setup_virtualenv.sh: 9: setup_virtualenv.sh: <https://builds.apache.org/job/beam_PostCommit_Python_ValidatesContainer_Dataflow/ws/src/sdks/python/build/gradleenv/bin/pip>:
Permission denied

> Task :beam-sdks-python:setupVirtualenv FAILED
:beam-sdks-python:setupVirtualenv (Thread[Task worker for ':' Thread 8,5,main]) completed.
Took 4.155 secs.

FAILURE: Build failed with an exception.

* Where:
Build file '<https://builds.apache.org/job/beam_PostCommit_Python_ValidatesContainer_Dataflow/ws/src/sdks/python/build.gradle'>
line: 33

* What went wrong:
Execution failed for task ':beam-sdks-python:setupVirtualenv'.
> Process 'command 'sh'' finished with non-zero exit value 126

* Try:
Run with --stacktrace option to get the stack trace. Run with --debug option to get more log
output. Run with --scan to get full insights.

* Get more help at https://help.gradle.org

BUILD FAILED in 9s
1 actionable task: 1 executed

Publishing build scan...
https://gradle.com/s/3d2vtrrprzcys

Build step 'Execute shell' marked build as failure
Not sending mail to unregistered user sidhom@google.com
Not sending mail to unregistered user axelmagn@gmail.com
Not sending mail to unregistered user swegner@google.com
Not sending mail to unregistered user apilloud@google.com
Not sending mail to unregistered user herohde@google.com
Not sending mail to unregistered user mariagh@mariagh.svl.corp.google.com
Not sending mail to unregistered user daniel.o.programmer@gmail.com
Not sending mail to unregistered user kirpichov@google.com
Not sending mail to unregistered user mairbek@google.com
Not sending mail to unregistered user pgerver@us.ibm.com
Not sending mail to unregistered user ankurgoenka@gmail.com
Not sending mail to unregistered user github@alasdairhodge.co.uk
Not sending mail to unregistered user aljoscha.krettek@gmail.com
Not sending mail to unregistered user jasonkuster@google.com

Mime
View raw message