beam-commits mailing list archives

Site index · List index
Message view « Date » · « Thread »
Top « Date » · « Thread »
From Apache Jenkins Server <jenk...@builds.apache.org>
Subject Build failed in Jenkins: beam_PerformanceTests_Compressed_TextIOIT_HDFS #184
Date Fri, 18 May 2018 12:15:40 GMT
See <https://builds.apache.org/job/beam_PerformanceTests_Compressed_TextIOIT_HDFS/184/display/redirect?page=changes>

Changes:

[timrobertson100] Fix error-prone warnings for io/hadoop-common

------------------------------------------
[...truncated 591.48 KB...]
    	at java.util.concurrent.FutureTask.run(FutureTask.java:266)
    	at java.util.concurrent.ThreadPoolExecutor.runWorker(ThreadPoolExecutor.java:1142)
    	at java.util.concurrent.ThreadPoolExecutor$Worker.run(ThreadPoolExecutor.java:617)
    	at java.lang.Thread.run(Thread.java:745)
    java.net.ConnectException: Call From textioit0writethenreadall-05180506-tdgd-harness-b4x5.c.apache-beam-testing.internal/10.128.0.41
to 214.175.197.104.bc.googleusercontent.com:9000 failed on connection exception: java.net.ConnectException:
Connection refused; For more details see:  http://wiki.apache.org/hadoop/ConnectionRefused
    	at sun.reflect.NativeConstructorAccessorImpl.newInstance0(Native Method)
    	at sun.reflect.NativeConstructorAccessorImpl.newInstance(NativeConstructorAccessorImpl.java:62)
    	at sun.reflect.DelegatingConstructorAccessorImpl.newInstance(DelegatingConstructorAccessorImpl.java:45)
    	at java.lang.reflect.Constructor.newInstance(Constructor.java:423)
    	at org.apache.hadoop.net.NetUtils.wrapWithMessage(NetUtils.java:792)
    	at org.apache.hadoop.net.NetUtils.wrapException(NetUtils.java:732)
    	at org.apache.hadoop.ipc.Client.call(Client.java:1479)
    	at org.apache.hadoop.ipc.Client.call(Client.java:1412)
    	at org.apache.hadoop.ipc.ProtobufRpcEngine$Invoker.invoke(ProtobufRpcEngine.java:229)
    	at com.sun.proxy.$Proxy65.create(Unknown Source)
    	at org.apache.hadoop.hdfs.protocolPB.ClientNamenodeProtocolTranslatorPB.create(ClientNamenodeProtocolTranslatorPB.java:296)
    	at sun.reflect.NativeMethodAccessorImpl.invoke0(Native Method)
    	at sun.reflect.NativeMethodAccessorImpl.invoke(NativeMethodAccessorImpl.java:62)
    	at sun.reflect.DelegatingMethodAccessorImpl.invoke(DelegatingMethodAccessorImpl.java:43)
    	at java.lang.reflect.Method.invoke(Method.java:498)
    	at org.apache.hadoop.io.retry.RetryInvocationHandler.invokeMethod(RetryInvocationHandler.java:191)
    	at org.apache.hadoop.io.retry.RetryInvocationHandler.invoke(RetryInvocationHandler.java:102)
    	at com.sun.proxy.$Proxy66.create(Unknown Source)
    	at org.apache.hadoop.hdfs.DFSOutputStream.newStreamForCreate(DFSOutputStream.java:1648)
    	at org.apache.hadoop.hdfs.DFSClient.create(DFSClient.java:1689)
    	at org.apache.hadoop.hdfs.DFSClient.create(DFSClient.java:1624)
    	at org.apache.hadoop.hdfs.DistributedFileSystem$7.doCall(DistributedFileSystem.java:448)
    	at org.apache.hadoop.hdfs.DistributedFileSystem$7.doCall(DistributedFileSystem.java:444)
    	at org.apache.hadoop.fs.FileSystemLinkResolver.resolve(FileSystemLinkResolver.java:81)
    	at org.apache.hadoop.hdfs.DistributedFileSystem.create(DistributedFileSystem.java:459)
    	at org.apache.hadoop.hdfs.DistributedFileSystem.create(DistributedFileSystem.java:387)
    	at org.apache.hadoop.fs.FileSystem.create(FileSystem.java:911)
    	at org.apache.hadoop.fs.FileSystem.create(FileSystem.java:892)
    	at org.apache.hadoop.fs.FileSystem.create(FileSystem.java:789)
    	at org.apache.hadoop.fs.FileSystem.create(FileSystem.java:778)
    	at org.apache.beam.sdk.io.hdfs.HadoopFileSystem.create(HadoopFileSystem.java:109)
    	at org.apache.beam.sdk.io.hdfs.HadoopFileSystem.create(HadoopFileSystem.java:68)
    	at org.apache.beam.sdk.io.FileSystems.create(FileSystems.java:249)
    	at org.apache.beam.sdk.io.FileSystems.create(FileSystems.java:236)
    	at org.apache.beam.sdk.io.FileBasedSink$Writer.open(FileBasedSink.java:924)
    	at org.apache.beam.sdk.io.WriteFiles$WriteUnshardedTempFilesWithSpillingFn.processElement(WriteFiles.java:503)
    Caused by: java.net.ConnectException: Connection refused
    	at sun.nio.ch.SocketChannelImpl.checkConnect(Native Method)
    	at sun.nio.ch.SocketChannelImpl.finishConnect(SocketChannelImpl.java:717)
    	at org.apache.hadoop.net.SocketIOWithTimeout.connect(SocketIOWithTimeout.java:206)
    	at org.apache.hadoop.net.NetUtils.connect(NetUtils.java:531)
    	at org.apache.hadoop.net.NetUtils.connect(NetUtils.java:495)
    	at org.apache.hadoop.ipc.Client$Connection.setupConnection(Client.java:614)
    	at org.apache.hadoop.ipc.Client$Connection.setupIOstreams(Client.java:712)
    	at org.apache.hadoop.ipc.Client$Connection.access$2900(Client.java:375)
    	at org.apache.hadoop.ipc.Client.getConnection(Client.java:1528)
    	at org.apache.hadoop.ipc.Client.call(Client.java:1451)
    	at org.apache.hadoop.ipc.Client.call(Client.java:1412)
    	at org.apache.hadoop.ipc.ProtobufRpcEngine$Invoker.invoke(ProtobufRpcEngine.java:229)
    	at com.sun.proxy.$Proxy65.create(Unknown Source)
    	at org.apache.hadoop.hdfs.protocolPB.ClientNamenodeProtocolTranslatorPB.create(ClientNamenodeProtocolTranslatorPB.java:296)
    	at sun.reflect.NativeMethodAccessorImpl.invoke0(Native Method)
    	at sun.reflect.NativeMethodAccessorImpl.invoke(NativeMethodAccessorImpl.java:62)
    	at sun.reflect.DelegatingMethodAccessorImpl.invoke(DelegatingMethodAccessorImpl.java:43)
    	at java.lang.reflect.Method.invoke(Method.java:498)
    	at org.apache.hadoop.io.retry.RetryInvocationHandler.invokeMethod(RetryInvocationHandler.java:191)
    	at org.apache.hadoop.io.retry.RetryInvocationHandler.invoke(RetryInvocationHandler.java:102)
    	at com.sun.proxy.$Proxy66.create(Unknown Source)
    	at org.apache.hadoop.hdfs.DFSOutputStream.newStreamForCreate(DFSOutputStream.java:1648)
    	at org.apache.hadoop.hdfs.DFSClient.create(DFSClient.java:1689)
    	at org.apache.hadoop.hdfs.DFSClient.create(DFSClient.java:1624)
    	at org.apache.hadoop.hdfs.DistributedFileSystem$7.doCall(DistributedFileSystem.java:448)
    	at org.apache.hadoop.hdfs.DistributedFileSystem$7.doCall(DistributedFileSystem.java:444)
    	at org.apache.hadoop.fs.FileSystemLinkResolver.resolve(FileSystemLinkResolver.java:81)
    	at org.apache.hadoop.hdfs.DistributedFileSystem.create(DistributedFileSystem.java:459)
    	at org.apache.hadoop.hdfs.DistributedFileSystem.create(DistributedFileSystem.java:387)
    	at org.apache.hadoop.fs.FileSystem.create(FileSystem.java:911)
    	at org.apache.hadoop.fs.FileSystem.create(FileSystem.java:892)
    	at org.apache.hadoop.fs.FileSystem.create(FileSystem.java:789)
    	at org.apache.hadoop.fs.FileSystem.create(FileSystem.java:778)
    	at org.apache.beam.sdk.io.hdfs.HadoopFileSystem.create(HadoopFileSystem.java:109)
    	at org.apache.beam.sdk.io.hdfs.HadoopFileSystem.create(HadoopFileSystem.java:68)
    	at org.apache.beam.sdk.io.FileSystems.create(FileSystems.java:249)
    	at org.apache.beam.sdk.io.FileSystems.create(FileSystems.java:236)
    	at org.apache.beam.sdk.io.FileBasedSink$Writer.open(FileBasedSink.java:924)
    	at org.apache.beam.sdk.io.WriteFiles$WriteUnshardedTempFilesWithSpillingFn.processElement(WriteFiles.java:503)
    	at org.apache.beam.sdk.io.WriteFiles$WriteUnshardedTempFilesWithSpillingFn$DoFnInvoker.invokeProcessElement(Unknown
Source)
    	at org.apache.beam.runners.core.SimpleDoFnRunner.invokeProcessElement(SimpleDoFnRunner.java:177)
    	at org.apache.beam.runners.core.SimpleDoFnRunner.processElement(SimpleDoFnRunner.java:138)
    	at com.google.cloud.dataflow.worker.SimpleParDoFn.processElement(SimpleParDoFn.java:323)
    	at com.google.cloud.dataflow.worker.util.common.worker.ParDoOperation.process(ParDoOperation.java:43)
    	at com.google.cloud.dataflow.worker.util.common.worker.OutputReceiver.process(OutputReceiver.java:48)
    	at com.google.cloud.dataflow.worker.AssignWindowsParDoFnFactory$AssignWindowsParDoFn.processElement(AssignWindowsParDoFnFactory.java:118)
    	at com.google.cloud.dataflow.worker.util.common.worker.ParDoOperation.process(ParDoOperation.java:43)
    	at com.google.cloud.dataflow.worker.util.common.worker.OutputReceiver.process(OutputReceiver.java:48)
    	at com.google.cloud.dataflow.worker.SimpleParDoFn$1.output(SimpleParDoFn.java:271)
    	at org.apache.beam.runners.core.SimpleDoFnRunner.outputWindowedValue(SimpleDoFnRunner.java:211)
    	at org.apache.beam.runners.core.SimpleDoFnRunner.access$700(SimpleDoFnRunner.java:66)
    	at org.apache.beam.runners.core.SimpleDoFnRunner$DoFnProcessContext.output(SimpleDoFnRunner.java:436)
    	at org.apache.beam.runners.core.SimpleDoFnRunner$DoFnProcessContext.output(SimpleDoFnRunner.java:424)
    	at org.apache.beam.sdk.io.common.FileBasedIOITHelper$DeterministicallyConstructTestTextLineFn.processElement(FileBasedIOITHelper.java:77)
    	at org.apache.beam.sdk.io.common.FileBasedIOITHelper$DeterministicallyConstructTestTextLineFn$DoFnInvoker.invokeProcessElement(Unknown
Source)
    	at org.apache.beam.runners.core.SimpleDoFnRunner.invokeProcessElement(SimpleDoFnRunner.java:177)
    	at org.apache.beam.runners.core.SimpleDoFnRunner.processElement(SimpleDoFnRunner.java:141)
    	at com.google.cloud.dataflow.worker.SimpleParDoFn.processElement(SimpleParDoFn.java:323)
    	at com.google.cloud.dataflow.worker.util.common.worker.ParDoOperation.process(ParDoOperation.java:43)
    	at com.google.cloud.dataflow.worker.util.common.worker.OutputReceiver.process(OutputReceiver.java:48)
    	at com.google.cloud.dataflow.worker.util.common.worker.ReadOperation.runReadLoop(ReadOperation.java:200)
    	at com.google.cloud.dataflow.worker.util.common.worker.ReadOperation.start(ReadOperation.java:158)
    	at com.google.cloud.dataflow.worker.util.common.worker.MapTaskExecutor.execute(MapTaskExecutor.java:75)
    	at com.google.cloud.dataflow.worker.BatchDataflowWorker.executeWork(BatchDataflowWorker.java:383)
    	at com.google.cloud.dataflow.worker.BatchDataflowWorker.doWork(BatchDataflowWorker.java:355)
    	at com.google.cloud.dataflow.worker.BatchDataflowWorker.getAndPerformWork(BatchDataflowWorker.java:286)
    	at com.google.cloud.dataflow.worker.DataflowBatchWorkerHarness$WorkerThread.doWork(DataflowBatchWorkerHarness.java:134)
    	at com.google.cloud.dataflow.worker.DataflowBatchWorkerHarness$WorkerThread.call(DataflowBatchWorkerHarness.java:114)
    	at com.google.cloud.dataflow.worker.DataflowBatchWorkerHarness$WorkerThread.call(DataflowBatchWorkerHarness.java:101)
    	at java.util.concurrent.FutureTask.run(FutureTask.java:266)
    	at java.util.concurrent.ThreadPoolExecutor.runWorker(ThreadPoolExecutor.java:1142)
    	at java.util.concurrent.ThreadPoolExecutor$Worker.run(ThreadPoolExecutor.java:617)
    	at java.lang.Thread.run(Thread.java:745)
    Workflow failed. Causes: S02:Generate sequence/Read(BoundedCountingSource)+Produce text
lines+Write content to files/WriteFiles/RewindowIntoGlobal/Window.Assign+Write content to
files/WriteFiles/WriteUnshardedBundlesToTempFiles/WriteUnshardedBundles+Write content to files/WriteFiles/GatherTempFileResults/View.AsList/ParDo(ToIsmRecordForGlobalWindow)+Write
content to files/WriteFiles/WriteUnshardedBundlesToTempFiles/GroupUnwritten/Reify+Write content
to files/WriteFiles/WriteUnshardedBundlesToTempFiles/GroupUnwritten/Write failed., A work
item was attempted 4 times without success. Each time the worker eventually lost contact with
the service. The work item was attempted on: 
      textioit0writethenreadall-05180506-tdgd-harness-b4x5,
      textioit0writethenreadall-05180506-tdgd-harness-4lqw,
      textioit0writethenreadall-05180506-tdgd-harness-q8zj,
      textioit0writethenreadall-05180506-tdgd-harness-b4x5
        at org.apache.beam.runners.dataflow.TestDataflowRunner.run(TestDataflowRunner.java:134)
        at org.apache.beam.runners.dataflow.TestDataflowRunner.run(TestDataflowRunner.java:90)
        at org.apache.beam.runners.dataflow.TestDataflowRunner.run(TestDataflowRunner.java:55)
        at org.apache.beam.sdk.Pipeline.run(Pipeline.java:311)
        at org.apache.beam.sdk.testing.TestPipeline.run(TestPipeline.java:348)
        at org.apache.beam.sdk.testing.TestPipeline.run(TestPipeline.java:329)
        at org.apache.beam.sdk.io.text.TextIOIT.writeThenReadAll(TextIOIT.java:114)

1 test completed, 1 failed
Finished generating test XML results (0.048 secs) into: <https://builds.apache.org/job/beam_PerformanceTests_Compressed_TextIOIT_HDFS/ws/src/sdks/java/io/file-based-io-tests/build/test-results/integrationTest>
Generating HTML test report...
Finished generating test html results (0.051 secs) into: <https://builds.apache.org/job/beam_PerformanceTests_Compressed_TextIOIT_HDFS/ws/src/sdks/java/io/file-based-io-tests/build/reports/tests/integrationTest>
:beam-sdks-java-io-file-based-io-tests:integrationTest (Thread[Task worker for ':' Thread
13,5,main]) completed. Took 9 mins 17.713 secs.

Deprecated Gradle features were used in this build, making it incompatible with Gradle 5.0.
See https://docs.gradle.org/4.7/userguide/command_line_interface.html#sec:command_line_warnings

BUILD FAILED in 12m 51s
67 actionable tasks: 36 executed, 9 from cache, 22 up-to-date

Publishing build scan...
https://gradle.com/s/eod6gpe5eumha


STDERR: 
FAILURE: Build failed with an exception.

* What went wrong:
Execution failed for task ':beam-sdks-java-io-file-based-io-tests:integrationTest'.
> There were failing tests. See the report at: file://<https://builds.apache.org/job/beam_PerformanceTests_Compressed_TextIOIT_HDFS/ws/src/sdks/java/io/file-based-io-tests/build/reports/tests/integrationTest/index.html>

* Try:
Run with --debug option to get more log output. Run with --scan to get full insights.

* Exception is:
org.gradle.api.tasks.TaskExecutionException: Execution failed for task ':beam-sdks-java-io-file-based-io-tests:integrationTest'.
	at org.gradle.api.internal.tasks.execution.ExecuteActionsTaskExecuter.executeActions(ExecuteActionsTaskExecuter.java:103)
	at org.gradle.api.internal.tasks.execution.ExecuteActionsTaskExecuter.execute(ExecuteActionsTaskExecuter.java:73)
	at org.gradle.api.internal.tasks.execution.OutputDirectoryCreatingTaskExecuter.execute(OutputDirectoryCreatingTaskExecuter.java:51)
	at org.gradle.api.internal.tasks.execution.SkipCachedTaskExecuter.execute(SkipCachedTaskExecuter.java:105)
	at org.gradle.api.internal.tasks.execution.SkipUpToDateTaskExecuter.execute(SkipUpToDateTaskExecuter.java:59)
	at org.gradle.api.internal.tasks.execution.ResolveTaskOutputCachingStateExecuter.execute(ResolveTaskOutputCachingStateExecuter.java:54)
	at org.gradle.api.internal.tasks.execution.ResolveBuildCacheKeyExecuter.execute(ResolveBuildCacheKeyExecuter.java:66)
	at org.gradle.api.internal.tasks.execution.ValidatingTaskExecuter.execute(ValidatingTaskExecuter.java:59)
	at org.gradle.api.internal.tasks.execution.SkipEmptySourceFilesTaskExecuter.execute(SkipEmptySourceFilesTaskExecuter.java:101)
	at org.gradle.api.internal.tasks.execution.FinalizeInputFilePropertiesTaskExecuter.execute(FinalizeInputFilePropertiesTaskExecuter.java:44)
	at org.gradle.api.internal.tasks.execution.CleanupStaleOutputsExecuter.execute(CleanupStaleOutputsExecuter.java:91)
	at org.gradle.api.internal.tasks.execution.ResolveTaskArtifactStateTaskExecuter.execute(ResolveTaskArtifactStateTaskExecuter.java:62)
	at org.gradle.api.internal.tasks.execution.SkipTaskWithNoActionsExecuter.execute(SkipTaskWithNoActionsExecuter.java:59)
	at org.gradle.api.internal.tasks.execution.SkipOnlyIfTaskExecuter.execute(SkipOnlyIfTaskExecuter.java:54)
	at org.gradle.api.internal.tasks.execution.ExecuteAtMostOnceTaskExecuter.execute(ExecuteAtMostOnceTaskExecuter.java:43)
	at org.gradle.api.internal.tasks.execution.CatchExceptionTaskExecuter.execute(CatchExceptionTaskExecuter.java:34)
	at org.gradle.execution.taskgraph.DefaultTaskGraphExecuter$EventFiringTaskWorker$1.run(DefaultTaskGraphExecuter.java:256)
	at org.gradle.internal.operations.DefaultBuildOperationExecutor$RunnableBuildOperationWorker.execute(DefaultBuildOperationExecutor.java:317)
	at org.gradle.internal.operations.DefaultBuildOperationExecutor$RunnableBuildOperationWorker.execute(DefaultBuildOperationExecutor.java:309)
	at org.gradle.internal.operations.DefaultBuildOperationExecutor.execute(DefaultBuildOperationExecutor.java:185)
	at org.gradle.internal.operations.DefaultBuildOperationExecutor.run(DefaultBuildOperationExecutor.java:97)
	at org.gradle.internal.operations.DelegatingBuildOperationExecutor.run(DelegatingBuildOperationExecutor.java:31)
	at org.gradle.execution.taskgraph.DefaultTaskGraphExecuter$EventFiringTaskWorker.execute(DefaultTaskGraphExecuter.java:249)
	at org.gradle.execution.taskgraph.DefaultTaskGraphExecuter$EventFiringTaskWorker.execute(DefaultTaskGraphExecuter.java:238)
	at org.gradle.execution.taskgraph.DefaultTaskPlanExecutor$TaskExecutorWorker$1.execute(DefaultTaskPlanExecutor.java:104)
	at org.gradle.execution.taskgraph.DefaultTaskPlanExecutor$TaskExecutorWorker$1.execute(DefaultTaskPlanExecutor.java:98)
	at org.gradle.execution.taskgraph.DefaultTaskExecutionPlan.execute(DefaultTaskExecutionPlan.java:663)
	at org.gradle.execution.taskgraph.DefaultTaskExecutionPlan.executeWithTask(DefaultTaskExecutionPlan.java:596)
	at org.gradle.execution.taskgraph.DefaultTaskPlanExecutor$TaskExecutorWorker.run(DefaultTaskPlanExecutor.java:98)
	at org.gradle.internal.concurrent.ExecutorPolicy$CatchAndRecordFailures.onExecute(ExecutorPolicy.java:63)
	at org.gradle.internal.concurrent.ManagedExecutorImpl$1.run(ManagedExecutorImpl.java:46)
	at org.gradle.internal.concurrent.ThreadFactoryImpl$ManagedThreadRunnable.run(ThreadFactoryImpl.java:55)
Caused by: org.gradle.api.GradleException: There were failing tests. See the report at: file://<https://builds.apache.org/job/beam_PerformanceTests_Compressed_TextIOIT_HDFS/ws/src/sdks/java/io/file-based-io-tests/build/reports/tests/integrationTest/index.html>
	at org.gradle.api.tasks.testing.AbstractTestTask.handleTestFailures(AbstractTestTask.java:612)
	at org.gradle.api.tasks.testing.AbstractTestTask.executeTests(AbstractTestTask.java:484)
	at org.gradle.api.tasks.testing.Test.executeTests(Test.java:583)
	at org.gradle.internal.reflect.JavaMethod.invoke(JavaMethod.java:73)
	at org.gradle.api.internal.project.taskfactory.StandardTaskAction.doExecute(StandardTaskAction.java:46)
	at org.gradle.api.internal.project.taskfactory.StandardTaskAction.execute(StandardTaskAction.java:39)
	at org.gradle.api.internal.project.taskfactory.StandardTaskAction.execute(StandardTaskAction.java:26)
	at org.gradle.api.internal.AbstractTask$TaskActionWrapper.execute(AbstractTask.java:794)
	at org.gradle.api.internal.AbstractTask$TaskActionWrapper.execute(AbstractTask.java:761)
	at org.gradle.api.internal.tasks.execution.ExecuteActionsTaskExecuter$1.run(ExecuteActionsTaskExecuter.java:124)
	at org.gradle.internal.operations.DefaultBuildOperationExecutor$RunnableBuildOperationWorker.execute(DefaultBuildOperationExecutor.java:317)
	at org.gradle.internal.operations.DefaultBuildOperationExecutor$RunnableBuildOperationWorker.execute(DefaultBuildOperationExecutor.java:309)
	at org.gradle.internal.operations.DefaultBuildOperationExecutor.execute(DefaultBuildOperationExecutor.java:185)
	at org.gradle.internal.operations.DefaultBuildOperationExecutor.run(DefaultBuildOperationExecutor.java:97)
	at org.gradle.internal.operations.DelegatingBuildOperationExecutor.run(DelegatingBuildOperationExecutor.java:31)
	at org.gradle.api.internal.tasks.execution.ExecuteActionsTaskExecuter.executeAction(ExecuteActionsTaskExecuter.java:113)
	at org.gradle.api.internal.tasks.execution.ExecuteActionsTaskExecuter.executeActions(ExecuteActionsTaskExecuter.java:95)
	... 31 more


* Get more help at https://help.gradle.org

2018-05-18 12:15:39,148 af9ba5e1 MainThread beam_integration_benchmark(1/1) ERROR    Error
during benchmark beam_integration_benchmark
Traceback (most recent call last):
  File "<https://builds.apache.org/job/beam_PerformanceTests_Compressed_TextIOIT_HDFS/ws/PerfKitBenchmarker/perfkitbenchmarker/pkb.py",>
line 660, in RunBenchmark
    DoRunPhase(spec, collector, detailed_timer)
  File "<https://builds.apache.org/job/beam_PerformanceTests_Compressed_TextIOIT_HDFS/ws/PerfKitBenchmarker/perfkitbenchmarker/pkb.py",>
line 540, in DoRunPhase
    samples = spec.BenchmarkRun(spec)
  File "<https://builds.apache.org/job/beam_PerformanceTests_Compressed_TextIOIT_HDFS/ws/PerfKitBenchmarker/perfkitbenchmarker/linux_benchmarks/beam_integration_benchmark.py",>
line 159, in Run
    job_type=job_type)
  File "<https://builds.apache.org/job/beam_PerformanceTests_Compressed_TextIOIT_HDFS/ws/PerfKitBenchmarker/perfkitbenchmarker/providers/gcp/gcp_dpb_dataflow.py",>
line 90, in SubmitJob
    assert retcode == 0, "Integration Test Failed."
AssertionError: Integration Test Failed.
2018-05-18 12:15:39,149 af9ba5e1 MainThread beam_integration_benchmark(1/1) INFO     Cleaning
up benchmark beam_integration_benchmark
2018-05-18 12:15:39,149 af9ba5e1 MainThread beam_integration_benchmark(1/1) INFO     Running:
kubectl --kubeconfig=<https://builds.apache.org/job/beam_PerformanceTests_Compressed_TextIOIT_HDFS/ws/config-filebasedioithdfs-1526637674653>
delete -f <https://builds.apache.org/job/beam_PerformanceTests_Compressed_TextIOIT_HDFS/ws/src/.test-infra/kubernetes/hadoop/SmallITCluster/hdfs-single-datanode-cluster.yml>
--ignore-not-found
2018-05-18 12:15:39,707 af9ba5e1 MainThread beam_integration_benchmark(1/1) INFO     Running:
kubectl --kubeconfig=<https://builds.apache.org/job/beam_PerformanceTests_Compressed_TextIOIT_HDFS/ws/config-filebasedioithdfs-1526637674653>
delete -f <https://builds.apache.org/job/beam_PerformanceTests_Compressed_TextIOIT_HDFS/ws/src/.test-infra/kubernetes/hadoop/SmallITCluster/hdfs-single-datanode-cluster-for-local-dev.yml>
--ignore-not-found
2018-05-18 12:15:39,876 af9ba5e1 MainThread beam_integration_benchmark(1/1) ERROR    Exception
running benchmark
Traceback (most recent call last):
  File "<https://builds.apache.org/job/beam_PerformanceTests_Compressed_TextIOIT_HDFS/ws/PerfKitBenchmarker/perfkitbenchmarker/pkb.py",>
line 794, in RunBenchmarkTask
    RunBenchmark(spec, collector)
  File "<https://builds.apache.org/job/beam_PerformanceTests_Compressed_TextIOIT_HDFS/ws/PerfKitBenchmarker/perfkitbenchmarker/pkb.py",>
line 660, in RunBenchmark
    DoRunPhase(spec, collector, detailed_timer)
  File "<https://builds.apache.org/job/beam_PerformanceTests_Compressed_TextIOIT_HDFS/ws/PerfKitBenchmarker/perfkitbenchmarker/pkb.py",>
line 540, in DoRunPhase
    samples = spec.BenchmarkRun(spec)
  File "<https://builds.apache.org/job/beam_PerformanceTests_Compressed_TextIOIT_HDFS/ws/PerfKitBenchmarker/perfkitbenchmarker/linux_benchmarks/beam_integration_benchmark.py",>
line 159, in Run
    job_type=job_type)
  File "<https://builds.apache.org/job/beam_PerformanceTests_Compressed_TextIOIT_HDFS/ws/PerfKitBenchmarker/perfkitbenchmarker/providers/gcp/gcp_dpb_dataflow.py",>
line 90, in SubmitJob
    assert retcode == 0, "Integration Test Failed."
AssertionError: Integration Test Failed.
2018-05-18 12:15:39,877 af9ba5e1 MainThread beam_integration_benchmark(1/1) ERROR    Benchmark
1/1 beam_integration_benchmark (UID: beam_integration_benchmark0) failed. Execution will continue.
2018-05-18 12:15:39,928 af9ba5e1 MainThread INFO     Benchmark run statuses:
---------------------------------------------------------------------------------
Name                        UID                          Status  Failed Substatus
---------------------------------------------------------------------------------
beam_integration_benchmark  beam_integration_benchmark0  FAILED                  
---------------------------------------------------------------------------------
Success rate: 0.00% (0/1)
2018-05-18 12:15:39,928 af9ba5e1 MainThread INFO     Complete logs can be found at: <https://builds.apache.org/job/beam_PerformanceTests_Compressed_TextIOIT_HDFS/ws/runs/af9ba5e1/pkb.log>
2018-05-18 12:15:39,929 af9ba5e1 MainThread INFO     Completion statuses can be found at:
<https://builds.apache.org/job/beam_PerformanceTests_Compressed_TextIOIT_HDFS/ws/runs/af9ba5e1/completion_statuses.json>
Build step 'Execute shell' marked build as failure

Mime
View raw message