beam-commits mailing list archives

Site index · List index
Message view « Date » · « Thread »
Top « Date » · « Thread »
From Apache Jenkins Server <jenk...@builds.apache.org>
Subject Build failed in Jenkins: beam_PerformanceTests_ParquetIOIT #13
Date Sun, 20 May 2018 00:07:13 GMT
See <https://builds.apache.org/job/beam_PerformanceTests_ParquetIOIT/13/display/redirect>

------------------------------------------
[...truncated 94.25 KB...]
Skipping task ':beam-runners-google-cloud-dataflow-java:shadowJar' as it is up-to-date.
:beam-runners-google-cloud-dataflow-java:shadowJar (Thread[Task worker for ':' Thread 10,5,main])
completed. Took 0.02 secs.

> Task :beam-sdks-java-core:compileTestJava UP-TO-DATE
Build cache key for task ':beam-sdks-java-core:compileTestJava' is 4d165b239b69735094cc0be2d07a5af1
Skipping task ':beam-sdks-java-core:compileTestJava' as it is up-to-date.
:beam-sdks-java-core:compileTestJava (Thread[main,5,main]) completed. Took 0.384 secs.
:beam-sdks-java-core:processTestResources (Thread[main,5,main]) started.

> Task :beam-sdks-java-core:processTestResources NO-SOURCE
file or directory '<https://builds.apache.org/job/beam_PerformanceTests_ParquetIOIT/ws/src/sdks/java/core/src/test/resources',>
not found
Skipping task ':beam-sdks-java-core:processTestResources' as it has no source files and no
previous output files.
:beam-sdks-java-core:processTestResources (Thread[main,5,main]) completed. Took 0.001 secs.
:beam-sdks-java-core:testClasses (Thread[main,5,main]) started.

> Task :beam-sdks-java-core:testClasses UP-TO-DATE
Skipping task ':beam-sdks-java-core:testClasses' as it has no actions.
:beam-sdks-java-core:testClasses (Thread[main,5,main]) completed. Took 0.0 secs.
:beam-sdks-java-core:shadowTestJar (Thread[main,5,main]) started.

> Task :beam-sdks-java-core:shadowTestJar UP-TO-DATE
Build cache key for task ':beam-sdks-java-core:shadowTestJar' is 06247b7ad76e14bc1c9dc4bb0d851e17
Caching disabled for task ':beam-sdks-java-core:shadowTestJar': Caching has not been enabled
for the task
Skipping task ':beam-sdks-java-core:shadowTestJar' as it is up-to-date.
:beam-sdks-java-core:shadowTestJar (Thread[main,5,main]) completed. Took 0.033 secs.
:beam-sdks-java-extensions-google-cloud-platform-core:compileTestJava (Thread[main,5,main])
started.
:beam-sdks-java-core:jar (Thread[Task worker for ':' Thread 14,5,main]) started.

> Task :beam-sdks-java-core:jar UP-TO-DATE
Build cache key for task ':beam-sdks-java-core:jar' is f7dc97ac61d3c1c92cdbed4139927679
Caching disabled for task ':beam-sdks-java-core:jar': Caching has not been enabled for the
task
Skipping task ':beam-sdks-java-core:jar' as it is up-to-date.
:beam-sdks-java-core:jar (Thread[Task worker for ':' Thread 14,5,main]) completed. Took 0.015
secs.

> Task :beam-sdks-java-extensions-google-cloud-platform-core:compileTestJava UP-TO-DATE
Build cache key for task ':beam-sdks-java-extensions-google-cloud-platform-core:compileTestJava'
is 2386200ca07cb498ad5cacee7ba0dd8d
Skipping task ':beam-sdks-java-extensions-google-cloud-platform-core:compileTestJava' as it
is up-to-date.
:beam-sdks-java-extensions-google-cloud-platform-core:compileTestJava (Thread[main,5,main])
completed. Took 0.043 secs.
:beam-sdks-java-extensions-google-cloud-platform-core:testClasses (Thread[main,5,main]) started.

> Task :beam-sdks-java-extensions-google-cloud-platform-core:testClasses UP-TO-DATE
Skipping task ':beam-sdks-java-extensions-google-cloud-platform-core:testClasses' as it has
no actions.
:beam-sdks-java-extensions-google-cloud-platform-core:testClasses (Thread[main,5,main]) completed.
Took 0.0 secs.
:beam-sdks-java-extensions-google-cloud-platform-core:shadowTestJar (Thread[main,5,main])
started.

> Task :beam-sdks-java-extensions-google-cloud-platform-core:shadowTestJar UP-TO-DATE
Build cache key for task ':beam-sdks-java-extensions-google-cloud-platform-core:shadowTestJar'
is 4e7455b01bd589ea13451d3f1973f18f
Caching disabled for task ':beam-sdks-java-extensions-google-cloud-platform-core:shadowTestJar':
Caching has not been enabled for the task
Skipping task ':beam-sdks-java-extensions-google-cloud-platform-core:shadowTestJar' as it
is up-to-date.
:beam-sdks-java-extensions-google-cloud-platform-core:shadowTestJar (Thread[main,5,main])
completed. Took 0.024 secs.
:beam-sdks-java-io-google-cloud-platform:compileTestJava (Thread[main,5,main]) started.

> Task :beam-sdks-java-io-google-cloud-platform:compileTestJava UP-TO-DATE
Build cache key for task ':beam-sdks-java-io-google-cloud-platform:compileTestJava' is 679f6cdb8157ea935980deb4a16b1550
Skipping task ':beam-sdks-java-io-google-cloud-platform:compileTestJava' as it is up-to-date.
:beam-sdks-java-io-google-cloud-platform:compileTestJava (Thread[main,5,main]) completed.
Took 0.063 secs.
:beam-sdks-java-io-google-cloud-platform:testClasses (Thread[main,5,main]) started.

> Task :beam-sdks-java-io-google-cloud-platform:testClasses UP-TO-DATE
Skipping task ':beam-sdks-java-io-google-cloud-platform:testClasses' as it has no actions.
:beam-sdks-java-io-google-cloud-platform:testClasses (Thread[main,5,main]) completed. Took
0.0 secs.
:beam-sdks-java-io-google-cloud-platform:shadowTestJar (Thread[main,5,main]) started.

> Task :beam-sdks-java-io-google-cloud-platform:shadowTestJar UP-TO-DATE
Build cache key for task ':beam-sdks-java-io-google-cloud-platform:shadowTestJar' is 67417c8d6142b7189591e9cc5bc059d4
Caching disabled for task ':beam-sdks-java-io-google-cloud-platform:shadowTestJar': Caching
has not been enabled for the task
Skipping task ':beam-sdks-java-io-google-cloud-platform:shadowTestJar' as it is up-to-date.
:beam-sdks-java-io-google-cloud-platform:shadowTestJar (Thread[main,5,main]) completed. Took
0.031 secs.
:beam-runners-google-cloud-dataflow-java:compileTestJava (Thread[main,5,main]) started.

> Task :beam-runners-google-cloud-dataflow-java:compileTestJava UP-TO-DATE
Build cache key for task ':beam-runners-google-cloud-dataflow-java:compileTestJava' is dddf3c900b4cc3c8ee10389e6413e3c2
Skipping task ':beam-runners-google-cloud-dataflow-java:compileTestJava' as it is up-to-date.
:beam-runners-google-cloud-dataflow-java:compileTestJava (Thread[main,5,main]) completed.
Took 0.057 secs.
:beam-runners-google-cloud-dataflow-java:testClasses (Thread[main,5,main]) started.

> Task :beam-runners-google-cloud-dataflow-java:testClasses UP-TO-DATE
Skipping task ':beam-runners-google-cloud-dataflow-java:testClasses' as it has no actions.
:beam-runners-google-cloud-dataflow-java:testClasses (Thread[main,5,main]) completed. Took
0.0 secs.
:beam-runners-google-cloud-dataflow-java:shadowTestJar (Thread[main,5,main]) started.

> Task :beam-runners-google-cloud-dataflow-java:shadowTestJar UP-TO-DATE
Build cache key for task ':beam-runners-google-cloud-dataflow-java:shadowTestJar' is 1afc7b64f78f00c06f172ee7ecc6bcda
Caching disabled for task ':beam-runners-google-cloud-dataflow-java:shadowTestJar': Caching
has not been enabled for the task
Skipping task ':beam-runners-google-cloud-dataflow-java:shadowTestJar' as it is up-to-date.
:beam-runners-google-cloud-dataflow-java:shadowTestJar (Thread[main,5,main]) completed. Took
0.034 secs.
:beam-sdks-java-io-file-based-io-tests:compileTestJava (Thread[main,5,main]) started.

> Task :beam-sdks-java-io-file-based-io-tests:compileTestJava UP-TO-DATE
Build cache key for task ':beam-sdks-java-io-file-based-io-tests:compileTestJava' is 4120ac99d17c7b52af36bc5726c20427
Skipping task ':beam-sdks-java-io-file-based-io-tests:compileTestJava' as it is up-to-date.
:beam-sdks-java-io-file-based-io-tests:compileTestJava (Thread[main,5,main]) completed. Took
0.06 secs.
:beam-sdks-java-io-file-based-io-tests:testClasses (Thread[Task worker for ':' Thread 6,5,main])
started.

> Task :beam-sdks-java-io-file-based-io-tests:testClasses UP-TO-DATE
Skipping task ':beam-sdks-java-io-file-based-io-tests:testClasses' as it has no actions.
:beam-sdks-java-io-file-based-io-tests:testClasses (Thread[Task worker for ':' Thread 6,5,main])
completed. Took 0.0 secs.
:beam-sdks-java-io-file-based-io-tests:integrationTest (Thread[Task worker for ':' Thread
6,5,main]) started.

> Task :beam-sdks-java-io-file-based-io-tests:integrationTest FAILED
Build cache key for task ':beam-sdks-java-io-file-based-io-tests:integrationTest' is 2d08bd1c471083f9c40f8922df69b0c6
Task ':beam-sdks-java-io-file-based-io-tests:integrationTest' is not up-to-date because:
  Task.upToDateWhen is false.
Not loading task ':beam-sdks-java-io-file-based-io-tests:integrationTest' from cache because
pulling from cache is disabled for this task
:beam-sdks-java-io-file-based-io-tests:integrationTest (Thread[Task worker for ':' Thread
6,5,main]) completed. Took 0.115 secs.

Deprecated Gradle features were used in this build, making it incompatible with Gradle 5.0.
See https://docs.gradle.org/4.7/userguide/command_line_interface.html#sec:command_line_warnings

BUILD FAILED in 15s
63 actionable tasks: 1 executed, 62 up-to-date

Publishing build scan...
https://gradle.com/s/x4cnsrlxand56


STDERR: 
FAILURE: Build failed with an exception.

* What went wrong:
Execution failed for task ':beam-sdks-java-io-file-based-io-tests:integrationTest'.
> No tests found for given includes: [**/*IT.class](include rules) [org.apache.beam.sdk.io.parquet.ParquetIOIT](--tests
filter)

* Try:
Run with --debug option to get more log output. Run with --scan to get full insights.

* Exception is:
org.gradle.api.tasks.TaskExecutionException: Execution failed for task ':beam-sdks-java-io-file-based-io-tests:integrationTest'.
	at org.gradle.api.internal.tasks.execution.ExecuteActionsTaskExecuter.executeActions(ExecuteActionsTaskExecuter.java:103)
	at org.gradle.api.internal.tasks.execution.ExecuteActionsTaskExecuter.execute(ExecuteActionsTaskExecuter.java:73)
	at org.gradle.api.internal.tasks.execution.OutputDirectoryCreatingTaskExecuter.execute(OutputDirectoryCreatingTaskExecuter.java:51)
	at org.gradle.api.internal.tasks.execution.SkipCachedTaskExecuter.execute(SkipCachedTaskExecuter.java:105)
	at org.gradle.api.internal.tasks.execution.SkipUpToDateTaskExecuter.execute(SkipUpToDateTaskExecuter.java:59)
	at org.gradle.api.internal.tasks.execution.ResolveTaskOutputCachingStateExecuter.execute(ResolveTaskOutputCachingStateExecuter.java:54)
	at org.gradle.api.internal.tasks.execution.ResolveBuildCacheKeyExecuter.execute(ResolveBuildCacheKeyExecuter.java:66)
	at org.gradle.api.internal.tasks.execution.ValidatingTaskExecuter.execute(ValidatingTaskExecuter.java:59)
	at org.gradle.api.internal.tasks.execution.SkipEmptySourceFilesTaskExecuter.execute(SkipEmptySourceFilesTaskExecuter.java:101)
	at org.gradle.api.internal.tasks.execution.FinalizeInputFilePropertiesTaskExecuter.execute(FinalizeInputFilePropertiesTaskExecuter.java:44)
	at org.gradle.api.internal.tasks.execution.CleanupStaleOutputsExecuter.execute(CleanupStaleOutputsExecuter.java:91)
	at org.gradle.api.internal.tasks.execution.ResolveTaskArtifactStateTaskExecuter.execute(ResolveTaskArtifactStateTaskExecuter.java:62)
	at org.gradle.api.internal.tasks.execution.SkipTaskWithNoActionsExecuter.execute(SkipTaskWithNoActionsExecuter.java:59)
	at org.gradle.api.internal.tasks.execution.SkipOnlyIfTaskExecuter.execute(SkipOnlyIfTaskExecuter.java:54)
	at org.gradle.api.internal.tasks.execution.ExecuteAtMostOnceTaskExecuter.execute(ExecuteAtMostOnceTaskExecuter.java:43)
	at org.gradle.api.internal.tasks.execution.CatchExceptionTaskExecuter.execute(CatchExceptionTaskExecuter.java:34)
	at org.gradle.execution.taskgraph.DefaultTaskGraphExecuter$EventFiringTaskWorker$1.run(DefaultTaskGraphExecuter.java:256)
	at org.gradle.internal.operations.DefaultBuildOperationExecutor$RunnableBuildOperationWorker.execute(DefaultBuildOperationExecutor.java:317)
	at org.gradle.internal.operations.DefaultBuildOperationExecutor$RunnableBuildOperationWorker.execute(DefaultBuildOperationExecutor.java:309)
	at org.gradle.internal.operations.DefaultBuildOperationExecutor.execute(DefaultBuildOperationExecutor.java:185)
	at org.gradle.internal.operations.DefaultBuildOperationExecutor.run(DefaultBuildOperationExecutor.java:97)
	at org.gradle.internal.operations.DelegatingBuildOperationExecutor.run(DelegatingBuildOperationExecutor.java:31)
	at org.gradle.execution.taskgraph.DefaultTaskGraphExecuter$EventFiringTaskWorker.execute(DefaultTaskGraphExecuter.java:249)
	at org.gradle.execution.taskgraph.DefaultTaskGraphExecuter$EventFiringTaskWorker.execute(DefaultTaskGraphExecuter.java:238)
	at org.gradle.execution.taskgraph.DefaultTaskPlanExecutor$TaskExecutorWorker$1.execute(DefaultTaskPlanExecutor.java:104)
	at org.gradle.execution.taskgraph.DefaultTaskPlanExecutor$TaskExecutorWorker$1.execute(DefaultTaskPlanExecutor.java:98)
	at org.gradle.execution.taskgraph.DefaultTaskExecutionPlan.execute(DefaultTaskExecutionPlan.java:663)
	at org.gradle.execution.taskgraph.DefaultTaskExecutionPlan.executeWithTask(DefaultTaskExecutionPlan.java:596)
	at org.gradle.execution.taskgraph.DefaultTaskPlanExecutor$TaskExecutorWorker.run(DefaultTaskPlanExecutor.java:98)
	at org.gradle.internal.concurrent.ExecutorPolicy$CatchAndRecordFailures.onExecute(ExecutorPolicy.java:63)
	at org.gradle.internal.concurrent.ManagedExecutorImpl$1.run(ManagedExecutorImpl.java:46)
	at org.gradle.internal.concurrent.ThreadFactoryImpl$ManagedThreadRunnable.run(ThreadFactoryImpl.java:55)
Caused by: org.gradle.api.tasks.testing.TestExecutionException: No tests found for given includes:
[**/*IT.class](include rules) [org.apache.beam.sdk.io.parquet.ParquetIOIT](--tests filter)
	at org.gradle.api.internal.tasks.testing.NoMatchingTestsReporter.afterSuite(NoMatchingTestsReporter.java:37)
	at org.gradle.internal.dispatch.ReflectionDispatch.dispatch(ReflectionDispatch.java:35)
	at org.gradle.internal.dispatch.ReflectionDispatch.dispatch(ReflectionDispatch.java:24)
	at org.gradle.internal.event.AbstractBroadcastDispatch.dispatch(AbstractBroadcastDispatch.java:42)
	at org.gradle.internal.event.BroadcastDispatch$SingletonDispatch.dispatch(BroadcastDispatch.java:230)
	at org.gradle.internal.event.BroadcastDispatch$SingletonDispatch.dispatch(BroadcastDispatch.java:149)
	at org.gradle.internal.event.AbstractBroadcastDispatch.dispatch(AbstractBroadcastDispatch.java:58)
	at org.gradle.internal.event.BroadcastDispatch$CompositeDispatch.dispatch(BroadcastDispatch.java:324)
	at org.gradle.internal.event.BroadcastDispatch$CompositeDispatch.dispatch(BroadcastDispatch.java:234)
	at org.gradle.internal.event.ListenerBroadcast.dispatch(ListenerBroadcast.java:140)
	at org.gradle.internal.event.ListenerBroadcast.dispatch(ListenerBroadcast.java:37)
	at org.gradle.internal.dispatch.ProxyDispatchAdapter$DispatchingInvocationHandler.invoke(ProxyDispatchAdapter.java:93)
	at com.sun.proxy.$Proxy71.afterSuite(Unknown Source)
	at org.gradle.api.internal.tasks.testing.results.TestListenerAdapter.completed(TestListenerAdapter.java:48)
	at org.gradle.internal.dispatch.ReflectionDispatch.dispatch(ReflectionDispatch.java:35)
	at org.gradle.internal.dispatch.ReflectionDispatch.dispatch(ReflectionDispatch.java:24)
	at org.gradle.internal.event.AbstractBroadcastDispatch.dispatch(AbstractBroadcastDispatch.java:42)
	at org.gradle.internal.event.BroadcastDispatch$SingletonDispatch.dispatch(BroadcastDispatch.java:230)
	at org.gradle.internal.event.BroadcastDispatch$SingletonDispatch.dispatch(BroadcastDispatch.java:149)
	at org.gradle.internal.event.AbstractBroadcastDispatch.dispatch(AbstractBroadcastDispatch.java:58)
	at org.gradle.internal.event.BroadcastDispatch$CompositeDispatch.dispatch(BroadcastDispatch.java:324)
	at org.gradle.internal.event.BroadcastDispatch$CompositeDispatch.dispatch(BroadcastDispatch.java:234)
	at org.gradle.internal.event.ListenerBroadcast.dispatch(ListenerBroadcast.java:140)
	at org.gradle.internal.event.ListenerBroadcast.dispatch(ListenerBroadcast.java:37)
	at org.gradle.internal.dispatch.ProxyDispatchAdapter$DispatchingInvocationHandler.invoke(ProxyDispatchAdapter.java:93)
	at com.sun.proxy.$Proxy73.completed(Unknown Source)
	at org.gradle.api.internal.tasks.testing.results.StateTrackingTestResultProcessor.completed(StateTrackingTestResultProcessor.java:96)
	at org.gradle.api.internal.tasks.testing.results.AttachParentTestResultProcessor.completed(AttachParentTestResultProcessor.java:56)
	at org.gradle.api.internal.tasks.testing.processors.TestMainAction.run(TestMainAction.java:60)
	at org.gradle.api.internal.tasks.testing.detection.DefaultTestExecuter.execute(DefaultTestExecuter.java:116)
	at org.gradle.api.internal.tasks.testing.detection.DefaultTestExecuter.execute(DefaultTestExecuter.java:51)
	at org.gradle.api.tasks.testing.AbstractTestTask.executeTests(AbstractTestTask.java:469)
	at org.gradle.api.tasks.testing.Test.executeTests(Test.java:583)
	at org.gradle.internal.reflect.JavaMethod.invoke(JavaMethod.java:73)
	at org.gradle.api.internal.project.taskfactory.StandardTaskAction.doExecute(StandardTaskAction.java:46)
	at org.gradle.api.internal.project.taskfactory.StandardTaskAction.execute(StandardTaskAction.java:39)
	at org.gradle.api.internal.project.taskfactory.StandardTaskAction.execute(StandardTaskAction.java:26)
	at org.gradle.api.internal.AbstractTask$TaskActionWrapper.execute(AbstractTask.java:794)
	at org.gradle.api.internal.AbstractTask$TaskActionWrapper.execute(AbstractTask.java:761)
	at org.gradle.api.internal.tasks.execution.ExecuteActionsTaskExecuter$1.run(ExecuteActionsTaskExecuter.java:124)
	at org.gradle.internal.operations.DefaultBuildOperationExecutor$RunnableBuildOperationWorker.execute(DefaultBuildOperationExecutor.java:317)
	at org.gradle.internal.operations.DefaultBuildOperationExecutor$RunnableBuildOperationWorker.execute(DefaultBuildOperationExecutor.java:309)
	at org.gradle.internal.operations.DefaultBuildOperationExecutor.execute(DefaultBuildOperationExecutor.java:185)
	at org.gradle.internal.operations.DefaultBuildOperationExecutor.run(DefaultBuildOperationExecutor.java:97)
	at org.gradle.internal.operations.DelegatingBuildOperationExecutor.run(DelegatingBuildOperationExecutor.java:31)
	at org.gradle.api.internal.tasks.execution.ExecuteActionsTaskExecuter.executeAction(ExecuteActionsTaskExecuter.java:113)
	at org.gradle.api.internal.tasks.execution.ExecuteActionsTaskExecuter.executeActions(ExecuteActionsTaskExecuter.java:95)
	... 31 more


* Get more help at https://help.gradle.org

2018-05-20 00:07:12,216 7fb95e6d MainThread beam_integration_benchmark(1/1) ERROR    Error
during benchmark beam_integration_benchmark
Traceback (most recent call last):
  File "<https://builds.apache.org/job/beam_PerformanceTests_ParquetIOIT/ws/PerfKitBenchmarker/perfkitbenchmarker/pkb.py",>
line 660, in RunBenchmark
    DoRunPhase(spec, collector, detailed_timer)
  File "<https://builds.apache.org/job/beam_PerformanceTests_ParquetIOIT/ws/PerfKitBenchmarker/perfkitbenchmarker/pkb.py",>
line 540, in DoRunPhase
    samples = spec.BenchmarkRun(spec)
  File "<https://builds.apache.org/job/beam_PerformanceTests_ParquetIOIT/ws/PerfKitBenchmarker/perfkitbenchmarker/linux_benchmarks/beam_integration_benchmark.py",>
line 159, in Run
    job_type=job_type)
  File "<https://builds.apache.org/job/beam_PerformanceTests_ParquetIOIT/ws/PerfKitBenchmarker/perfkitbenchmarker/providers/gcp/gcp_dpb_dataflow.py",>
line 90, in SubmitJob
    assert retcode == 0, "Integration Test Failed."
AssertionError: Integration Test Failed.
2018-05-20 00:07:12,217 7fb95e6d MainThread beam_integration_benchmark(1/1) INFO     Cleaning
up benchmark beam_integration_benchmark
2018-05-20 00:07:12,219 7fb95e6d MainThread beam_integration_benchmark(1/1) ERROR    Exception
running benchmark
Traceback (most recent call last):
  File "<https://builds.apache.org/job/beam_PerformanceTests_ParquetIOIT/ws/PerfKitBenchmarker/perfkitbenchmarker/pkb.py",>
line 794, in RunBenchmarkTask
    RunBenchmark(spec, collector)
  File "<https://builds.apache.org/job/beam_PerformanceTests_ParquetIOIT/ws/PerfKitBenchmarker/perfkitbenchmarker/pkb.py",>
line 660, in RunBenchmark
    DoRunPhase(spec, collector, detailed_timer)
  File "<https://builds.apache.org/job/beam_PerformanceTests_ParquetIOIT/ws/PerfKitBenchmarker/perfkitbenchmarker/pkb.py",>
line 540, in DoRunPhase
    samples = spec.BenchmarkRun(spec)
  File "<https://builds.apache.org/job/beam_PerformanceTests_ParquetIOIT/ws/PerfKitBenchmarker/perfkitbenchmarker/linux_benchmarks/beam_integration_benchmark.py",>
line 159, in Run
    job_type=job_type)
  File "<https://builds.apache.org/job/beam_PerformanceTests_ParquetIOIT/ws/PerfKitBenchmarker/perfkitbenchmarker/providers/gcp/gcp_dpb_dataflow.py",>
line 90, in SubmitJob
    assert retcode == 0, "Integration Test Failed."
AssertionError: Integration Test Failed.
2018-05-20 00:07:12,219 7fb95e6d MainThread beam_integration_benchmark(1/1) ERROR    Benchmark
1/1 beam_integration_benchmark (UID: beam_integration_benchmark0) failed. Execution will continue.
2018-05-20 00:07:12,229 7fb95e6d MainThread INFO     Benchmark run statuses:
---------------------------------------------------------------------------------
Name                        UID                          Status  Failed Substatus
---------------------------------------------------------------------------------
beam_integration_benchmark  beam_integration_benchmark0  FAILED                  
---------------------------------------------------------------------------------
Success rate: 0.00% (0/1)
2018-05-20 00:07:12,230 7fb95e6d MainThread INFO     Complete logs can be found at: <https://builds.apache.org/job/beam_PerformanceTests_ParquetIOIT/ws/runs/7fb95e6d/pkb.log>
2018-05-20 00:07:12,230 7fb95e6d MainThread INFO     Completion statuses can be found at:
<https://builds.apache.org/job/beam_PerformanceTests_ParquetIOIT/ws/runs/7fb95e6d/completion_statuses.json>
Build step 'Execute shell' marked build as failure

Mime
View raw message