beam-commits mailing list archives

Site index · List index
Message view « Date » · « Thread »
Top « Date » · « Thread »
From Apache Jenkins Server <jenk...@builds.apache.org>
Subject Build failed in Jenkins: beam_PostCommit_Java_GradleBuild #194
Date Thu, 26 Apr 2018 03:04:50 GMT
See <https://builds.apache.org/job/beam_PostCommit_Java_GradleBuild/194/display/redirect?page=changes>

Changes:

[tgroh] Add OutputDeduplicator

[tgroh] Update ExecutableStageMatcher to accept Matchers

[tgroh] Use OutputDeduplicator in GreedyPipelineFuser

[tgroh] fixup! Add OutputDeduplicator

------------------------------------------
[...truncated 18.03 MB...]
    INFO: Uploading /home/jenkins/.m2/repository/org/apache/httpcomponents/httpclient/4.0.1/httpclient-4.0.1.jar
to gs://temp-storage-for-end-to-end-tests/testpipeline-jenkins-0426025604-3c8f0099/output/results/staging/httpclient-4.0.1-nKmHdIYBAcBsqQEO_WIkoQ.jar
    Apr 26, 2018 2:56:06 AM org.apache.beam.runners.dataflow.util.PackageUtil tryStagePackage
    INFO: Uploading /home/jenkins/.m2/repository/com/google/protobuf/protobuf-java/3.2.0/protobuf-java-3.2.0.jar
to gs://temp-storage-for-end-to-end-tests/testpipeline-jenkins-0426025604-3c8f0099/output/results/staging/protobuf-java-3.2.0-fh30Gescj5k_IhxJOGxriw.jar
    Apr 26, 2018 2:56:06 AM org.apache.beam.runners.dataflow.util.PackageUtil tryStagePackage
    INFO: Uploading /home/jenkins/.m2/repository/org/tukaani/xz/1.5/xz-1.5.jar to gs://temp-storage-for-end-to-end-tests/testpipeline-jenkins-0426025604-3c8f0099/output/results/staging/xz-1.5-UQUOWVswjErsisMU9m4YvA.jar
    Apr 26, 2018 2:56:06 AM org.apache.beam.runners.dataflow.util.PackageUtil tryStagePackage
    INFO: Uploading /home/jenkins/.m2/repository/com/google/errorprone/error_prone_annotations/2.0.15/error_prone_annotations-2.0.15.jar
to gs://temp-storage-for-end-to-end-tests/testpipeline-jenkins-0426025604-3c8f0099/output/results/staging/error_prone_annotations-2.0.15-npnuyJrjs2dF75GdvUBIvQ.jar
    Apr 26, 2018 2:56:06 AM org.apache.beam.runners.dataflow.util.PackageUtil tryStagePackage
    INFO: Uploading /home/jenkins/.gradle/caches/modules-2/files-2.1/io.grpc/grpc-context/1.9.0/28b0836f48c9705abf73829bbc536dba29a1329a/grpc-context-1.9.0.jar
to gs://temp-storage-for-end-to-end-tests/testpipeline-jenkins-0426025604-3c8f0099/output/results/staging/grpc-context-1.9.0-atYmq4r_lax8i7-0BRHcCg.jar
    Apr 26, 2018 2:56:06 AM org.apache.beam.runners.dataflow.util.PackageUtil tryStagePackage
    INFO: Uploading /home/jenkins/.m2/repository/org/json/json/20160810/json-20160810.jar
to gs://temp-storage-for-end-to-end-tests/testpipeline-jenkins-0426025604-3c8f0099/output/results/staging/json-20160810-L3-Jnwdm5lAXdEpMT8FNRg.jar
    Apr 26, 2018 2:56:06 AM org.apache.beam.runners.dataflow.util.PackageUtil tryStagePackage
    INFO: Uploading /home/jenkins/.m2/repository/org/codehaus/jackson/jackson-mapper-asl/1.9.13/jackson-mapper-asl-1.9.13.jar
to gs://temp-storage-for-end-to-end-tests/testpipeline-jenkins-0426025604-3c8f0099/output/results/staging/jackson-mapper-asl-1.9.13-F1D5wzk1L8S3KNYbVxcWEw.jar
    Apr 26, 2018 2:56:06 AM org.apache.beam.runners.dataflow.util.PackageUtil tryStagePackage
    INFO: Uploading /home/jenkins/.m2/repository/org/mockito/mockito-core/1.9.5/mockito-core-1.9.5.jar
to gs://temp-storage-for-end-to-end-tests/testpipeline-jenkins-0426025604-3c8f0099/output/results/staging/mockito-core-1.9.5-b3PPBKVutgqqmWUG58EPxw.jar
    Apr 26, 2018 2:56:06 AM org.apache.beam.runners.dataflow.util.PackageUtil tryStagePackage
    INFO: Uploading /home/jenkins/.m2/repository/io/netty/netty-handler-proxy/4.1.8.Final/netty-handler-proxy-4.1.8.Final.jar
to gs://temp-storage-for-end-to-end-tests/testpipeline-jenkins-0426025604-3c8f0099/output/results/staging/netty-handler-proxy-4.1.8.Final-Zey48Fj4mlWtgpwIc7Osgg.jar
    Apr 26, 2018 2:56:06 AM org.apache.beam.runners.dataflow.util.PackageUtil tryStagePackage
    INFO: Uploading /home/jenkins/.m2/repository/io/netty/netty-codec-socks/4.1.8.Final/netty-codec-socks-4.1.8.Final.jar
to gs://temp-storage-for-end-to-end-tests/testpipeline-jenkins-0426025604-3c8f0099/output/results/staging/netty-codec-socks-4.1.8.Final-dfbCpCpgkEl1iwscd6OVeQ.jar
    Apr 26, 2018 2:56:06 AM org.apache.beam.runners.dataflow.util.PackageUtil tryStagePackage
    INFO: Uploading /home/jenkins/.m2/repository/io/netty/netty-codec/4.1.8.Final/netty-codec-4.1.8.Final.jar
to gs://temp-storage-for-end-to-end-tests/testpipeline-jenkins-0426025604-3c8f0099/output/results/staging/netty-codec-4.1.8.Final-Og5DJ4MB-fn1oSzjKqVU_w.jar
    Apr 26, 2018 2:56:06 AM org.apache.beam.runners.dataflow.util.PackageUtil tryStagePackage
    INFO: Uploading /home/jenkins/.m2/repository/org/apache/commons/commons-compress/1.16.1/commons-compress-1.16.1.jar
to gs://temp-storage-for-end-to-end-tests/testpipeline-jenkins-0426025604-3c8f0099/output/results/staging/commons-compress-1.16.1-NAljjWtr0jBC7qxc2X4lbA.jar
    Apr 26, 2018 2:56:06 AM org.apache.beam.runners.dataflow.util.PackageUtil tryStagePackage
    INFO: Uploading /home/jenkins/.m2/repository/org/xerial/snappy/snappy-java/1.1.4/snappy-java-1.1.4.jar
to gs://temp-storage-for-end-to-end-tests/testpipeline-jenkins-0426025604-3c8f0099/output/results/staging/snappy-java-1.1.4-SFNwbMuGq13aaoKVzeS1Tw.jar
    Apr 26, 2018 2:56:06 AM org.apache.beam.runners.dataflow.util.PackageUtil tryStagePackage
    INFO: Uploading /home/jenkins/.m2/repository/org/threeten/threetenbp/1.3.3/threetenbp-1.3.3.jar
to gs://temp-storage-for-end-to-end-tests/testpipeline-jenkins-0426025604-3c8f0099/output/results/staging/threetenbp-1.3.3-bEXFSgaAYiXSdUtR-98IjQ.jar
    Apr 26, 2018 2:56:06 AM org.apache.beam.runners.dataflow.util.PackageUtil tryStagePackage
    INFO: Uploading /home/jenkins/.m2/repository/io/netty/netty-transport/4.1.8.Final/netty-transport-4.1.8.Final.jar
to gs://temp-storage-for-end-to-end-tests/testpipeline-jenkins-0426025604-3c8f0099/output/results/staging/netty-transport-4.1.8.Final-PXWj5ZmqlznhCnqhkcOwDA.jar
    Apr 26, 2018 2:56:06 AM org.apache.beam.runners.dataflow.util.PackageUtil tryStagePackage
    INFO: Uploading /home/jenkins/.m2/repository/commons-codec/commons-codec/1.3/commons-codec-1.3.jar
to gs://temp-storage-for-end-to-end-tests/testpipeline-jenkins-0426025604-3c8f0099/output/results/staging/commons-codec-1.3-jhScEFN0HANzalLfg5dNzA.jar
    Apr 26, 2018 2:56:06 AM org.apache.beam.runners.dataflow.util.PackageUtil tryStagePackage
    INFO: Uploading /home/jenkins/.m2/repository/io/netty/netty-buffer/4.1.8.Final/netty-buffer-4.1.8.Final.jar
to gs://temp-storage-for-end-to-end-tests/testpipeline-jenkins-0426025604-3c8f0099/output/results/staging/netty-buffer-4.1.8.Final-iwny8IFMu0G1ln10Yx5VrA.jar
    Apr 26, 2018 2:56:06 AM org.apache.beam.runners.dataflow.util.PackageUtil tryStagePackage
    INFO: Uploading /home/jenkins/.m2/repository/io/netty/netty-codec-http/4.1.8.Final/netty-codec-http-4.1.8.Final.jar
to gs://temp-storage-for-end-to-end-tests/testpipeline-jenkins-0426025604-3c8f0099/output/results/staging/netty-codec-http-4.1.8.Final-uBsfxiZeL3IeVQNS0QTHUw.jar
    Apr 26, 2018 2:56:06 AM org.apache.beam.runners.dataflow.util.PackageUtil tryStagePackage
    INFO: Uploading /home/jenkins/.m2/repository/commons-logging/commons-logging/1.2/commons-logging-1.2.jar
to gs://temp-storage-for-end-to-end-tests/testpipeline-jenkins-0426025604-3c8f0099/output/results/staging/commons-logging-1.2-BAtLTY6siG9rSio70vMbAA.jar
    Apr 26, 2018 2:56:06 AM org.apache.beam.runners.dataflow.util.PackageUtil tryStagePackage
    INFO: Uploading /home/jenkins/.m2/repository/org/objenesis/objenesis/2.6/objenesis-2.6.jar
to gs://temp-storage-for-end-to-end-tests/testpipeline-jenkins-0426025604-3c8f0099/output/results/staging/objenesis-2.6-X_rD9RQFypspFZcKIks-jw.jar
    Apr 26, 2018 2:56:06 AM org.apache.beam.runners.dataflow.util.PackageUtil tryStagePackage
    INFO: Uploading /home/jenkins/.m2/repository/com/google/protobuf/nano/protobuf-javanano/3.0.0-alpha-5/protobuf-javanano-3.0.0-alpha-5.jar
to gs://temp-storage-for-end-to-end-tests/testpipeline-jenkins-0426025604-3c8f0099/output/results/staging/protobuf-javanano-3.0.0-alpha-5-SsS7fZe7brffHbAGUgRrnw.jar
    Apr 26, 2018 2:56:06 AM org.apache.beam.runners.dataflow.util.PackageUtil tryStagePackage
    INFO: Uploading /home/jenkins/.m2/repository/io/netty/netty-resolver/4.1.8.Final/netty-resolver-4.1.8.Final.jar
to gs://temp-storage-for-end-to-end-tests/testpipeline-jenkins-0426025604-3c8f0099/output/results/staging/netty-resolver-4.1.8.Final-ZBELwscrxRZgRR5DKH9siA.jar
    Apr 26, 2018 2:56:06 AM org.apache.beam.runners.dataflow.util.PackageUtil tryStagePackage
    INFO: Uploading /home/jenkins/.gradle/caches/modules-2/files-2.1/com.esotericsoftware.reflectasm/reflectasm/1.07/76f11c94a53ee975a0d9154b325c408b210155bd/reflectasm-1.07-shaded.jar
to gs://temp-storage-for-end-to-end-tests/testpipeline-jenkins-0426025604-3c8f0099/output/results/staging/reflectasm-1.07-shaded-IELCIoQPsh49E873w5ZYMQ.jar
    Apr 26, 2018 2:56:06 AM org.apache.beam.runners.dataflow.util.PackageUtil tryStagePackage
    INFO: Uploading /home/jenkins/.m2/repository/com/google/code/gson/gson/2.7/gson-2.7.jar
to gs://temp-storage-for-end-to-end-tests/testpipeline-jenkins-0426025604-3c8f0099/output/results/staging/gson-2.7-UTSiNQ9YiQ_7nbC0AEcZXQ.jar
    Apr 26, 2018 2:56:06 AM org.apache.beam.runners.dataflow.util.PackageUtil tryStagePackage
    INFO: Uploading /home/jenkins/.m2/repository/org/apache/httpcomponents/httpcore/4.0.1/httpcore-4.0.1.jar
to gs://temp-storage-for-end-to-end-tests/testpipeline-jenkins-0426025604-3c8f0099/output/results/staging/httpcore-4.0.1-bBlj_YrAxAwATJ6JLg13Aw.jar
    Apr 26, 2018 2:56:06 AM org.apache.beam.runners.dataflow.util.PackageUtil tryStagePackage
    INFO: Uploading /home/jenkins/.m2/repository/com/esotericsoftware/minlog/minlog/1.2/minlog-1.2.jar
to gs://temp-storage-for-end-to-end-tests/testpipeline-jenkins-0426025604-3c8f0099/output/results/staging/minlog-1.2-98-99jtn3wu_pMfLJgiFvA.jar
    Apr 26, 2018 2:56:06 AM org.apache.beam.runners.dataflow.util.PackageUtil tryStagePackage
    INFO: Uploading /home/jenkins/.m2/repository/com/squareup/okio/okio/1.6.0/okio-1.6.0.jar
to gs://temp-storage-for-end-to-end-tests/testpipeline-jenkins-0426025604-3c8f0099/output/results/staging/okio-1.6.0-Fk0cKMMjz24qkX1gN0xXGA.jar
    Apr 26, 2018 2:56:06 AM org.apache.beam.runners.dataflow.util.PackageUtil tryStagePackage
    INFO: Uploading /home/jenkins/.m2/repository/org/yaml/snakeyaml/1.17/snakeyaml-1.17.jar
to gs://temp-storage-for-end-to-end-tests/testpipeline-jenkins-0426025604-3c8f0099/output/results/staging/snakeyaml-1.17-q2IcPO4xYjatBKbw_k3RfA.jar
    Apr 26, 2018 2:56:06 AM org.apache.beam.runners.dataflow.util.PackageUtil tryStagePackage
    INFO: Uploading /home/jenkins/.m2/repository/io/grpc/grpc-protobuf-nano/1.2.0/grpc-protobuf-nano-1.2.0.jar
to gs://temp-storage-for-end-to-end-tests/testpipeline-jenkins-0426025604-3c8f0099/output/results/staging/grpc-protobuf-nano-1.2.0-_Q87bBdV6P9enz9PnkbLQg.jar
    Apr 26, 2018 2:56:06 AM org.apache.beam.runners.dataflow.util.PackageUtil tryStagePackage
    INFO: Uploading <https://builds.apache.org/job/beam_PostCommit_Java_GradleBuild/ws/src/sdks/java/io/google-cloud-platform/build/libs/beam-sdks-java-io-google-cloud-platform-2.5.0-SNAPSHOT-shaded.jar>
to gs://temp-storage-for-end-to-end-tests/testpipeline-jenkins-0426025604-3c8f0099/output/results/staging/beam-sdks-java-io-google-cloud-platform-2.5.0-SNAPSHOT-shaded-jkQKGqo0UDlb1e2qtz2QqQ.jar
    Apr 26, 2018 2:56:06 AM org.apache.beam.runners.dataflow.util.PackageUtil tryStagePackage
    INFO: Uploading /home/jenkins/.m2/repository/io/netty/netty-common/4.1.8.Final/netty-common-4.1.8.Final.jar
to gs://temp-storage-for-end-to-end-tests/testpipeline-jenkins-0426025604-3c8f0099/output/results/staging/netty-common-4.1.8.Final-lafOW8vGsI6SRwZSmXNClg.jar
    Apr 26, 2018 2:56:06 AM org.apache.beam.runners.dataflow.util.PackageUtil tryStagePackage
    INFO: Uploading <https://builds.apache.org/job/beam_PostCommit_Java_GradleBuild/ws/src/sdks/java/io/google-cloud-platform/build/libs/beam-sdks-java-io-google-cloud-platform-2.5.0-SNAPSHOT-shaded-tests.jar>
to gs://temp-storage-for-end-to-end-tests/testpipeline-jenkins-0426025604-3c8f0099/output/results/staging/beam-sdks-java-io-google-cloud-platform-2.5.0-SNAPSHOT-shaded-tests-LZ0ZNNIhNedCZgg5nS-a9A.jar
    Apr 26, 2018 2:56:06 AM org.apache.beam.runners.dataflow.util.PackageUtil tryStagePackage
    INFO: Uploading /home/jenkins/.m2/repository/com/google/auto/value/auto-value/1.4/auto-value-1.4.jar
to gs://temp-storage-for-end-to-end-tests/testpipeline-jenkins-0426025604-3c8f0099/output/results/staging/auto-value-1.4-_7tYdqNvCowycFIDpBenFw.jar
    Apr 26, 2018 2:56:06 AM org.apache.beam.runners.dataflow.util.PackageUtil tryStagePackage
    INFO: Uploading /home/jenkins/.m2/repository/com/esotericsoftware/kryo/kryo/2.21/kryo-2.21.jar
to gs://temp-storage-for-end-to-end-tests/testpipeline-jenkins-0426025604-3c8f0099/output/results/staging/kryo-2.21-olkSUBNMYGe-WXkdlwcytQ.jar
    Apr 26, 2018 2:56:06 AM org.apache.beam.runners.dataflow.util.PackageUtil tryStagePackage
    INFO: Uploading /home/jenkins/.m2/repository/org/ow2/asm/asm/4.0/asm-4.0.jar to gs://temp-storage-for-end-to-end-tests/testpipeline-jenkins-0426025604-3c8f0099/output/results/staging/asm-4.0-Mi2PiMURGvYS34OMAZHNfg.jar
    Apr 26, 2018 2:56:06 AM org.apache.beam.runners.dataflow.util.PackageUtil tryStagePackage
    INFO: Uploading /home/jenkins/.m2/repository/io/netty/netty-tcnative-boringssl-static/1.1.33.Fork26/netty-tcnative-boringssl-static-1.1.33.Fork26.jar
to gs://temp-storage-for-end-to-end-tests/testpipeline-jenkins-0426025604-3c8f0099/output/results/staging/netty-tcnative-boringssl-static-1.1.33.Fork26-29XB0C44MyezMyoCB5cCbw.jar
    Apr 26, 2018 2:56:06 AM org.apache.beam.runners.dataflow.util.PackageUtil tryStagePackage
    INFO: Uploading /home/jenkins/.m2/repository/com/google/guava/guava/20.0/guava-20.0.jar
to gs://temp-storage-for-end-to-end-tests/testpipeline-jenkins-0426025604-3c8f0099/output/results/staging/guava-20.0-8yqKJSRiDb7Mn2v2ogwpPw.jar
    Apr 26, 2018 2:56:06 AM org.apache.beam.runners.dataflow.util.PackageUtil tryStagePackage
    INFO: Uploading /home/jenkins/.m2/repository/com/squareup/okhttp/okhttp/2.5.0/okhttp-2.5.0.jar
to gs://temp-storage-for-end-to-end-tests/testpipeline-jenkins-0426025604-3c8f0099/output/results/staging/okhttp-2.5.0-64v0X4G_nxfR_PsuymOqpg.jar
    Apr 26, 2018 2:59:05 AM org.apache.beam.runners.dataflow.util.PackageUtil stageClasspathElements
    INFO: Still staging 128 files
    Apr 26, 2018 3:01:43 AM org.apache.beam.runners.dataflow.util.PackageUtil stageClasspathElements
    INFO: Staging files complete: 0 files cached, 128 files newly uploaded
    Apr 26, 2018 3:01:43 AM org.apache.beam.runners.dataflow.DataflowPipelineTranslator$Translator
addStep
    INFO: Adding GenerateSequence/Read(BoundedCountingSource) as step s1
    Apr 26, 2018 3:01:43 AM org.apache.beam.runners.dataflow.DataflowPipelineTranslator$Translator
addStep
    INFO: Adding ParDo(CreateEntity) as step s2
    Apr 26, 2018 3:01:43 AM org.apache.beam.runners.dataflow.DataflowPipelineTranslator$Translator
addStep
    INFO: Adding DatastoreV1.Write/Convert to Mutation/Map as step s3
    Apr 26, 2018 3:01:43 AM org.apache.beam.runners.dataflow.DataflowPipelineTranslator$Translator
addStep
    INFO: Adding DatastoreV1.Write/Write Mutation to Datastore as step s4
    Apr 26, 2018 3:01:43 AM org.apache.beam.runners.dataflow.DataflowRunner run
    INFO: Staging pipeline description to gs://temp-storage-for-end-to-end-tests/testpipeline-jenkins-0426025604-3c8f0099/output/results/staging/
    Apr 26, 2018 3:01:43 AM org.apache.beam.runners.dataflow.util.PackageUtil tryStagePackage
    INFO: Uploading <8775 bytes, hash GyGXNgJE7v7E2o6lVl8knA> to gs://temp-storage-for-end-to-end-tests/testpipeline-jenkins-0426025604-3c8f0099/output/results/staging/pipeline-GyGXNgJE7v7E2o6lVl8knA.pb

org.apache.beam.sdk.io.gcp.datastore.V1WriteIT > testE2EV1Write STANDARD_OUT
    Dataflow SDK version: 2.5.0-SNAPSHOT

org.apache.beam.sdk.io.gcp.datastore.V1WriteIT > testE2EV1Write STANDARD_ERROR
    Apr 26, 2018 3:01:44 AM org.apache.beam.runners.dataflow.DataflowRunner run
    INFO: To access the Dataflow monitoring console, please navigate to https://console.cloud.google.com/dataflow/jobsDetail/locations/us-central1/jobs/2018-04-25_20_01_43-6770291931397405151?project=apache-beam-testing

org.apache.beam.sdk.io.gcp.datastore.V1WriteIT > testE2EV1Write STANDARD_OUT
    Submitted job: 2018-04-25_20_01_43-6770291931397405151

org.apache.beam.sdk.io.gcp.datastore.V1WriteIT > testE2EV1Write STANDARD_ERROR
    Apr 26, 2018 3:01:44 AM org.apache.beam.runners.dataflow.DataflowRunner run
    INFO: To cancel the job using the 'gcloud' tool, run:
    > gcloud dataflow jobs --project=apache-beam-testing cancel --region=us-central1 2018-04-25_20_01_43-6770291931397405151
    Apr 26, 2018 3:01:44 AM org.apache.beam.runners.dataflow.TestDataflowRunner run
    INFO: Running Dataflow job 2018-04-25_20_01_43-6770291931397405151 with 0 expected assertions.
    Apr 26, 2018 3:01:54 AM org.apache.beam.runners.dataflow.util.MonitoringUtil$LoggingHandler
process
    INFO: 2018-04-26T03:01:43.755Z: Autoscaling is enabled for job 2018-04-25_20_01_43-6770291931397405151.
The number of workers will be between 1 and 1000.
    Apr 26, 2018 3:01:54 AM org.apache.beam.runners.dataflow.util.MonitoringUtil$LoggingHandler
process
    INFO: 2018-04-26T03:01:43.785Z: Autoscaling was automatically enabled for job 2018-04-25_20_01_43-6770291931397405151.
    Apr 26, 2018 3:01:54 AM org.apache.beam.runners.dataflow.util.MonitoringUtil$LoggingHandler
process
    INFO: 2018-04-26T03:01:46.945Z: Checking required Cloud APIs are enabled.
    Apr 26, 2018 3:01:54 AM org.apache.beam.runners.dataflow.util.MonitoringUtil$LoggingHandler
process
    INFO: 2018-04-26T03:01:47.120Z: Checking permissions granted to controller Service Account.
    Apr 26, 2018 3:01:54 AM org.apache.beam.runners.dataflow.util.MonitoringUtil$LoggingHandler
process
    INFO: 2018-04-26T03:01:51.295Z: Worker configuration: n1-standard-1 in us-central1-f.
    Apr 26, 2018 3:01:54 AM org.apache.beam.runners.dataflow.util.MonitoringUtil$LoggingHandler
process
    INFO: 2018-04-26T03:01:51.634Z: Expanding CoGroupByKey operations into optimizable parts.
    Apr 26, 2018 3:01:54 AM org.apache.beam.runners.dataflow.util.MonitoringUtil$LoggingHandler
process
    INFO: 2018-04-26T03:01:51.668Z: Expanding GroupByKey operations into optimizable parts.
    Apr 26, 2018 3:01:54 AM org.apache.beam.runners.dataflow.util.MonitoringUtil$LoggingHandler
process
    INFO: 2018-04-26T03:01:51.694Z: Lifting ValueCombiningMappingFns into MergeBucketsMappingFns
    Apr 26, 2018 3:01:54 AM org.apache.beam.runners.dataflow.util.MonitoringUtil$LoggingHandler
process
    INFO: 2018-04-26T03:01:51.775Z: Fusing adjacent ParDo, Read, Write, and Flatten operations
    Apr 26, 2018 3:01:54 AM org.apache.beam.runners.dataflow.util.MonitoringUtil$LoggingHandler
process
    INFO: 2018-04-26T03:01:51.801Z: Fusing consumer ParDo(CreateEntity) into GenerateSequence/Read(BoundedCountingSource)
    Apr 26, 2018 3:01:54 AM org.apache.beam.runners.dataflow.util.MonitoringUtil$LoggingHandler
process
    INFO: 2018-04-26T03:01:51.829Z: Fusing consumer DatastoreV1.Write/Write Mutation to Datastore
into DatastoreV1.Write/Convert to Mutation/Map
    Apr 26, 2018 3:01:54 AM org.apache.beam.runners.dataflow.util.MonitoringUtil$LoggingHandler
process
    INFO: 2018-04-26T03:01:51.862Z: Fusing consumer DatastoreV1.Write/Convert to Mutation/Map
into ParDo(CreateEntity)
    Apr 26, 2018 3:01:54 AM org.apache.beam.runners.dataflow.util.MonitoringUtil$LoggingHandler
process
    INFO: 2018-04-26T03:01:52.167Z: Executing operation GenerateSequence/Read(BoundedCountingSource)+ParDo(CreateEntity)+DatastoreV1.Write/Convert
to Mutation/Map+DatastoreV1.Write/Write Mutation to Datastore
    Apr 26, 2018 3:01:54 AM org.apache.beam.runners.dataflow.util.MonitoringUtil$LoggingHandler
process
    INFO: 2018-04-26T03:01:52.236Z: Starting 1 workers in us-central1-f...
    Apr 26, 2018 3:02:02 AM org.apache.beam.runners.dataflow.util.MonitoringUtil$LoggingHandler
process
    INFO: 2018-04-26T03:02:01.662Z: Autoscaling: Raised the number of workers to 0 based on
the rate of progress in the currently running step(s).
    Apr 26, 2018 3:02:13 AM org.apache.beam.runners.dataflow.util.MonitoringUtil$LoggingHandler
process
    INFO: 2018-04-26T03:02:12.185Z: Autoscaling: Raised the number of workers to 1 based on
the rate of progress in the currently running step(s).
    Apr 26, 2018 3:02:28 AM org.apache.beam.runners.dataflow.util.MonitoringUtil$LoggingHandler
process
    INFO: 2018-04-26T03:02:28.694Z: Workers have started successfully.
    Apr 26, 2018 3:03:01 AM org.apache.beam.runners.dataflow.util.MonitoringUtil$LoggingHandler
process
    INFO: 2018-04-26T03:03:01.526Z: Cleaning up.
    Apr 26, 2018 3:03:03 AM org.apache.beam.runners.dataflow.util.MonitoringUtil$LoggingHandler
process
    INFO: 2018-04-26T03:03:01.620Z: Stopping worker pool...
    Apr 26, 2018 3:04:28 AM org.apache.beam.runners.dataflow.util.MonitoringUtil$LoggingHandler
process
    INFO: 2018-04-26T03:04:27.548Z: Autoscaling: Resized worker pool from 1 to 0.
    Apr 26, 2018 3:04:28 AM org.apache.beam.runners.dataflow.util.MonitoringUtil$LoggingHandler
process
    INFO: 2018-04-26T03:04:27.572Z: Autoscaling: Would further reduce the number of workers
but reached the minimum number allowed for the job.
    Apr 26, 2018 3:04:35 AM org.apache.beam.runners.dataflow.DataflowPipelineJob waitUntilFinish
    INFO: Job 2018-04-25_20_01_43-6770291931397405151 finished with status DONE.
    Apr 26, 2018 3:04:35 AM org.apache.beam.runners.dataflow.TestDataflowRunner checkForPAssertSuccess
    INFO: Success result for Dataflow job 2018-04-25_20_01_43-6770291931397405151. Found 0
success, 0 failures out of 0 expected assertions.
    Apr 26, 2018 3:04:36 AM org.apache.beam.sdk.io.gcp.datastore.V1TestUtil$V1TestWriter flushBatch
    INFO: Writing batch of 500 entities
    Apr 26, 2018 3:04:36 AM org.apache.beam.sdk.io.gcp.datastore.V1TestUtil$V1TestWriter flushBatch
    INFO: Successfully wrote 500 entities
    Apr 26, 2018 3:04:37 AM org.apache.beam.sdk.io.gcp.datastore.V1TestUtil$V1TestWriter flushBatch
    INFO: Writing batch of 500 entities
    Apr 26, 2018 3:04:37 AM org.apache.beam.sdk.io.gcp.datastore.V1TestUtil$V1TestWriter flushBatch
    INFO: Successfully wrote 500 entities
    Apr 26, 2018 3:04:37 AM org.apache.beam.sdk.io.gcp.datastore.V1TestUtil deleteAllEntities
    INFO: Successfully deleted 1000 entities

org.apache.beam.sdk.io.gcp.spanner.SpannerReadIT > testQuery FAILED
    java.lang.NoClassDefFoundError: com/google/api/gax/retrying/ExceptionRetryAlgorithm
        at java.lang.ClassLoader.defineClass1(Native Method)
        at java.lang.ClassLoader.defineClass(ClassLoader.java:763)
        at java.security.SecureClassLoader.defineClass(SecureClassLoader.java:142)
        at java.net.URLClassLoader.defineClass(URLClassLoader.java:467)
        at java.net.URLClassLoader.access$100(URLClassLoader.java:73)
        at java.net.URLClassLoader$1.run(URLClassLoader.java:368)
        at java.net.URLClassLoader$1.run(URLClassLoader.java:362)
        at java.security.AccessController.doPrivileged(Native Method)
        at java.net.URLClassLoader.findClass(URLClassLoader.java:361)
        at java.lang.ClassLoader.loadClass(ClassLoader.java:424)
        at sun.misc.Launcher$AppClassLoader.loadClass(Launcher.java:338)
        at java.lang.ClassLoader.loadClass(ClassLoader.java:357)
        at com.google.cloud.BaseService.<clinit>(BaseService.java:48)
        at com.google.cloud.spanner.SpannerOptions$DefaultSpannerFactory.create(SpannerOptions.java:60)
        at com.google.cloud.spanner.SpannerOptions$DefaultSpannerFactory.create(SpannerOptions.java:55)
        at com.google.cloud.ServiceOptions.getService(ServiceOptions.java:426)
        at org.apache.beam.sdk.io.gcp.spanner.SpannerReadIT.setUp(SpannerReadIT.java:90)

        Caused by:
        java.lang.ClassNotFoundException: com.google.api.gax.retrying.ExceptionRetryAlgorithm
            at java.net.URLClassLoader.findClass(URLClassLoader.java:381)
            at java.lang.ClassLoader.loadClass(ClassLoader.java:424)
            at sun.misc.Launcher$AppClassLoader.loadClass(Launcher.java:338)
            at java.lang.ClassLoader.loadClass(ClassLoader.java:357)
            ... 17 more

    java.lang.NullPointerException
        at org.apache.beam.sdk.io.gcp.spanner.SpannerReadIT.tearDown(SpannerReadIT.java:198)

Gradle Test Executor 130 finished executing tests.

> Task :beam-runners-google-cloud-dataflow-java:googleCloudPlatformIntegrationTest FAILED

org.apache.beam.sdk.io.gcp.spanner.SpannerReadIT > testRead FAILED
    java.lang.NoClassDefFoundError: Could not initialize class com.google.cloud.spanner.SpannerImpl
        at com.google.cloud.spanner.SpannerOptions$DefaultSpannerFactory.create(SpannerOptions.java:60)
        at com.google.cloud.spanner.SpannerOptions$DefaultSpannerFactory.create(SpannerOptions.java:55)
        at com.google.cloud.ServiceOptions.getService(ServiceOptions.java:426)
        at org.apache.beam.sdk.io.gcp.spanner.SpannerReadIT.setUp(SpannerReadIT.java:90)

    java.lang.NullPointerException
        at org.apache.beam.sdk.io.gcp.spanner.SpannerReadIT.tearDown(SpannerReadIT.java:198)

12 tests completed, 3 failed
Finished generating test XML results (0.006 secs) into: <https://builds.apache.org/job/beam_PostCommit_Java_GradleBuild/ws/src/runners/google-cloud-dataflow-java/build/test-results/googleCloudPlatformIntegrationTest>
Generating HTML test report...
Finished generating test html results (0.006 secs) into: <https://builds.apache.org/job/beam_PostCommit_Java_GradleBuild/ws/src/runners/google-cloud-dataflow-java/build/reports/tests/googleCloudPlatformIntegrationTest>
:beam-runners-google-cloud-dataflow-java:googleCloudPlatformIntegrationTest (Thread[Task worker
for ':',5,main]) completed. Took 28 mins 0.975 secs.

FAILURE: Build failed with an exception.

* What went wrong:
Execution failed for task ':beam-runners-google-cloud-dataflow-java:googleCloudPlatformIntegrationTest'.
> There were failing tests. See the report at: file://<https://builds.apache.org/job/beam_PostCommit_Java_GradleBuild/ws/src/runners/google-cloud-dataflow-java/build/reports/tests/googleCloudPlatformIntegrationTest/index.html>

* Try:
Run with --stacktrace option to get the stack trace. Run with --debug option to get more log
output. Run with --scan to get full insights.

* Get more help at https://help.gradle.org

Deprecated Gradle features were used in this build, making it incompatible with Gradle 5.0.
See https://docs.gradle.org/4.7/userguide/command_line_interface.html#sec:command_line_warnings

BUILD FAILED in 57m 4s
546 actionable tasks: 541 executed, 5 from cache

Publishing build scan...
https://gradle.com/s/ou6foqlnjrm42

Build step 'Invoke Gradle script' changed build result to FAILURE
Build step 'Invoke Gradle script' marked build as failure
Recording test results
Not sending mail to unregistered user apilloud@google.com
Not sending mail to unregistered user wcn@google.com
Not sending mail to unregistered user sidhom@google.com
Not sending mail to unregistered user swegner@google.com
Not sending mail to unregistered user szewinho@gmail.com
Not sending mail to unregistered user aaltay@gmail.com
Not sending mail to unregistered user kedin@google.com
Not sending mail to unregistered user kirpichov@google.com
Not sending mail to unregistered user relax@relax-macbookpro2.roam.corp.google.com
Not sending mail to unregistered user ekirpichov@gmail.com

Mime
View raw message