beam-commits mailing list archives

Site index · List index
Message view « Date » · « Thread »
Top « Date » · « Thread »
From Apache Jenkins Server <jenk...@builds.apache.org>
Subject Build failed in Jenkins: beam_PerformanceTests_JDBC #457
Date Mon, 16 Apr 2018 00:04:03 GMT
See <https://builds.apache.org/job/beam_PerformanceTests_JDBC/457/display/redirect>

------------------------------------------
[...truncated 65 B...]
 > git rev-parse --is-inside-work-tree # timeout=10
Fetching changes from the remote Git repository
 > git config remote.origin.url https://github.com/apache/beam.git # timeout=10
Fetching upstream changes from https://github.com/apache/beam.git
 > git --version # timeout=10
 > git fetch --tags --progress https://github.com/apache/beam.git +refs/heads/*:refs/remotes/origin/*
+refs/pull/${ghprbPullId}/*:refs/remotes/origin/pr/${ghprbPullId}/*
 > git rev-parse origin/master^{commit} # timeout=10
Checking out Revision 9e3e9c4d0a0dc1574c8956c7f8379b37ba262cb2 (origin/master)
 > git config core.sparsecheckout # timeout=10
 > git checkout -f 9e3e9c4d0a0dc1574c8956c7f8379b37ba262cb2
Commit message: "This closes #5028"
 > git rev-list --no-walk 9e3e9c4d0a0dc1574c8956c7f8379b37ba262cb2 # timeout=10
Cleaning workspace
 > git rev-parse --verify HEAD # timeout=10
Resetting working tree
 > git reset --hard # timeout=10
 > git clean -fdx # timeout=10
[EnvInject] - Executing scripts and injecting environment variables after the SCM step.
[EnvInject] - Injecting as environment variables the properties content 
SPARK_LOCAL_IP=127.0.0.1

[EnvInject] - Variables injected successfully.
[beam_PerformanceTests_JDBC] $ /bin/bash -xe /tmp/jenkins6285987913365636773.sh
+ gcloud container clusters get-credentials io-datastores --zone=us-central1-a --verbosity=debug
DEBUG: Running gcloud.container.clusters.get-credentials with Namespace(__calliope_internal_deepest_parser=ArgumentParser(prog='gcloud.container.clusters.get-credentials',
usage=None, description='See https://cloud.google.com/container-engine/docs/kubectl for\nkubectl
documentation.', version=None, formatter_class=<class 'argparse.HelpFormatter'>, conflict_handler='error',
add_help=False), account=None, api_version=None, authority_selector=None, authorization_token_file=None,
cmd_func=<bound method Command.Run of <googlecloudsdk.calliope.backend.Command object
at 0x7fc5d13ce5d0>>, command_path=['gcloud', 'container', 'clusters', 'get-credentials'],
configuration=None, credential_file_override=None, document=None, format=None, h=None, help=None,
http_timeout=None, log_http=None, name='io-datastores', project=None, quiet=None, trace_email=None,
trace_log=None, trace_token=None, user_output_enabled=None, verbosity='debug', version=None,
zone='us-central1-a').
Fetching cluster endpoint and auth data.
DEBUG: Saved kubeconfig to /home/jenkins/.kube/config
kubeconfig entry generated for io-datastores.
INFO: Display format "default".
[beam_PerformanceTests_JDBC] $ /bin/bash -xe /tmp/jenkins3683803143557606910.sh
+ cp /home/jenkins/.kube/config <https://builds.apache.org/job/beam_PerformanceTests_JDBC/ws/config-jdbcioit-1523822464758>
[beam_PerformanceTests_JDBC] $ /bin/bash -xe /tmp/jenkins5320566750508602087.sh
+ kubectl --kubeconfig=<https://builds.apache.org/job/beam_PerformanceTests_JDBC/ws/config-jdbcioit-1523822464758>
create namespace jdbcioit-1523822464758
namespace "jdbcioit-1523822464758" created
[beam_PerformanceTests_JDBC] $ /bin/bash -xe /tmp/jenkins1477907373360939600.sh
++ kubectl config current-context
+ kubectl --kubeconfig=<https://builds.apache.org/job/beam_PerformanceTests_JDBC/ws/config-jdbcioit-1523822464758>
config set-context gke_apache-beam-testing_us-central1-a_io-datastores --namespace=jdbcioit-1523822464758
Context "gke_apache-beam-testing_us-central1-a_io-datastores" modified.
[beam_PerformanceTests_JDBC] $ /bin/bash -xe /tmp/jenkins2055369074632275050.sh
+ rm -rf PerfKitBenchmarker
[beam_PerformanceTests_JDBC] $ /bin/bash -xe /tmp/jenkins1326176420402314761.sh
+ rm -rf .env
[beam_PerformanceTests_JDBC] $ /bin/bash -xe /tmp/jenkins6224490006904210490.sh
+ virtualenv .env --system-site-packages
New python executable in <https://builds.apache.org/job/beam_PerformanceTests_JDBC/ws/.env/bin/python>
Installing setuptools, pip, wheel...done.
[beam_PerformanceTests_JDBC] $ /bin/bash -xe /tmp/jenkins9151029283475263280.sh
+ .env/bin/pip install --upgrade setuptools pip
Requirement already up-to-date: setuptools in ./.env/lib/python2.7/site-packages (39.0.1)
Requirement already up-to-date: pip in ./.env/lib/python2.7/site-packages (10.0.0)
cheetah 2.4.4 requires Markdown>=2.0.1, which is not installed.
[beam_PerformanceTests_JDBC] $ /bin/bash -xe /tmp/jenkins1448891060016257147.sh
+ git clone https://github.com/GoogleCloudPlatform/PerfKitBenchmarker.git
Cloning into 'PerfKitBenchmarker'...
[beam_PerformanceTests_JDBC] $ /bin/bash -xe /tmp/jenkins7676618157203234264.sh
+ .env/bin/pip install -r PerfKitBenchmarker/requirements.txt
Requirement already satisfied: absl-py in /home/jenkins/.local/lib/python2.7/site-packages
(from -r PerfKitBenchmarker/requirements.txt (line 14)) (0.1.3)
Requirement already satisfied: jinja2>=2.7 in /usr/local/lib/python2.7/dist-packages (from
-r PerfKitBenchmarker/requirements.txt (line 15)) (2.8)
Requirement already satisfied: setuptools in ./.env/lib/python2.7/site-packages (from -r PerfKitBenchmarker/requirements.txt
(line 16)) (39.0.1)
Requirement already satisfied: colorlog[windows]==2.6.0 in /home/jenkins/.local/lib/python2.7/site-packages
(from -r PerfKitBenchmarker/requirements.txt (line 17)) (2.6.0)
Requirement already satisfied: blinker>=1.3 in /home/jenkins/.local/lib/python2.7/site-packages
(from -r PerfKitBenchmarker/requirements.txt (line 18)) (1.4)
Requirement already satisfied: futures>=3.0.3 in /home/jenkins/.local/lib/python2.7/site-packages
(from -r PerfKitBenchmarker/requirements.txt (line 19)) (3.2.0)
Requirement already satisfied: PyYAML==3.12 in /home/jenkins/.local/lib/python2.7/site-packages
(from -r PerfKitBenchmarker/requirements.txt (line 20)) (3.12)
Requirement already satisfied: pint>=0.7 in /home/jenkins/.local/lib/python2.7/site-packages
(from -r PerfKitBenchmarker/requirements.txt (line 21)) (0.7.2)
Collecting numpy==1.13.3 (from -r PerfKitBenchmarker/requirements.txt (line 22))
  Using cached numpy-1.13.3-cp27-cp27mu-manylinux1_x86_64.whl
Requirement already satisfied: functools32 in /home/jenkins/.local/lib/python2.7/site-packages
(from -r PerfKitBenchmarker/requirements.txt (line 23)) (3.2.3.post2)
Requirement already satisfied: contextlib2>=0.5.1 in /home/jenkins/.local/lib/python2.7/site-packages
(from -r PerfKitBenchmarker/requirements.txt (line 24)) (0.5.4)
Requirement already satisfied: pywinrm in /home/jenkins/.local/lib/python2.7/site-packages
(from -r PerfKitBenchmarker/requirements.txt (line 25)) (0.2.2)
Requirement already satisfied: six in /home/jenkins/.local/lib/python2.7/site-packages (from
absl-py->-r PerfKitBenchmarker/requirements.txt (line 14)) (1.11.0)
Requirement already satisfied: MarkupSafe in /usr/local/lib/python2.7/dist-packages (from
jinja2>=2.7->-r PerfKitBenchmarker/requirements.txt (line 15)) (0.23)
Requirement already satisfied: colorama; extra == "windows" in /usr/lib/python2.7/dist-packages
(from colorlog[windows]==2.6.0->-r PerfKitBenchmarker/requirements.txt (line 17)) (0.2.5)
Requirement already satisfied: xmltodict in /home/jenkins/.local/lib/python2.7/site-packages
(from pywinrm->-r PerfKitBenchmarker/requirements.txt (line 25)) (0.11.0)
Requirement already satisfied: requests-ntlm>=0.3.0 in /home/jenkins/.local/lib/python2.7/site-packages
(from pywinrm->-r PerfKitBenchmarker/requirements.txt (line 25)) (1.1.0)
Requirement already satisfied: requests>=2.9.1 in /home/jenkins/.local/lib/python2.7/site-packages
(from pywinrm->-r PerfKitBenchmarker/requirements.txt (line 25)) (2.18.1)
Requirement already satisfied: ntlm-auth>=1.0.2 in /home/jenkins/.local/lib/python2.7/site-packages
(from requests-ntlm>=0.3.0->pywinrm->-r PerfKitBenchmarker/requirements.txt (line
25)) (1.0.6)
Requirement already satisfied: cryptography>=1.3 in /home/jenkins/.local/lib/python2.7/site-packages
(from requests-ntlm>=0.3.0->pywinrm->-r PerfKitBenchmarker/requirements.txt (line
25)) (2.1.3)
Requirement already satisfied: idna<2.6,>=2.5 in /home/jenkins/.local/lib/python2.7/site-packages
(from requests>=2.9.1->pywinrm->-r PerfKitBenchmarker/requirements.txt (line 25))
(2.5)
Requirement already satisfied: urllib3<1.22,>=1.21.1 in /home/jenkins/.local/lib/python2.7/site-packages
(from requests>=2.9.1->pywinrm->-r PerfKitBenchmarker/requirements.txt (line 25))
(1.21.1)
Requirement already satisfied: chardet<3.1.0,>=3.0.2 in /home/jenkins/.local/lib/python2.7/site-packages
(from requests>=2.9.1->pywinrm->-r PerfKitBenchmarker/requirements.txt (line 25))
(3.0.4)
Requirement already satisfied: certifi>=2017.4.17 in /home/jenkins/.local/lib/python2.7/site-packages
(from requests>=2.9.1->pywinrm->-r PerfKitBenchmarker/requirements.txt (line 25))
(2017.4.17)
Requirement already satisfied: cffi>=1.7; platform_python_implementation != "PyPy" in /home/jenkins/.local/lib/python2.7/site-packages
(from cryptography>=1.3->requests-ntlm>=0.3.0->pywinrm->-r PerfKitBenchmarker/requirements.txt
(line 25)) (1.11.2)
Requirement already satisfied: enum34; python_version < "3" in /home/jenkins/.local/lib/python2.7/site-packages
(from cryptography>=1.3->requests-ntlm>=0.3.0->pywinrm->-r PerfKitBenchmarker/requirements.txt
(line 25)) (1.1.6)
Requirement already satisfied: asn1crypto>=0.21.0 in /home/jenkins/.local/lib/python2.7/site-packages
(from cryptography>=1.3->requests-ntlm>=0.3.0->pywinrm->-r PerfKitBenchmarker/requirements.txt
(line 25)) (0.23.0)
Requirement already satisfied: ipaddress; python_version < "3" in /usr/local/lib/python2.7/dist-packages
(from cryptography>=1.3->requests-ntlm>=0.3.0->pywinrm->-r PerfKitBenchmarker/requirements.txt
(line 25)) (1.0.19)
Requirement already satisfied: pycparser in /home/jenkins/.local/lib/python2.7/site-packages
(from cffi>=1.7; platform_python_implementation != "PyPy"->cryptography>=1.3->requests-ntlm>=0.3.0->pywinrm->-r
PerfKitBenchmarker/requirements.txt (line 25)) (2.18)
cheetah 2.4.4 requires Markdown>=2.0.1, which is not installed.
Installing collected packages: numpy
  Found existing installation: numpy 1.11.3
    Not uninstalling numpy at /home/jenkins/.local/lib/python2.7/site-packages, outside environment
<https://builds.apache.org/job/beam_PerformanceTests_JDBC/ws/.env>
    Can't uninstall 'numpy'. No files were found to uninstall.
Successfully installed numpy-1.13.3
[beam_PerformanceTests_JDBC] $ /bin/bash -xe /tmp/jenkins2851049636694876630.sh
+ .env/bin/pip install -e 'src/sdks/python/[gcp,test]'
Obtaining file://<https://builds.apache.org/job/beam_PerformanceTests_JDBC/ws/src/sdks/python>
Requirement already satisfied: avro<2.0.0,>=1.8.1 in /home/jenkins/.local/lib/python2.7/site-packages
(from apache-beam==2.5.0.dev0) (1.8.2)
Requirement already satisfied: crcmod<2.0,>=1.7 in /home/jenkins/.local/lib/python2.7/site-packages
(from apache-beam==2.5.0.dev0) (1.7)
Requirement already satisfied: dill==0.2.6 in /home/jenkins/.local/lib/python2.7/site-packages
(from apache-beam==2.5.0.dev0) (0.2.6)
Collecting grpcio<2,>=1.8 (from apache-beam==2.5.0.dev0)
  Using cached grpcio-1.11.0-cp27-cp27mu-manylinux1_x86_64.whl
Collecting hdfs<3.0.0,>=2.1.0 (from apache-beam==2.5.0.dev0)
Requirement already satisfied: httplib2<0.10,>=0.8 in /home/jenkins/.local/lib/python2.7/site-packages
(from apache-beam==2.5.0.dev0) (0.9.2)
Requirement already satisfied: mock<3.0.0,>=1.0.1 in /home/jenkins/.local/lib/python2.7/site-packages
(from apache-beam==2.5.0.dev0) (2.0.0)
Requirement already satisfied: oauth2client<5,>=2.0.1 in /home/jenkins/.local/lib/python2.7/site-packages
(from apache-beam==2.5.0.dev0) (3.0.0)
Requirement already satisfied: protobuf<4,>=3.5.0.post1 in /home/jenkins/.local/lib/python2.7/site-packages
(from apache-beam==2.5.0.dev0) (3.5.0.post1)
Collecting pytz>=2018.3 (from apache-beam==2.5.0.dev0)
  Using cached pytz-2018.4-py2.py3-none-any.whl
Requirement already satisfied: pyyaml<4.0.0,>=3.12 in /home/jenkins/.local/lib/python2.7/site-packages
(from apache-beam==2.5.0.dev0) (3.12)
Requirement already satisfied: pyvcf<0.7.0,>=0.6.8 in /home/jenkins/.local/lib/python2.7/site-packages
(from apache-beam==2.5.0.dev0) (0.6.8)
Requirement already satisfied: six<1.12,>=1.9 in /home/jenkins/.local/lib/python2.7/site-packages
(from apache-beam==2.5.0.dev0) (1.11.0)
Requirement already satisfied: typing<3.7.0,>=3.6.0 in /home/jenkins/.local/lib/python2.7/site-packages
(from apache-beam==2.5.0.dev0) (3.6.2)
Requirement already satisfied: futures<4.0.0,>=3.1.1 in /home/jenkins/.local/lib/python2.7/site-packages
(from apache-beam==2.5.0.dev0) (3.2.0)
Requirement already satisfied: google-apitools<=0.5.20,>=0.5.18 in /home/jenkins/.local/lib/python2.7/site-packages
(from apache-beam==2.5.0.dev0) (0.5.20)
Requirement already satisfied: proto-google-cloud-datastore-v1<=0.90.4,>=0.90.0 in /home/jenkins/.local/lib/python2.7/site-packages
(from apache-beam==2.5.0.dev0) (0.90.4)
Requirement already satisfied: googledatastore==7.0.1 in /home/jenkins/.local/lib/python2.7/site-packages
(from apache-beam==2.5.0.dev0) (7.0.1)
Requirement already satisfied: google-cloud-pubsub==0.26.0 in /home/jenkins/.local/lib/python2.7/site-packages
(from apache-beam==2.5.0.dev0) (0.26.0)
Requirement already satisfied: proto-google-cloud-pubsub-v1==0.15.4 in /home/jenkins/.local/lib/python2.7/site-packages
(from apache-beam==2.5.0.dev0) (0.15.4)
Requirement already satisfied: google-cloud-bigquery==0.25.0 in /home/jenkins/.local/lib/python2.7/site-packages
(from apache-beam==2.5.0.dev0) (0.25.0)
Collecting nose>=1.3.7 (from apache-beam==2.5.0.dev0)
  Using cached nose-1.3.7-py2-none-any.whl
Requirement already satisfied: pyhamcrest<2.0,>=1.9 in /home/jenkins/.local/lib/python2.7/site-packages
(from apache-beam==2.5.0.dev0) (1.9.0)
Requirement already satisfied: enum34>=1.0.4 in /home/jenkins/.local/lib/python2.7/site-packages
(from grpcio<2,>=1.8->apache-beam==2.5.0.dev0) (1.1.6)
Requirement already satisfied: requests>=2.7.0 in /home/jenkins/.local/lib/python2.7/site-packages
(from hdfs<3.0.0,>=2.1.0->apache-beam==2.5.0.dev0) (2.18.1)
Requirement already satisfied: docopt in /usr/local/lib/python2.7/dist-packages (from hdfs<3.0.0,>=2.1.0->apache-beam==2.5.0.dev0)
(0.6.2)
Requirement already satisfied: funcsigs>=1; python_version < "3.3" in /home/jenkins/.local/lib/python2.7/site-packages
(from mock<3.0.0,>=1.0.1->apache-beam==2.5.0.dev0) (1.0.2)
Requirement already satisfied: pbr>=0.11 in /home/jenkins/.local/lib/python2.7/site-packages
(from mock<3.0.0,>=1.0.1->apache-beam==2.5.0.dev0) (3.1.1)
Requirement already satisfied: pyasn1>=0.1.7 in /home/jenkins/.local/lib/python2.7/site-packages
(from oauth2client<5,>=2.0.1->apache-beam==2.5.0.dev0) (0.2.3)
Requirement already satisfied: pyasn1-modules>=0.0.5 in /home/jenkins/.local/lib/python2.7/site-packages
(from oauth2client<5,>=2.0.1->apache-beam==2.5.0.dev0) (0.0.9)
Requirement already satisfied: rsa>=3.1.4 in /home/jenkins/.local/lib/python2.7/site-packages
(from oauth2client<5,>=2.0.1->apache-beam==2.5.0.dev0) (3.4.2)
Requirement already satisfied: setuptools in ./.env/lib/python2.7/site-packages (from protobuf<4,>=3.5.0.post1->apache-beam==2.5.0.dev0)
(39.0.1)
Requirement already satisfied: fasteners>=0.14 in /home/jenkins/.local/lib/python2.7/site-packages
(from google-apitools<=0.5.20,>=0.5.18->apache-beam==2.5.0.dev0) (0.14.1)
Requirement already satisfied: googleapis-common-protos<2.0dev,>=1.5.2 in /home/jenkins/.local/lib/python2.7/site-packages
(from proto-google-cloud-datastore-v1<=0.90.4,>=0.90.0->apache-beam==2.5.0.dev0)
(1.5.2)
Requirement already satisfied: google-cloud-core<0.26dev,>=0.25.0 in /home/jenkins/.local/lib/python2.7/site-packages
(from google-cloud-pubsub==0.26.0->apache-beam==2.5.0.dev0) (0.25.0)
Requirement already satisfied: gapic-google-cloud-pubsub-v1<0.16dev,>=0.15.0 in /home/jenkins/.local/lib/python2.7/site-packages
(from google-cloud-pubsub==0.26.0->apache-beam==2.5.0.dev0) (0.15.4)
Requirement already satisfied: idna<2.6,>=2.5 in /home/jenkins/.local/lib/python2.7/site-packages
(from requests>=2.7.0->hdfs<3.0.0,>=2.1.0->apache-beam==2.5.0.dev0) (2.5)
Requirement already satisfied: urllib3<1.22,>=1.21.1 in /home/jenkins/.local/lib/python2.7/site-packages
(from requests>=2.7.0->hdfs<3.0.0,>=2.1.0->apache-beam==2.5.0.dev0) (1.21.1)
Requirement already satisfied: chardet<3.1.0,>=3.0.2 in /home/jenkins/.local/lib/python2.7/site-packages
(from requests>=2.7.0->hdfs<3.0.0,>=2.1.0->apache-beam==2.5.0.dev0) (3.0.4)
Requirement already satisfied: certifi>=2017.4.17 in /home/jenkins/.local/lib/python2.7/site-packages
(from requests>=2.7.0->hdfs<3.0.0,>=2.1.0->apache-beam==2.5.0.dev0) (2017.4.17)
Requirement already satisfied: monotonic>=0.1 in /home/jenkins/.local/lib/python2.7/site-packages
(from fasteners>=0.14->google-apitools<=0.5.20,>=0.5.18->apache-beam==2.5.0.dev0)
(1.4)
Requirement already satisfied: google-auth<2.0.0dev,>=0.4.0 in /home/jenkins/.local/lib/python2.7/site-packages
(from google-cloud-core<0.26dev,>=0.25.0->google-cloud-pubsub==0.26.0->apache-beam==2.5.0.dev0)
(1.0.1)
Requirement already satisfied: google-auth-httplib2 in /home/jenkins/.local/lib/python2.7/site-packages
(from google-cloud-core<0.26dev,>=0.25.0->google-cloud-pubsub==0.26.0->apache-beam==2.5.0.dev0)
(0.0.2)
Requirement already satisfied: google-gax<0.16dev,>=0.15.7 in /home/jenkins/.local/lib/python2.7/site-packages
(from gapic-google-cloud-pubsub-v1<0.16dev,>=0.15.0->google-cloud-pubsub==0.26.0->apache-beam==2.5.0.dev0)
(0.15.13)
Requirement already satisfied: grpc-google-iam-v1<0.12dev,>=0.11.1 in /home/jenkins/.local/lib/python2.7/site-packages
(from gapic-google-cloud-pubsub-v1<0.16dev,>=0.15.0->google-cloud-pubsub==0.26.0->apache-beam==2.5.0.dev0)
(0.11.1)
Requirement already satisfied: cachetools>=2.0.0 in /home/jenkins/.local/lib/python2.7/site-packages
(from google-auth<2.0.0dev,>=0.4.0->google-cloud-core<0.26dev,>=0.25.0->google-cloud-pubsub==0.26.0->apache-beam==2.5.0.dev0)
(2.0.0)
Requirement already satisfied: future<0.17dev,>=0.16.0 in /home/jenkins/.local/lib/python2.7/site-packages
(from google-gax<0.16dev,>=0.15.7->gapic-google-cloud-pubsub-v1<0.16dev,>=0.15.0->google-cloud-pubsub==0.26.0->apache-beam==2.5.0.dev0)
(0.16.0)
Requirement already satisfied: ply==3.8 in /home/jenkins/.local/lib/python2.7/site-packages
(from google-gax<0.16dev,>=0.15.7->gapic-google-cloud-pubsub-v1<0.16dev,>=0.15.0->google-cloud-pubsub==0.26.0->apache-beam==2.5.0.dev0)
(3.8)
cheetah 2.4.4 requires Markdown>=2.0.1, which is not installed.
Installing collected packages: grpcio, hdfs, pytz, nose, apache-beam
  Found existing installation: grpcio 1.4.0
    Not uninstalling grpcio at /home/jenkins/.local/lib/python2.7/site-packages, outside environment
<https://builds.apache.org/job/beam_PerformanceTests_JDBC/ws/.env>
    Can't uninstall 'grpcio'. No files were found to uninstall.
  Found existing installation: apache-beam 2.5.0.dev0
    Not uninstalling apache-beam at /home/jenkins/jenkins-slave/workspace/beam_PerformanceTests_TextIOIT/src/sdks/python,
outside environment <https://builds.apache.org/job/beam_PerformanceTests_JDBC/ws/.env>
    Can't uninstall 'apache-beam'. No files were found to uninstall.
  Running setup.py develop for apache-beam
Successfully installed apache-beam grpcio-1.11.0 hdfs-2.1.0 nose-1.3.7 pytz-2018.4
[beam_PerformanceTests_JDBC] $ /bin/bash -xe /tmp/jenkins7954863067400336103.sh
+ .env/bin/python PerfKitBenchmarker/pkb.py --project=apache-beam-testing --dpb_log_level=INFO
--maven_binary=/home/jenkins/tools/maven/latest/bin/mvn --bigquery_table=beam_performance.jdbcioit_pkb_results
--temp_dir=<https://builds.apache.org/job/beam_PerformanceTests_JDBC/ws/> --official=true
--kubeconfig=<https://builds.apache.org/job/beam_PerformanceTests_JDBC/ws/config-jdbcioit-1523822464758>
--beam_it_timeout=1800 --benchmarks=beam_integration_benchmark --beam_it_profile=io-it --beam_prebuilt=true
--beam_sdk=java --beam_it_module=sdks/java/io/jdbc --beam_it_class=org.apache.beam.sdk.io.jdbc.JdbcIOIT
'--beam_it_options=[--tempRoot=gs://temp-storage-for-perf-tests,--project=apache-beam-testing,--postgresPort=5432,--numberOfRecords=5000000]'
--beam_kubernetes_scripts=<https://builds.apache.org/job/beam_PerformanceTests_JDBC/ws/src/.test-infra/kubernetes/postgres/postgres-service-for-local-dev.yml>
--beam_options_config_file=<https://builds.apache.org/job/beam_PerformanceTests_JDBC/ws/src/.test-infra/kubernetes/postgres/pkb-config-local.yml>
2018-04-16 00:00:47,787 553ab573 MainThread INFO     Verbose logging to: <https://builds.apache.org/job/beam_PerformanceTests_JDBC/ws/runs/553ab573/pkb.log>
2018-04-16 00:00:47,787 553ab573 MainThread INFO     PerfKitBenchmarker version: v1.12.0-489-gf0acf31
2018-04-16 00:00:47,788 553ab573 MainThread INFO     Flag values:
--beam_it_class=org.apache.beam.sdk.io.jdbc.JdbcIOIT
--beam_it_timeout=1800
--beam_sdk=java
--temp_dir=<https://builds.apache.org/job/beam_PerformanceTests_JDBC/ws/>
--maven_binary=/home/jenkins/tools/maven/latest/bin/mvn
--beam_it_options=[--tempRoot=gs://temp-storage-for-perf-tests,--project=apache-beam-testing,--postgresPort=5432,--numberOfRecords=5000000]
--beam_prebuilt
--kubeconfig=<https://builds.apache.org/job/beam_PerformanceTests_JDBC/ws/config-jdbcioit-1523822464758>
--project=apache-beam-testing
--beam_kubernetes_scripts=<https://builds.apache.org/job/beam_PerformanceTests_JDBC/ws/src/.test-infra/kubernetes/postgres/postgres-service-for-local-dev.yml>
--bigquery_table=beam_performance.jdbcioit_pkb_results
--official
--beam_it_module=sdks/java/io/jdbc
--dpb_log_level=INFO
--beam_options_config_file=<https://builds.apache.org/job/beam_PerformanceTests_JDBC/ws/src/.test-infra/kubernetes/postgres/pkb-config-local.yml>
--beam_it_profile=io-it
--benchmarks=beam_integration_benchmark
2018-04-16 00:00:48,053 553ab573 MainThread WARNING  The key "flags" was not in the default
config, but was in user overrides. This may indicate a typo.
2018-04-16 00:00:48,054 553ab573 MainThread INFO     Initializing the edw service decoder
2018-04-16 00:00:48,253 553ab573 MainThread beam_integration_benchmark(1/1) INFO     Provisioning
resources for benchmark beam_integration_benchmark
2018-04-16 00:00:48,257 553ab573 MainThread beam_integration_benchmark(1/1) INFO     Preparing
benchmark beam_integration_benchmark
2018-04-16 00:00:48,258 553ab573 MainThread beam_integration_benchmark(1/1) INFO     Running:
git clone https://github.com/apache/beam.git
2018-04-16 00:00:58,443 553ab573 MainThread beam_integration_benchmark(1/1) INFO     Running:
kubectl --kubeconfig=<https://builds.apache.org/job/beam_PerformanceTests_JDBC/ws/config-jdbcioit-1523822464758>
create -f <https://builds.apache.org/job/beam_PerformanceTests_JDBC/ws/src/.test-infra/kubernetes/postgres/postgres-service-for-local-dev.yml>
2018-04-16 00:00:58,779 553ab573 MainThread beam_integration_benchmark(1/1) INFO     Running
benchmark beam_integration_benchmark
2018-04-16 00:00:58,787 553ab573 MainThread beam_integration_benchmark(1/1) INFO     Running:
kubectl --kubeconfig=<https://builds.apache.org/job/beam_PerformanceTests_JDBC/ws/config-jdbcioit-1523822464758>
get svc postgres-for-dev -ojsonpath={.status.loadBalancer.ingress[0].ip}
2018-04-16 00:01:09,037 553ab573 MainThread beam_integration_benchmark(1/1) INFO     Running:
kubectl --kubeconfig=<https://builds.apache.org/job/beam_PerformanceTests_JDBC/ws/config-jdbcioit-1523822464758>
get svc postgres-for-dev -ojsonpath={.status.loadBalancer.ingress[0].ip}
2018-04-16 00:01:19,266 553ab573 MainThread beam_integration_benchmark(1/1) INFO     Running:
kubectl --kubeconfig=<https://builds.apache.org/job/beam_PerformanceTests_JDBC/ws/config-jdbcioit-1523822464758>
get svc postgres-for-dev -ojsonpath={.status.loadBalancer.ingress[0].ip}
2018-04-16 00:01:29,485 553ab573 MainThread beam_integration_benchmark(1/1) INFO     Running:
kubectl --kubeconfig=<https://builds.apache.org/job/beam_PerformanceTests_JDBC/ws/config-jdbcioit-1523822464758>
get svc postgres-for-dev -ojsonpath={.status.loadBalancer.ingress[0].ip}
2018-04-16 00:01:39,697 553ab573 MainThread beam_integration_benchmark(1/1) INFO     Running:
kubectl --kubeconfig=<https://builds.apache.org/job/beam_PerformanceTests_JDBC/ws/config-jdbcioit-1523822464758>
get svc postgres-for-dev -ojsonpath={.status.loadBalancer.ingress[0].ip}
2018-04-16 00:01:49,933 553ab573 MainThread beam_integration_benchmark(1/1) INFO     Running:
kubectl --kubeconfig=<https://builds.apache.org/job/beam_PerformanceTests_JDBC/ws/config-jdbcioit-1523822464758>
get svc postgres-for-dev -ojsonpath={.status.loadBalancer.ingress[0].ip}
2018-04-16 00:02:00,080 553ab573 MainThread beam_integration_benchmark(1/1) INFO     Running:
kubectl --kubeconfig=<https://builds.apache.org/job/beam_PerformanceTests_JDBC/ws/config-jdbcioit-1523822464758>
get svc postgres-for-dev -ojsonpath={.status.loadBalancer.ingress[0].ip}
2018-04-16 00:02:10,225 553ab573 MainThread beam_integration_benchmark(1/1) INFO     Running:
kubectl --kubeconfig=<https://builds.apache.org/job/beam_PerformanceTests_JDBC/ws/config-jdbcioit-1523822464758>
get svc postgres-for-dev -ojsonpath={.status.loadBalancer.ingress[0].ip}
2018-04-16 00:02:20,393 553ab573 MainThread beam_integration_benchmark(1/1) INFO     Running:
kubectl --kubeconfig=<https://builds.apache.org/job/beam_PerformanceTests_JDBC/ws/config-jdbcioit-1523822464758>
get svc postgres-for-dev -ojsonpath={.status.loadBalancer.ingress[0].ip}
2018-04-16 00:02:30,541 553ab573 MainThread beam_integration_benchmark(1/1) INFO     Running:
kubectl --kubeconfig=<https://builds.apache.org/job/beam_PerformanceTests_JDBC/ws/config-jdbcioit-1523822464758>
get svc postgres-for-dev -ojsonpath={.status.loadBalancer.ingress[0].ip}
2018-04-16 00:02:40,685 553ab573 MainThread beam_integration_benchmark(1/1) INFO     Running:
kubectl --kubeconfig=<https://builds.apache.org/job/beam_PerformanceTests_JDBC/ws/config-jdbcioit-1523822464758>
get svc postgres-for-dev -ojsonpath={.status.loadBalancer.ingress[0].ip}
2018-04-16 00:02:50,826 553ab573 MainThread beam_integration_benchmark(1/1) INFO     Running:
kubectl --kubeconfig=<https://builds.apache.org/job/beam_PerformanceTests_JDBC/ws/config-jdbcioit-1523822464758>
get svc postgres-for-dev -ojsonpath={.status.loadBalancer.ingress[0].ip}
2018-04-16 00:03:00,974 553ab573 MainThread beam_integration_benchmark(1/1) INFO     Running:
kubectl --kubeconfig=<https://builds.apache.org/job/beam_PerformanceTests_JDBC/ws/config-jdbcioit-1523822464758>
get svc postgres-for-dev -ojsonpath={.status.loadBalancer.ingress[0].ip}
2018-04-16 00:03:11,125 553ab573 MainThread beam_integration_benchmark(1/1) INFO     Running:
kubectl --kubeconfig=<https://builds.apache.org/job/beam_PerformanceTests_JDBC/ws/config-jdbcioit-1523822464758>
get svc postgres-for-dev -ojsonpath={.status.loadBalancer.ingress[0].ip}
2018-04-16 00:03:21,289 553ab573 MainThread beam_integration_benchmark(1/1) INFO     Running:
kubectl --kubeconfig=<https://builds.apache.org/job/beam_PerformanceTests_JDBC/ws/config-jdbcioit-1523822464758>
get svc postgres-for-dev -ojsonpath={.status.loadBalancer.ingress[0].ip}
2018-04-16 00:03:31,465 553ab573 MainThread beam_integration_benchmark(1/1) INFO     Running:
kubectl --kubeconfig=<https://builds.apache.org/job/beam_PerformanceTests_JDBC/ws/config-jdbcioit-1523822464758>
get svc postgres-for-dev -ojsonpath={.status.loadBalancer.ingress[0].ip}
2018-04-16 00:03:41,611 553ab573 MainThread beam_integration_benchmark(1/1) INFO     Running:
kubectl --kubeconfig=<https://builds.apache.org/job/beam_PerformanceTests_JDBC/ws/config-jdbcioit-1523822464758>
get svc postgres-for-dev -ojsonpath={.status.loadBalancer.ingress[0].ip}
2018-04-16 00:03:51,788 553ab573 MainThread beam_integration_benchmark(1/1) INFO     Running:
kubectl --kubeconfig=<https://builds.apache.org/job/beam_PerformanceTests_JDBC/ws/config-jdbcioit-1523822464758>
get svc postgres-for-dev -ojsonpath={.status.loadBalancer.ingress[0].ip}
2018-04-16 00:04:01,971 553ab573 MainThread beam_integration_benchmark(1/1) INFO     Running:
kubectl --kubeconfig=<https://builds.apache.org/job/beam_PerformanceTests_JDBC/ws/config-jdbcioit-1523822464758>
get svc postgres-for-dev -ojsonpath={.status.loadBalancer.ingress[0].ip}
2018-04-16 00:04:02,126 553ab573 MainThread beam_integration_benchmark(1/1) ERROR    Error
during benchmark beam_integration_benchmark
Traceback (most recent call last):
  File "<https://builds.apache.org/job/beam_PerformanceTests_JDBC/ws/PerfKitBenchmarker/perfkitbenchmarker/pkb.py",>
line 623, in RunBenchmark
    DoRunPhase(spec, collector, detailed_timer)
  File "<https://builds.apache.org/job/beam_PerformanceTests_JDBC/ws/PerfKitBenchmarker/perfkitbenchmarker/pkb.py",>
line 526, in DoRunPhase
    samples = spec.BenchmarkRun(spec)
  File "<https://builds.apache.org/job/beam_PerformanceTests_JDBC/ws/PerfKitBenchmarker/perfkitbenchmarker/linux_benchmarks/beam_integration_benchmark.py",>
line 148, in Run
    dynamic_pipeline_options)
  File "<https://builds.apache.org/job/beam_PerformanceTests_JDBC/ws/PerfKitBenchmarker/perfkitbenchmarker/beam_pipeline_options.py",>
line 100, in GenerateAllPipelineOptions
    EvaluateDynamicPipelineOptions(dynamic_pipeline_options))
  File "<https://builds.apache.org/job/beam_PerformanceTests_JDBC/ws/PerfKitBenchmarker/perfkitbenchmarker/beam_pipeline_options.py",>
line 67, in EvaluateDynamicPipelineOptions
    argValue = RetrieveLoadBalancerIp(optionDescriptor)
  File "<https://builds.apache.org/job/beam_PerformanceTests_JDBC/ws/PerfKitBenchmarker/perfkitbenchmarker/beam_pipeline_options.py",>
line 153, in RetrieveLoadBalancerIp
    raise "Could not retrieve LoadBalancer IP address"
TypeError: exceptions must be old-style classes or derived from BaseException, not str
2018-04-16 00:04:02,127 553ab573 MainThread beam_integration_benchmark(1/1) INFO     Cleaning
up benchmark beam_integration_benchmark
2018-04-16 00:04:02,127 553ab573 MainThread beam_integration_benchmark(1/1) INFO     Running:
kubectl --kubeconfig=<https://builds.apache.org/job/beam_PerformanceTests_JDBC/ws/config-jdbcioit-1523822464758>
delete -f <https://builds.apache.org/job/beam_PerformanceTests_JDBC/ws/src/.test-infra/kubernetes/postgres/postgres-service-for-local-dev.yml>
2018-04-16 00:04:02,427 553ab573 MainThread beam_integration_benchmark(1/1) ERROR    Exception
running benchmark
Traceback (most recent call last):
  File "<https://builds.apache.org/job/beam_PerformanceTests_JDBC/ws/PerfKitBenchmarker/perfkitbenchmarker/pkb.py",>
line 757, in RunBenchmarkTask
    RunBenchmark(spec, collector)
  File "<https://builds.apache.org/job/beam_PerformanceTests_JDBC/ws/PerfKitBenchmarker/perfkitbenchmarker/pkb.py",>
line 623, in RunBenchmark
    DoRunPhase(spec, collector, detailed_timer)
  File "<https://builds.apache.org/job/beam_PerformanceTests_JDBC/ws/PerfKitBenchmarker/perfkitbenchmarker/pkb.py",>
line 526, in DoRunPhase
    samples = spec.BenchmarkRun(spec)
  File "<https://builds.apache.org/job/beam_PerformanceTests_JDBC/ws/PerfKitBenchmarker/perfkitbenchmarker/linux_benchmarks/beam_integration_benchmark.py",>
line 148, in Run
    dynamic_pipeline_options)
  File "<https://builds.apache.org/job/beam_PerformanceTests_JDBC/ws/PerfKitBenchmarker/perfkitbenchmarker/beam_pipeline_options.py",>
line 100, in GenerateAllPipelineOptions
    EvaluateDynamicPipelineOptions(dynamic_pipeline_options))
  File "<https://builds.apache.org/job/beam_PerformanceTests_JDBC/ws/PerfKitBenchmarker/perfkitbenchmarker/beam_pipeline_options.py",>
line 67, in EvaluateDynamicPipelineOptions
    argValue = RetrieveLoadBalancerIp(optionDescriptor)
  File "<https://builds.apache.org/job/beam_PerformanceTests_JDBC/ws/PerfKitBenchmarker/perfkitbenchmarker/beam_pipeline_options.py",>
line 153, in RetrieveLoadBalancerIp
    raise "Could not retrieve LoadBalancer IP address"
TypeError: exceptions must be old-style classes or derived from BaseException, not str
2018-04-16 00:04:02,428 553ab573 MainThread beam_integration_benchmark(1/1) ERROR    Benchmark
1/1 beam_integration_benchmark (UID: beam_integration_benchmark0) failed. Execution will continue.
2018-04-16 00:04:02,440 553ab573 MainThread INFO     Benchmark run statuses:
---------------------------------------------------------------------------------
Name                        UID                          Status  Failed Substatus
---------------------------------------------------------------------------------
beam_integration_benchmark  beam_integration_benchmark0  FAILED                  
---------------------------------------------------------------------------------
Success rate: 0.00% (0/1)
2018-04-16 00:04:02,441 553ab573 MainThread INFO     Complete logs can be found at: <https://builds.apache.org/job/beam_PerformanceTests_JDBC/ws/runs/553ab573/pkb.log>
2018-04-16 00:04:02,441 553ab573 MainThread INFO     Completion statuses can be found at:
<https://builds.apache.org/job/beam_PerformanceTests_JDBC/ws/runs/553ab573/completion_statuses.json>
Build step 'Execute shell' marked build as failure

Mime
View raw message