beam-commits mailing list archives

Site index · List index
Message view « Date » · « Thread »
Top « Date » · « Thread »
From Apache Jenkins Server <jenk...@builds.apache.org>
Subject Build failed in Jenkins: beam_PerformanceTests_Python #1127
Date Tue, 10 Apr 2018 00:49:44 GMT
See <https://builds.apache.org/job/beam_PerformanceTests_Python/1127/display/redirect?page=changes>

Changes:

[daniel.o.programmer] [BEAM-3706] Removing SideInputs and Parameters from CombinePayload.

[daniel.o.programmer] [BEAM-3706] Removing side inputs from Combine translation logic.

[daniel.o.programmer] [BEAM-3706] Attempting to fix a findbug issue.

[daniel.o.programmer] [BEAM-3706] Cleaning up side input code in Flink runner.

[daniel.o.programmer] [BEAM-3706] Fixing issue in direct runner with side input combines.

[robertwb] Correctly account for keyword arguments in function calls.

[robertwb] Fix type inference for slicing.

[coheigea] Removing some null guards that are not needed

[lcwik] Get Spark validates runner streaming integration tests to use the

[lcwik] Speed up Spark post commit test run speed by running 4 tests

[lcwik] [BEAM-4014] Fix project evaluation order.

[herohde] Fix bad Gradle Go examples directory

[herohde] [BEAM-4034] Fix hooks panic with Go on Flink

[lcwik] [BEAM-4014] Fix class path for examplesJavaIntegrationTest, also fix

[robertwb] Revert "Revert #4781 which broke Python postsubmits"

[robertwb] Guard side input mutation for Fn API mode only.

[ehudm] Add grpcio-tools to gradle virtualenv.

[ehudm] Allow longs as input to Timestamp.of().

------------------------------------------
[...truncated 60.42 KB...]
[INFO] Using 'UTF-8' encoding to copy filtered resources.
[INFO] Copying 6 resources
[INFO] 
[INFO] --- maven-assembly-plugin:3.1.0:single (export-go-pkg-sources) @ beam-sdks-go ---
[INFO] Reading assembly descriptor: descriptor.xml
[INFO] Building zip: <https://builds.apache.org/job/beam_PerformanceTests_Python/ws/runs/9ccf8404/beam/sdks/go/target/beam-sdks-go-2.5.0-SNAPSHOT-pkg-sources.zip>
[INFO] 
[INFO] --- maven-remote-resources-plugin:1.5:process (process-resource-bundles) @ beam-sdks-go
---
[INFO] 
[INFO] --- mvn-golang-wrapper:2.1.6:get (go-get-imports) @ beam-sdks-go ---
[INFO] Prepared command line : bin/go get google.golang.org/grpc golang.org/x/oauth2/google
google.golang.org/api/storage/v1 github.com/spf13/cobra cloud.google.com/go/bigquery google.golang.org/api/googleapi
google.golang.org/api/dataflow/v1b3
[INFO] 
[INFO] --- mvn-golang-wrapper:2.1.6:build (go-build) @ beam-sdks-go ---
[INFO] Prepared command line : bin/go build -buildmode=default -o <https://builds.apache.org/job/beam_PerformanceTests_Python/ws/runs/9ccf8404/beam/sdks/go/target/beamctl>
github.com/apache/beam/sdks/go/cmd/beamctl
[INFO] The Result file has been successfuly created : <https://builds.apache.org/job/beam_PerformanceTests_Python/ws/runs/9ccf8404/beam/sdks/go/target/beamctl>
[INFO] 
[INFO] --- mvn-golang-wrapper:2.1.6:build (go-build-linux-amd64) @ beam-sdks-go ---
[INFO] Prepared command line : bin/go build -buildmode=default -o <https://builds.apache.org/job/beam_PerformanceTests_Python/ws/runs/9ccf8404/beam/sdks/go/target/linux_amd64/beamctl>
github.com/apache/beam/sdks/go/cmd/beamctl
[INFO] The Result file has been successfuly created : <https://builds.apache.org/job/beam_PerformanceTests_Python/ws/runs/9ccf8404/beam/sdks/go/target/linux_amd64/beamctl>
[INFO] 
[INFO] --- maven-checkstyle-plugin:3.0.0:check (default) @ beam-sdks-go ---
[INFO] 
[INFO] --- mvn-golang-wrapper:2.1.6:test (go-test) @ beam-sdks-go ---
[INFO] Prepared command line : bin/go test ./...
[INFO] 
[INFO] ---------Exec.Out---------
[INFO] ?   	github.com/apache/beam/sdks/go/cmd/beamctl	[no test files]
[INFO] ?   	github.com/apache/beam/sdks/go/cmd/beamctl/cmd	[no test files]
[INFO] ?   	github.com/apache/beam/sdks/go/cmd/specialize	[no test files]
[INFO] ?   	github.com/apache/beam/sdks/go/cmd/symtab	[no test files]
[INFO] ok  	github.com/apache/beam/sdks/go/pkg/beam	0.043s
[INFO] ok  	github.com/apache/beam/sdks/go/pkg/beam/artifact	0.118s
[INFO] 
[ERROR] 
[ERROR] ---------Exec.Err---------
[ERROR] # github.com/apache/beam/sdks/go/pkg/beam/util/gcsx
[ERROR] github.com/apache/beam/sdks/go/pkg/beam/util/gcsx/gcs.go:46:37: undefined: option.WithoutAuthentication
[ERROR] 
[INFO] ------------------------------------------------------------------------
[INFO] Reactor Summary:
[INFO] 
[INFO] Apache Beam :: Parent .............................. SUCCESS [  3.807 s]
[INFO] Apache Beam :: SDKs :: Java :: Build Tools ......... SUCCESS [  3.319 s]
[INFO] Apache Beam :: Model ............................... SUCCESS [  0.086 s]
[INFO] Apache Beam :: Model :: Pipeline ................... SUCCESS [ 10.720 s]
[INFO] Apache Beam :: Model :: Job Management ............. SUCCESS [  3.722 s]
[INFO] Apache Beam :: Model :: Fn Execution ............... SUCCESS [  4.704 s]
[INFO] Apache Beam :: SDKs ................................ SUCCESS [  0.155 s]
[INFO] Apache Beam :: SDKs :: Go .......................... FAILURE [ 33.878 s]
[INFO] Apache Beam :: SDKs :: Go :: Container ............. SKIPPED
[INFO] Apache Beam :: SDKs :: Java ........................ SKIPPED
[INFO] Apache Beam :: SDKs :: Java :: Core ................ SKIPPED
[INFO] Apache Beam :: SDKs :: Java :: Fn Execution ........ SKIPPED
[INFO] Apache Beam :: SDKs :: Java :: Extensions .......... SKIPPED
[INFO] Apache Beam :: SDKs :: Java :: Extensions :: Google Cloud Platform Core SKIPPED
[INFO] Apache Beam :: Runners ............................. SKIPPED
[INFO] Apache Beam :: Runners :: Core Construction Java ... SKIPPED
[INFO] Apache Beam :: Runners :: Core Java ................ SKIPPED
[INFO] Apache Beam :: SDKs :: Java :: Harness ............. SKIPPED
[INFO] Apache Beam :: SDKs :: Java :: Container ........... SKIPPED
[INFO] Apache Beam :: SDKs :: Java :: IO .................. SKIPPED
[INFO] Apache Beam :: SDKs :: Java :: IO :: Amazon Web Services SKIPPED
[INFO] Apache Beam :: Runners :: Local Java Core .......... SKIPPED
[INFO] Apache Beam :: Runners :: Direct Java .............. SKIPPED
[INFO] Apache Beam :: SDKs :: Java :: IO :: AMQP .......... SKIPPED
[INFO] Apache Beam :: SDKs :: Java :: IO :: Common ........ SKIPPED
[INFO] Apache Beam :: SDKs :: Java :: IO :: Cassandra ..... SKIPPED
[INFO] Apache Beam :: SDKs :: Java :: IO :: Elasticsearch . SKIPPED
[INFO] Apache Beam :: SDKs :: Java :: IO :: Elasticsearch-Tests SKIPPED
[INFO] Apache Beam :: SDKs :: Java :: IO :: Elasticsearch-Tests :: Common SKIPPED
[INFO] Apache Beam :: SDKs :: Java :: IO :: Elasticsearch-Tests :: 2.x SKIPPED
[INFO] Apache Beam :: SDKs :: Java :: IO :: Elasticsearch-Tests :: 5.x SKIPPED
[INFO] Apache Beam :: SDKs :: Java :: IO :: XML ........... SKIPPED
[INFO] Apache Beam :: SDKs :: Java :: Extensions :: Protobuf SKIPPED
[INFO] Apache Beam :: SDKs :: Java :: IO :: Google Cloud Platform SKIPPED
[INFO] Apache Beam :: Runners :: Google Cloud Dataflow .... SKIPPED
[INFO] Apache Beam :: SDKs :: Java :: IO :: File-based-io-tests SKIPPED
[INFO] Apache Beam :: SDKs :: Java :: IO :: Hadoop Common . SKIPPED
[INFO] Apache Beam :: SDKs :: Java :: IO :: Hadoop File System SKIPPED
[INFO] Apache Beam :: SDKs :: Java :: IO :: JDBC .......... SKIPPED
[INFO] Apache Beam :: SDKs :: Java :: IO :: Hadoop Input Format SKIPPED
[INFO] Apache Beam :: SDKs :: Java :: IO :: HBase ......... SKIPPED
[INFO] Apache Beam :: SDKs :: Java :: IO :: HCatalog ...... SKIPPED
[INFO] Apache Beam :: SDKs :: Java :: IO :: JMS ........... SKIPPED
[INFO] Apache Beam :: SDKs :: Java :: IO :: Kafka ......... SKIPPED
[INFO] Apache Beam :: SDKs :: Java :: IO :: Kinesis ....... SKIPPED
[INFO] Apache Beam :: SDKs :: Java :: IO :: MongoDB ....... SKIPPED
[INFO] Apache Beam :: SDKs :: Java :: IO :: MQTT .......... SKIPPED
[INFO] Apache Beam :: SDKs :: Java :: IO :: Redis ......... SKIPPED
[INFO] Apache Beam :: SDKs :: Java :: IO :: Solr .......... SKIPPED
[INFO] Apache Beam :: SDKs :: Java :: IO :: Tika .......... SKIPPED
[INFO] Apache Beam :: SDKs :: Java :: Maven Archetypes .... SKIPPED
[INFO] Apache Beam :: SDKs :: Java :: Maven Archetypes :: Starter SKIPPED
[INFO] Apache Beam :: Examples ............................ SKIPPED
[INFO] Apache Beam :: Examples :: Java .................... SKIPPED
[INFO] Apache Beam :: SDKs :: Java :: Maven Archetypes :: Examples SKIPPED
[INFO] Apache Beam :: SDKs :: Java :: Extensions :: Jackson SKIPPED
[INFO] Apache Beam :: SDKs :: Java :: Extensions :: Join library SKIPPED
[INFO] Apache Beam :: SDKs :: Java :: Extensions :: Sketching SKIPPED
[INFO] Apache Beam :: SDKs :: Java :: Extensions :: Sorter  SKIPPED
[INFO] Apache Beam :: SDKs :: Java :: Extensions :: SQL ... SKIPPED
[INFO] Apache Beam :: SDKs :: Java :: Nexmark ............. SKIPPED
[INFO] Apache Beam :: SDKs :: Python ...................... SKIPPED
[INFO] Apache Beam :: SDKs :: Python :: Container ......... SKIPPED
[INFO] Apache Beam :: Runners :: Java Fn Execution ........ SKIPPED
[INFO] Apache Beam :: Runners :: Java Local Artifact Service SKIPPED
[INFO] Apache Beam :: Runners :: Reference ................ SKIPPED
[INFO] Apache Beam :: Runners :: Reference :: Java ........ SKIPPED
[INFO] Apache Beam :: Runners :: Reference :: Job Orchestrator SKIPPED
[INFO] Apache Beam :: Runners :: Flink .................... SKIPPED
[INFO] Apache Beam :: Runners :: Gearpump ................. SKIPPED
[INFO] Apache Beam :: Runners :: Spark .................... SKIPPED
[INFO] Apache Beam :: Runners :: Apex ..................... SKIPPED
[INFO] Apache Beam :: Runners :: Google Cloud Platform .... SKIPPED
[INFO] Apache Beam :: Runners :: Google Cloud Platform :: GCE metadata provisioning SKIPPED
[INFO] Apache Beam :: Runners :: Google Cloud Platform :: GCS artifact proxy SKIPPED
[INFO] Apache Beam :: SDKs :: Java :: Aggregated Javadoc .. SKIPPED
[INFO] ------------------------------------------------------------------------
[INFO] BUILD FAILURE
[INFO] ------------------------------------------------------------------------
[INFO] Total time: 01:03 min
[INFO] Finished at: 2018-04-10T00:49:36Z
[INFO] Final Memory: 85M/1167M
[INFO] ------------------------------------------------------------------------
[ERROR] Failed to execute goal com.igormaznitsa:mvn-golang-wrapper:2.1.6:test (go-test) on
project beam-sdks-go: Process exit code : 2 -> [Help 1]
[ERROR] 
[ERROR] To see the full stack trace of the errors, re-run Maven with the -e switch.
[ERROR] Re-run Maven using the -X switch to enable full debug logging.
[ERROR] 
[ERROR] For more information about the errors and possible solutions, please read the following
articles:
[ERROR] [Help 1] http://cwiki.apache.org/confluence/display/MAVEN/MojoFailureException
[ERROR] 
[ERROR] After correcting the problems, you can resume the build with the command
[ERROR]   mvn <goals> -rf :beam-sdks-go

STDERR: 
2018-04-10 00:49:36,742 9ccf8404 MainThread beam_integration_benchmark(1/1) INFO     Running
benchmark beam_integration_benchmark
2018-04-10 00:49:36,749 9ccf8404 MainThread beam_integration_benchmark(1/1) ERROR    Error
during benchmark beam_integration_benchmark
Traceback (most recent call last):
  File "<https://builds.apache.org/job/beam_PerformanceTests_Python/ws/PerfKitBenchmarker/perfkitbenchmarker/pkb.py",>
line 624, in RunBenchmark
    DoRunPhase(spec, collector, detailed_timer)
  File "<https://builds.apache.org/job/beam_PerformanceTests_Python/ws/PerfKitBenchmarker/perfkitbenchmarker/pkb.py",>
line 527, in DoRunPhase
    samples = spec.BenchmarkRun(spec)
  File "<https://builds.apache.org/job/beam_PerformanceTests_Python/ws/PerfKitBenchmarker/perfkitbenchmarker/linux_benchmarks/beam_integration_benchmark.py",>
line 159, in Run
    job_type=job_type)
  File "<https://builds.apache.org/job/beam_PerformanceTests_Python/ws/PerfKitBenchmarker/perfkitbenchmarker/providers/gcp/gcp_dpb_dataflow.py",>
line 87, in SubmitJob
    self.spec, classname, job_arguments)
  File "<https://builds.apache.org/job/beam_PerformanceTests_Python/ws/PerfKitBenchmarker/perfkitbenchmarker/beam_benchmark_helper.py",>
line 175, in BuildBeamCommand
    cmd = _BuildPythonCommand(benchmark_spec, classname, job_arguments)
  File "<https://builds.apache.org/job/beam_PerformanceTests_Python/ws/PerfKitBenchmarker/perfkitbenchmarker/beam_benchmark_helper.py",>
line 265, in _BuildPythonCommand
    'apache-beam*.tar.gz')
  File "<https://builds.apache.org/job/beam_PerformanceTests_Python/ws/PerfKitBenchmarker/perfkitbenchmarker/beam_benchmark_helper.py",>
line 290, in _FindFiles
    raise RuntimeError('No such directory: %s' % base_path)
RuntimeError: No such directory: <https://builds.apache.org/job/beam_PerformanceTests_Python/ws/runs/9ccf8404/beam/sdks/python/target>
2018-04-10 00:49:36,751 9ccf8404 MainThread beam_integration_benchmark(1/1) INFO     Cleaning
up benchmark beam_integration_benchmark
2018-04-10 00:49:36,752 9ccf8404 MainThread beam_integration_benchmark(1/1) ERROR    Exception
running benchmark
Traceback (most recent call last):
  File "<https://builds.apache.org/job/beam_PerformanceTests_Python/ws/PerfKitBenchmarker/perfkitbenchmarker/pkb.py",>
line 758, in RunBenchmarkTask
    RunBenchmark(spec, collector)
  File "<https://builds.apache.org/job/beam_PerformanceTests_Python/ws/PerfKitBenchmarker/perfkitbenchmarker/pkb.py",>
line 624, in RunBenchmark
    DoRunPhase(spec, collector, detailed_timer)
  File "<https://builds.apache.org/job/beam_PerformanceTests_Python/ws/PerfKitBenchmarker/perfkitbenchmarker/pkb.py",>
line 527, in DoRunPhase
    samples = spec.BenchmarkRun(spec)
  File "<https://builds.apache.org/job/beam_PerformanceTests_Python/ws/PerfKitBenchmarker/perfkitbenchmarker/linux_benchmarks/beam_integration_benchmark.py",>
line 159, in Run
    job_type=job_type)
  File "<https://builds.apache.org/job/beam_PerformanceTests_Python/ws/PerfKitBenchmarker/perfkitbenchmarker/providers/gcp/gcp_dpb_dataflow.py",>
line 87, in SubmitJob
    self.spec, classname, job_arguments)
  File "<https://builds.apache.org/job/beam_PerformanceTests_Python/ws/PerfKitBenchmarker/perfkitbenchmarker/beam_benchmark_helper.py",>
line 175, in BuildBeamCommand
    cmd = _BuildPythonCommand(benchmark_spec, classname, job_arguments)
  File "<https://builds.apache.org/job/beam_PerformanceTests_Python/ws/PerfKitBenchmarker/perfkitbenchmarker/beam_benchmark_helper.py",>
line 265, in _BuildPythonCommand
    'apache-beam*.tar.gz')
  File "<https://builds.apache.org/job/beam_PerformanceTests_Python/ws/PerfKitBenchmarker/perfkitbenchmarker/beam_benchmark_helper.py",>
line 290, in _FindFiles
    raise RuntimeError('No such directory: %s' % base_path)
RuntimeError: No such directory: <https://builds.apache.org/job/beam_PerformanceTests_Python/ws/runs/9ccf8404/beam/sdks/python/target>
2018-04-10 00:49:36,753 9ccf8404 MainThread beam_integration_benchmark(1/1) ERROR    Benchmark
1/1 beam_integration_benchmark (UID: beam_integration_benchmark0) failed. Execution will continue.
2018-04-10 00:49:36,763 9ccf8404 MainThread INFO     Benchmark run statuses:
---------------------------------------------------------------------------------
Name                        UID                          Status  Failed Substatus
---------------------------------------------------------------------------------
beam_integration_benchmark  beam_integration_benchmark0  FAILED                  
---------------------------------------------------------------------------------
Success rate: 0.00% (0/1)
2018-04-10 00:49:36,764 9ccf8404 MainThread INFO     Complete logs can be found at: <https://builds.apache.org/job/beam_PerformanceTests_Python/ws/runs/9ccf8404/pkb.log>
2018-04-10 00:49:36,764 9ccf8404 MainThread INFO     Completion statuses can be found at:
<https://builds.apache.org/job/beam_PerformanceTests_Python/ws/runs/9ccf8404/completion_statuses.json>
Build step 'Execute shell' marked build as failure
Not sending mail to unregistered user aljoscha.krettek@gmail.com
Not sending mail to unregistered user swegner@google.com
Not sending mail to unregistered user ehudm@google.com
Not sending mail to unregistered user rober@frantil.com
Not sending mail to unregistered user wtanaka@yahoo.com
Not sending mail to unregistered user daniel.o.programmer@gmail.com
Not sending mail to unregistered user ankurgoenka@gmail.com
Not sending mail to unregistered user dawid@getindata.com
Not sending mail to unregistered user pawel.pk.kaczmarczyk@gmail.com
Not sending mail to unregistered user fjetumale@gmail.com
Not sending mail to unregistered user mariagh@mariagh.svl.corp.google.com
Not sending mail to unregistered user xumingmingv@gmail.com
Not sending mail to unregistered user andreas.ehrencrona@velik.it
Not sending mail to unregistered user abhyankar@gmail.com
Not sending mail to unregistered user 1028332163@qq.com
Not sending mail to unregistered user mariand@google.com
Not sending mail to unregistered user alan.myrvold@comcast.net
Not sending mail to unregistered user arnaudfournier921@gmail.com
Not sending mail to unregistered user swegner2@gmail.com
Not sending mail to unregistered user wcn@google.com
Not sending mail to unregistered user luke_zhu@brown.edu
Not sending mail to unregistered user arostami@google.com
Not sending mail to unregistered user batbat@batbat-linuxworkstation.sea.corp.google.com
Not sending mail to unregistered user arnaudfournier021@gmail.com
Not sending mail to unregistered user axelmagn@gmail.com
Not sending mail to unregistered user robert@frantil.com
Not sending mail to unregistered user melissapa@google.com
Not sending mail to unregistered user holdenkarau@google.com
Not sending mail to unregistered user zoy@giggles.nyc.corp.google.com
Not sending mail to unregistered user samuel.waggoner@healthsparq.com
Not sending mail to unregistered user jiangkai@gmail.com
Not sending mail to unregistered user sidhom@google.com
Not sending mail to unregistered user yifanzou@yifanzou-linuxworkstation.sea.corp.google.com
Not sending mail to unregistered user lukasz.gajowy@polidea.com
Not sending mail to unregistered user kedin@google.com
Not sending mail to unregistered user relax@relax-macbookpro2.roam.corp.google.com
Not sending mail to unregistered user ccy@google.com
Not sending mail to unregistered user klk@google.com
Not sending mail to unregistered user gene@telligent-data.com
Not sending mail to unregistered user cclauss@bluewin.ch
Not sending mail to unregistered user herohde@google.com
Not sending mail to unregistered user apilloud@google.com
Not sending mail to unregistered user samuelw@google.com
Not sending mail to unregistered user dariusz.aniszewski@polidea.com
Not sending mail to unregistered user github@alasdairhodge.co.uk
Not sending mail to unregistered user Mottyg1@gmail.com
Not sending mail to unregistered user willy@bounceexchange.com
Not sending mail to unregistered user aaltay@gmail.com
Not sending mail to unregistered user boyuanz@google.com
Not sending mail to unregistered user ekirpichov@gmail.com
Not sending mail to unregistered user zhouhai02@meituan.com
Not sending mail to unregistered user niemo@google.com
Not sending mail to unregistered user amyrvold@google.com
Not sending mail to unregistered user mairbek@google.com
Not sending mail to unregistered user jb@nanthrax.net
Not sending mail to unregistered user sduskis@google.com
Not sending mail to unregistered user joey.baruch@gmail.com
Not sending mail to unregistered user XuMingmin@users.noreply.github.com
Not sending mail to unregistered user markliu@google.com
Not sending mail to unregistered user szewinho@gmail.com
Not sending mail to unregistered user dcavazos@google.com
Not sending mail to unregistered user grzegorz.kolakowski@getindata.com
Not sending mail to unregistered user kirpichov@google.com
Not sending mail to unregistered user aromanenko.dev@gmail.com

Mime
View raw message