beam-commits mailing list archives

Site index · List index
Message view « Date » · « Thread »
Top « Date » · « Thread »
From Apache Jenkins Server <jenk...@builds.apache.org>
Subject Build failed in Jenkins: beam_PostCommit_Java_ValidatesRunner_Spark_Gradle #109
Date Mon, 16 Apr 2018 22:39:08 GMT
See <https://builds.apache.org/job/beam_PostCommit_Java_ValidatesRunner_Spark_Gradle/109/display/redirect>

------------------------------------------
[...truncated 1.24 MB...]
    	at org.apache.spark.streaming.api.java.JavaStreamingContext$$anonfun$7.apply(JavaStreamingContext.scala:627)
    	at org.apache.spark.streaming.api.java.JavaStreamingContext$$anonfun$7.apply(JavaStreamingContext.scala:626)
    	at scala.Option.getOrElse(Option.scala:121)
    	at org.apache.spark.streaming.StreamingContext$.getOrCreate(StreamingContext.scala:828)
    	at org.apache.spark.streaming.api.java.JavaStreamingContext$.getOrCreate(JavaStreamingContext.scala:626)
    	at org.apache.spark.streaming.api.java.JavaStreamingContext.getOrCreate(JavaStreamingContext.scala)
    	at org.apache.beam.runners.spark.SparkRunner.run(SparkRunner.java:169)
    	at org.apache.beam.runners.spark.TestSparkRunner.run(TestSparkRunner.java:123)
    	at org.apache.beam.runners.spark.TestSparkRunner.run(TestSparkRunner.java:83)
    	at org.apache.beam.sdk.Pipeline.run(Pipeline.java:311)
    	at org.apache.beam.sdk.testing.TestPipeline.run(TestPipeline.java:346)
    	at org.apache.beam.sdk.testing.TestPipeline.run(TestPipeline.java:328)
    	at org.apache.beam.runners.spark.translation.streaming.CreateStreamTest.testFirstElementLate(CreateStreamTest.java:240)
    	at sun.reflect.NativeMethodAccessorImpl.invoke0(Native Method)
    	at sun.reflect.NativeMethodAccessorImpl.invoke(NativeMethodAccessorImpl.java:62)
    	at sun.reflect.DelegatingMethodAccessorImpl.invoke(DelegatingMethodAccessorImpl.java:43)
    	at java.lang.reflect.Method.invoke(Method.java:498)
    	at org.junit.runners.model.FrameworkMethod$1.runReflectiveCall(FrameworkMethod.java:50)
    	at org.junit.internal.runners.model.ReflectiveCallable.run(ReflectiveCallable.java:12)
    	at org.junit.runners.model.FrameworkMethod.invokeExplosively(FrameworkMethod.java:47)
    	at org.junit.internal.runners.statements.InvokeMethod.evaluate(InvokeMethod.java:17)
    	at org.junit.rules.ExternalResource$1.evaluate(ExternalResource.java:48)
    	at org.apache.beam.sdk.testing.TestPipeline$1.evaluate(TestPipeline.java:317)
    	at org.junit.rules.ExpectedException$ExpectedExceptionStatement.evaluate(ExpectedException.java:239)
    	at org.junit.rules.RunRules.evaluate(RunRules.java:20)
    	at org.junit.runners.ParentRunner.runLeaf(ParentRunner.java:325)
    	at org.junit.runners.BlockJUnit4ClassRunner.runChild(BlockJUnit4ClassRunner.java:78)
    	at org.junit.runners.BlockJUnit4ClassRunner.runChild(BlockJUnit4ClassRunner.java:57)
    	at org.junit.runners.ParentRunner$3.run(ParentRunner.java:290)
    	at org.junit.runners.ParentRunner$1.schedule(ParentRunner.java:71)
    	at org.junit.runners.ParentRunner.runChildren(ParentRunner.java:288)
    	at org.junit.runners.ParentRunner.access$000(ParentRunner.java:58)
    	at org.junit.runners.ParentRunner$2.evaluate(ParentRunner.java:268)
    	at org.junit.runners.ParentRunner.run(ParentRunner.java:363)
    	at org.gradle.api.internal.tasks.testing.junit.JUnitTestClassExecuter.runTestClass(JUnitTestClassExecuter.java:114)
    	at org.gradle.api.internal.tasks.testing.junit.JUnitTestClassExecuter.execute(JUnitTestClassExecuter.java:57)
    	at org.gradle.api.internal.tasks.testing.junit.JUnitTestClassProcessor.processTestClass(JUnitTestClassProcessor.java:66)
    	at org.gradle.api.internal.tasks.testing.SuiteTestClassProcessor.processTestClass(SuiteTestClassProcessor.java:51)
    	at sun.reflect.NativeMethodAccessorImpl.invoke0(Native Method)
    	at sun.reflect.NativeMethodAccessorImpl.invoke(NativeMethodAccessorImpl.java:62)
    	at sun.reflect.DelegatingMethodAccessorImpl.invoke(DelegatingMethodAccessorImpl.java:43)
    	at java.lang.reflect.Method.invoke(Method.java:498)
    	at org.gradle.internal.dispatch.ReflectionDispatch.dispatch(ReflectionDispatch.java:35)
    	at org.gradle.internal.dispatch.ReflectionDispatch.dispatch(ReflectionDispatch.java:24)
    	at org.gradle.internal.dispatch.ContextClassLoaderDispatch.dispatch(ContextClassLoaderDispatch.java:32)
    	at org.gradle.internal.dispatch.ProxyDispatchAdapter$DispatchingInvocationHandler.invoke(ProxyDispatchAdapter.java:93)
    	at com.sun.proxy.$Proxy3.processTestClass(Unknown Source)
    	at org.gradle.api.internal.tasks.testing.worker.TestWorker.processTestClass(TestWorker.java:108)
    	at sun.reflect.NativeMethodAccessorImpl.invoke0(Native Method)
    	at sun.reflect.NativeMethodAccessorImpl.invoke(NativeMethodAccessorImpl.java:62)
    	at sun.reflect.DelegatingMethodAccessorImpl.invoke(DelegatingMethodAccessorImpl.java:43)
    	at java.lang.reflect.Method.invoke(Method.java:498)
    	at org.gradle.internal.dispatch.ReflectionDispatch.dispatch(ReflectionDispatch.java:35)
    	at org.gradle.internal.dispatch.ReflectionDispatch.dispatch(ReflectionDispatch.java:24)
    	at org.gradle.internal.remote.internal.hub.MessageHubBackedObjectConnection$DispatchWrapper.dispatch(MessageHubBackedObjectConnection.java:146)
    	at org.gradle.internal.remote.internal.hub.MessageHubBackedObjectConnection$DispatchWrapper.dispatch(MessageHubBackedObjectConnection.java:128)
    	at org.gradle.internal.remote.internal.hub.MessageHub$Handler.run(MessageHub.java:404)
    	at org.gradle.internal.concurrent.ExecutorPolicy$CatchAndRecordFailures.onExecute(ExecutorPolicy.java:63)
    	at org.gradle.internal.concurrent.ManagedExecutorImpl$1.run(ManagedExecutorImpl.java:46)
    	at java.util.concurrent.ThreadPoolExecutor.runWorker(ThreadPoolExecutor.java:1149)
    	at java.util.concurrent.ThreadPoolExecutor$Worker.run(ThreadPoolExecutor.java:624)
    	at org.gradle.internal.concurrent.ThreadFactoryImpl$ManagedThreadRunnable.run(ThreadFactoryImpl.java:55)
    	at java.lang.Thread.run(Thread.java:748)

org.apache.beam.runners.spark.translation.streaming.CreateStreamTest > testDiscardingMode
STANDARD_ERROR
    2018-04-16 22:38:39,746 [Test worker] INFO  org.apache.beam.runners.spark.TestSparkRunner
 - About to run test pipeline createstreamtest0testdiscardingmode-jenkins-0416223839-ac6ee240
    2018-04-16 22:38:40,078 [Test worker] ERROR org.apache.spark.SparkContext  - Failed to
add <https://builds.apache.org/job/beam_PostCommit_Java_ValidatesRunner_Spark_Gradle/ws/src/runners/core-java/build/classes/java/test>
to Spark environment
    java.lang.IllegalArgumentException: Directory <https://builds.apache.org/job/beam_PostCommit_Java_ValidatesRunner_Spark_Gradle/ws/src/runners/core-java/build/classes/java/test>
is not allowed for addJar
    	at org.apache.spark.SparkContext.addJarFile$1(SparkContext.scala:1810)
    	at org.apache.spark.SparkContext.addJar(SparkContext.scala:1835)
    	at org.apache.spark.SparkContext$$anonfun$12.apply(SparkContext.scala:457)
    	at org.apache.spark.SparkContext$$anonfun$12.apply(SparkContext.scala:457)
    	at scala.collection.immutable.List.foreach(List.scala:392)
    	at org.apache.spark.SparkContext.<init>(SparkContext.scala:457)
    	at org.apache.spark.api.java.JavaSparkContext.<init>(JavaSparkContext.scala:58)
    	at org.apache.beam.runners.spark.translation.SparkContextFactory.createSparkContext(SparkContextFactory.java:103)
    	at org.apache.beam.runners.spark.translation.SparkContextFactory.getSparkContext(SparkContextFactory.java:68)
    	at org.apache.beam.runners.spark.translation.streaming.SparkRunnerStreamingContextFactory.call(SparkRunnerStreamingContextFactory.java:79)
    	at org.apache.beam.runners.spark.translation.streaming.SparkRunnerStreamingContextFactory.call(SparkRunnerStreamingContextFactory.java:47)
    	at org.apache.spark.streaming.api.java.JavaStreamingContext$$anonfun$7.apply(JavaStreamingContext.scala:627)
    	at org.apache.spark.streaming.api.java.JavaStreamingContext$$anonfun$7.apply(JavaStreamingContext.scala:626)
    	at scala.Option.getOrElse(Option.scala:121)
    	at org.apache.spark.streaming.StreamingContext$.getOrCreate(StreamingContext.scala:828)
    	at org.apache.spark.streaming.api.java.JavaStreamingContext$.getOrCreate(JavaStreamingContext.scala:626)
    	at org.apache.spark.streaming.api.java.JavaStreamingContext.getOrCreate(JavaStreamingContext.scala)
    	at org.apache.beam.runners.spark.SparkRunner.run(SparkRunner.java:169)
    	at org.apache.beam.runners.spark.TestSparkRunner.run(TestSparkRunner.java:123)
    	at org.apache.beam.runners.spark.TestSparkRunner.run(TestSparkRunner.java:83)
    	at org.apache.beam.sdk.Pipeline.run(Pipeline.java:311)
    	at org.apache.beam.sdk.testing.TestPipeline.run(TestPipeline.java:346)
    	at org.apache.beam.sdk.testing.TestPipeline.run(TestPipeline.java:328)
    	at org.apache.beam.runners.spark.translation.streaming.CreateStreamTest.testDiscardingMode(CreateStreamTest.java:203)
    	at sun.reflect.NativeMethodAccessorImpl.invoke0(Native Method)
    	at sun.reflect.NativeMethodAccessorImpl.invoke(NativeMethodAccessorImpl.java:62)
    	at sun.reflect.DelegatingMethodAccessorImpl.invoke(DelegatingMethodAccessorImpl.java:43)
    	at java.lang.reflect.Method.invoke(Method.java:498)
    	at org.junit.runners.model.FrameworkMethod$1.runReflectiveCall(FrameworkMethod.java:50)
    	at org.junit.internal.runners.model.ReflectiveCallable.run(ReflectiveCallable.java:12)
    	at org.junit.runners.model.FrameworkMethod.invokeExplosively(FrameworkMethod.java:47)
    	at org.junit.internal.runners.statements.InvokeMethod.evaluate(InvokeMethod.java:17)
    	at org.junit.rules.ExternalResource$1.evaluate(ExternalResource.java:48)
    	at org.apache.beam.sdk.testing.TestPipeline$1.evaluate(TestPipeline.java:317)
    	at org.junit.rules.ExpectedException$ExpectedExceptionStatement.evaluate(ExpectedException.java:239)
    	at org.junit.rules.RunRules.evaluate(RunRules.java:20)
    	at org.junit.runners.ParentRunner.runLeaf(ParentRunner.java:325)
    	at org.junit.runners.BlockJUnit4ClassRunner.runChild(BlockJUnit4ClassRunner.java:78)
    	at org.junit.runners.BlockJUnit4ClassRunner.runChild(BlockJUnit4ClassRunner.java:57)
    	at org.junit.runners.ParentRunner$3.run(ParentRunner.java:290)
    	at org.junit.runners.ParentRunner$1.schedule(ParentRunner.java:71)
    	at org.junit.runners.ParentRunner.runChildren(ParentRunner.java:288)
    	at org.junit.runners.ParentRunner.access$000(ParentRunner.java:58)
    	at org.junit.runners.ParentRunner$2.evaluate(ParentRunner.java:268)
    	at org.junit.runners.ParentRunner.run(ParentRunner.java:363)
    	at org.gradle.api.internal.tasks.testing.junit.JUnitTestClassExecuter.runTestClass(JUnitTestClassExecuter.java:114)
    	at org.gradle.api.internal.tasks.testing.junit.JUnitTestClassExecuter.execute(JUnitTestClassExecuter.java:57)
    	at org.gradle.api.internal.tasks.testing.junit.JUnitTestClassProcessor.processTestClass(JUnitTestClassProcessor.java:66)
    	at org.gradle.api.internal.tasks.testing.SuiteTestClassProcessor.processTestClass(SuiteTestClassProcessor.java:51)
    	at sun.reflect.NativeMethodAccessorImpl.invoke0(Native Method)
    	at sun.reflect.NativeMethodAccessorImpl.invoke(NativeMethodAccessorImpl.java:62)
    	at sun.reflect.DelegatingMethodAccessorImpl.invoke(DelegatingMethodAccessorImpl.java:43)
    	at java.lang.reflect.Method.invoke(Method.java:498)
    	at org.gradle.internal.dispatch.ReflectionDispatch.dispatch(ReflectionDispatch.java:35)
    	at org.gradle.internal.dispatch.ReflectionDispatch.dispatch(ReflectionDispatch.java:24)
    	at org.gradle.internal.dispatch.ContextClassLoaderDispatch.dispatch(ContextClassLoaderDispatch.java:32)
    	at org.gradle.internal.dispatch.ProxyDispatchAdapter$DispatchingInvocationHandler.invoke(ProxyDispatchAdapter.java:93)
    	at com.sun.proxy.$Proxy3.processTestClass(Unknown Source)
    	at org.gradle.api.internal.tasks.testing.worker.TestWorker.processTestClass(TestWorker.java:108)
    	at sun.reflect.NativeMethodAccessorImpl.invoke0(Native Method)
    	at sun.reflect.NativeMethodAccessorImpl.invoke(NativeMethodAccessorImpl.java:62)
    	at sun.reflect.DelegatingMethodAccessorImpl.invoke(DelegatingMethodAccessorImpl.java:43)
    	at java.lang.reflect.Method.invoke(Method.java:498)
    	at org.gradle.internal.dispatch.ReflectionDispatch.dispatch(ReflectionDispatch.java:35)
    	at org.gradle.internal.dispatch.ReflectionDispatch.dispatch(ReflectionDispatch.java:24)
    	at org.gradle.internal.remote.internal.hub.MessageHubBackedObjectConnection$DispatchWrapper.dispatch(MessageHubBackedObjectConnection.java:146)
    	at org.gradle.internal.remote.internal.hub.MessageHubBackedObjectConnection$DispatchWrapper.dispatch(MessageHubBackedObjectConnection.java:128)
    	at org.gradle.internal.remote.internal.hub.MessageHub$Handler.run(MessageHub.java:404)
    	at org.gradle.internal.concurrent.ExecutorPolicy$CatchAndRecordFailures.onExecute(ExecutorPolicy.java:63)
    	at org.gradle.internal.concurrent.ManagedExecutorImpl$1.run(ManagedExecutorImpl.java:46)
    	at java.util.concurrent.ThreadPoolExecutor.runWorker(ThreadPoolExecutor.java:1149)
    	at java.util.concurrent.ThreadPoolExecutor$Worker.run(ThreadPoolExecutor.java:624)
    	at org.gradle.internal.concurrent.ThreadFactoryImpl$ManagedThreadRunnable.run(ThreadFactoryImpl.java:55)
    	at java.lang.Thread.run(Thread.java:748)
    2018-04-16 22:38:40,082 [Test worker] ERROR org.apache.spark.SparkContext  - Failed to
add <https://builds.apache.org/job/beam_PostCommit_Java_ValidatesRunner_Spark_Gradle/ws/src/runners/core-java/build/resources/test>
to Spark environment
    java.io.FileNotFoundException: Jar <https://builds.apache.org/job/beam_PostCommit_Java_ValidatesRunner_Spark_Gradle/ws/src/runners/core-java/build/resources/test>
not found
    	at org.apache.spark.SparkContext.addJarFile$1(SparkContext.scala:1807)
    	at org.apache.spark.SparkContext.addJar(SparkContext.scala:1835)
    	at org.apache.spark.SparkContext$$anonfun$12.apply(SparkContext.scala:457)
    	at org.apache.spark.SparkContext$$anonfun$12.apply(SparkContext.scala:457)
    	at scala.collection.immutable.List.foreach(List.scala:392)
    	at org.apache.spark.SparkContext.<init>(SparkContext.scala:457)
    	at org.apache.spark.api.java.JavaSparkContext.<init>(JavaSparkContext.scala:58)
    	at org.apache.beam.runners.spark.translation.SparkContextFactory.createSparkContext(SparkContextFactory.java:103)
    	at org.apache.beam.runners.spark.translation.SparkContextFactory.getSparkContext(SparkContextFactory.java:68)
    	at org.apache.beam.runners.spark.translation.streaming.SparkRunnerStreamingContextFactory.call(SparkRunnerStreamingContextFactory.java:79)
    	at org.apache.beam.runners.spark.translation.streaming.SparkRunnerStreamingContextFactory.call(SparkRunnerStreamingContextFactory.java:47)
    	at org.apache.spark.streaming.api.java.JavaStreamingContext$$anonfun$7.apply(JavaStreamingContext.scala:627)
    	at org.apache.spark.streaming.api.java.JavaStreamingContext$$anonfun$7.apply(JavaStreamingContext.scala:626)
    	at scala.Option.getOrElse(Option.scala:121)
    	at org.apache.spark.streaming.StreamingContext$.getOrCreate(StreamingContext.scala:828)
    	at org.apache.spark.streaming.api.java.JavaStreamingContext$.getOrCreate(JavaStreamingContext.scala:626)
    	at org.apache.spark.streaming.api.java.JavaStreamingContext.getOrCreate(JavaStreamingContext.scala)
    	at org.apache.beam.runners.spark.SparkRunner.run(SparkRunner.java:169)
    	at org.apache.beam.runners.spark.TestSparkRunner.run(TestSparkRunner.java:123)
    	at org.apache.beam.runners.spark.TestSparkRunner.run(TestSparkRunner.java:83)
    	at org.apache.beam.sdk.Pipeline.run(Pipeline.java:311)
    	at org.apache.beam.sdk.testing.TestPipeline.run(TestPipeline.java:346)
    	at org.apache.beam.sdk.testing.TestPipeline.run(TestPipeline.java:328)
    	at org.apache.beam.runners.spark.translation.streaming.CreateStreamTest.testDiscardingMode(CreateStreamTest.java:203)
    	at sun.reflect.NativeMethodAccessorImpl.invoke0(Native Method)
    	at sun.reflect.NativeMethodAccessorImpl.invoke(NativeMethodAccessorImpl.java:62)
    	at sun.reflect.DelegatingMethodAccessorImpl.invoke(DelegatingMethodAccessorImpl.java:43)
    	at java.lang.reflect.Method.invoke(Method.java:498)
    	at org.junit.runners.model.FrameworkMethod$1.runReflectiveCall(FrameworkMethod.java:50)
    	at org.junit.internal.runners.model.ReflectiveCallable.run(ReflectiveCallable.java:12)
    	at org.junit.runners.model.FrameworkMethod.invokeExplosively(FrameworkMethod.java:47)
    	at org.junit.internal.runners.statements.InvokeMethod.evaluate(InvokeMethod.java:17)
    	at org.junit.rules.ExternalResource$1.evaluate(ExternalResource.java:48)
    	at org.apache.beam.sdk.testing.TestPipeline$1.evaluate(TestPipeline.java:317)
    	at org.junit.rules.ExpectedException$ExpectedExceptionStatement.evaluate(ExpectedException.java:239)
    	at org.junit.rules.RunRules.evaluate(RunRules.java:20)
    	at org.junit.runners.ParentRunner.runLeaf(ParentRunner.java:325)
    	at org.junit.runners.BlockJUnit4ClassRunner.runChild(BlockJUnit4ClassRunner.java:78)
    	at org.junit.runners.BlockJUnit4ClassRunner.runChild(BlockJUnit4ClassRunner.java:57)
    	at org.junit.runners.ParentRunner$3.run(ParentRunner.java:290)
    	at org.junit.runners.ParentRunner$1.schedule(ParentRunner.java:71)
    	at org.junit.runners.ParentRunner.runChildren(ParentRunner.java:288)
    	at org.junit.runners.ParentRunner.access$000(ParentRunner.java:58)
    	at org.junit.runners.ParentRunner$2.evaluate(ParentRunner.java:268)
    	at org.junit.runners.ParentRunner.run(ParentRunner.java:363)
    	at org.gradle.api.internal.tasks.testing.junit.JUnitTestClassExecuter.runTestClass(JUnitTestClassExecuter.java:114)
    	at org.gradle.api.internal.tasks.testing.junit.JUnitTestClassExecuter.execute(JUnitTestClassExecuter.java:57)
    	at org.gradle.api.internal.tasks.testing.junit.JUnitTestClassProcessor.processTestClass(JUnitTestClassProcessor.java:66)
    	at org.gradle.api.internal.tasks.testing.SuiteTestClassProcessor.processTestClass(SuiteTestClassProcessor.java:51)
    	at sun.reflect.NativeMethodAccessorImpl.invoke0(Native Method)
    	at sun.reflect.NativeMethodAccessorImpl.invoke(NativeMethodAccessorImpl.java:62)
    	at sun.reflect.DelegatingMethodAccessorImpl.invoke(DelegatingMethodAccessorImpl.java:43)
    	at java.lang.reflect.Method.invoke(Method.java:498)
    	at org.gradle.internal.dispatch.ReflectionDispatch.dispatch(ReflectionDispatch.java:35)
    	at org.gradle.internal.dispatch.ReflectionDispatch.dispatch(ReflectionDispatch.java:24)
    	at org.gradle.internal.dispatch.ContextClassLoaderDispatch.dispatch(ContextClassLoaderDispatch.java:32)
    	at org.gradle.internal.dispatch.ProxyDispatchAdapter$DispatchingInvocationHandler.invoke(ProxyDispatchAdapter.java:93)
    	at com.sun.proxy.$Proxy3.processTestClass(Unknown Source)
    	at org.gradle.api.internal.tasks.testing.worker.TestWorker.processTestClass(TestWorker.java:108)
    	at sun.reflect.NativeMethodAccessorImpl.invoke0(Native Method)
    	at sun.reflect.NativeMethodAccessorImpl.invoke(NativeMethodAccessorImpl.java:62)
    	at sun.reflect.DelegatingMethodAccessorImpl.invoke(DelegatingMethodAccessorImpl.java:43)
    	at java.lang.reflect.Method.invoke(Method.java:498)
    	at org.gradle.internal.dispatch.ReflectionDispatch.dispatch(ReflectionDispatch.java:35)
    	at org.gradle.internal.dispatch.ReflectionDispatch.dispatch(ReflectionDispatch.java:24)
    	at org.gradle.internal.remote.internal.hub.MessageHubBackedObjectConnection$DispatchWrapper.dispatch(MessageHubBackedObjectConnection.java:146)
    	at org.gradle.internal.remote.internal.hub.MessageHubBackedObjectConnection$DispatchWrapper.dispatch(MessageHubBackedObjectConnection.java:128)
    	at org.gradle.internal.remote.internal.hub.MessageHub$Handler.run(MessageHub.java:404)
    	at org.gradle.internal.concurrent.ExecutorPolicy$CatchAndRecordFailures.onExecute(ExecutorPolicy.java:63)
    	at org.gradle.internal.concurrent.ManagedExecutorImpl$1.run(ManagedExecutorImpl.java:46)
    	at java.util.concurrent.ThreadPoolExecutor.runWorker(ThreadPoolExecutor.java:1149)
    	at java.util.concurrent.ThreadPoolExecutor$Worker.run(ThreadPoolExecutor.java:624)
    	at org.gradle.internal.concurrent.ThreadFactoryImpl$ManagedThreadRunnable.run(ThreadFactoryImpl.java:55)
    	at java.lang.Thread.run(Thread.java:748)
Gradle Test Executor 271 finished executing tests.
Finished generating test XML results (0.042 secs) into: <https://builds.apache.org/job/beam_PostCommit_Java_ValidatesRunner_Spark_Gradle/ws/src/runners/spark/build/test-results/validatesRunnerStreaming>
Generating HTML test report...
Finished generating test html results (0.021 secs) into: <https://builds.apache.org/job/beam_PostCommit_Java_ValidatesRunner_Spark_Gradle/ws/src/runners/spark/build/reports/tests/validatesRunnerStreaming>
:beam-runners-spark:validatesRunnerStreaming (Thread[main,5,main]) completed. Took 4 mins
8.143 secs.

FAILURE: Build failed with an exception.

* What went wrong:
Execution failed for task ':beam-runners-spark:validatesRunnerBatch'.
> There were failing tests. See the report at: file://<https://builds.apache.org/job/beam_PostCommit_Java_ValidatesRunner_Spark_Gradle/ws/src/runners/spark/build/reports/tests/validatesRunnerBatch/index.html>

* Try:
Run with --stacktrace option to get the stack trace. Run with --debug option to get more log
output. Run with --scan to get full insights.

* Get more help at https://help.gradle.org

Deprecated Gradle features were used in this build, making it incompatible with Gradle 5.0.
See https://docs.gradle.org/4.5.1/userguide/command_line_interface.html#sec:command_line_warnings

BUILD FAILED in 37m 43s
38 actionable tasks: 38 executed

Publishing build scan...
https://gradle.com/s/vwxsv2acwfr4w

Build step 'Invoke Gradle script' changed build result to FAILURE
Build step 'Invoke Gradle script' marked build as failure
Recording test results
Not sending mail to unregistered user github@alasdairhodge.co.uk
Not sending mail to unregistered user sidhom@google.com

Mime
View raw message