beam-commits mailing list archives

Site index · List index
Message view « Date » · « Thread »
Top « Date » · « Thread »
From Apache Jenkins Server <jenk...@builds.apache.org>
Subject Build failed in Jenkins: beam_PostCommit_Java_ValidatesRunner_Dataflow_Gradle #19
Date Mon, 09 Apr 2018 17:17:23 GMT
See <https://builds.apache.org/job/beam_PostCommit_Java_ValidatesRunner_Dataflow_Gradle/19/display/redirect?page=changes>

Changes:

[amyrvold] [BEAM-3255] Move from maven to gradle with nightly builds

[github] Update job_beam_Release_Gradle_NightlySnapshot.groovy

------------------------------------------
Started by GitHub push by lukecwik
[EnvInject] - Loading node environment variables.
Building remotely on beam8 (beam) in workspace <https://builds.apache.org/job/beam_PostCommit_Java_ValidatesRunner_Dataflow_Gradle/ws/>
 > git rev-parse --is-inside-work-tree # timeout=10
Fetching changes from the remote Git repository
 > git config remote.origin.url https://github.com/apache/beam.git # timeout=10
Fetching upstream changes from https://github.com/apache/beam.git
 > git --version # timeout=10
 > git fetch --tags --progress https://github.com/apache/beam.git +refs/heads/*:refs/remotes/origin/*
+refs/pull/${ghprbPullId}/*:refs/remotes/origin/pr/${ghprbPullId}/*
 > git rev-parse origin/master^{commit} # timeout=10
Checking out Revision a79d1b4fc27eb81db0d9a773047820a206f3d238 (origin/master)
 > git config core.sparsecheckout # timeout=10
 > git checkout -f a79d1b4fc27eb81db0d9a773047820a206f3d238
Commit message: "[BEAM-3255] Move from maven to gradle with nightly builds"
 > git rev-list --no-walk cf1ff444dd5b569557f924c3af34a769095faee7 # timeout=10
Cleaning workspace
 > git rev-parse --verify HEAD # timeout=10
Resetting working tree
 > git reset --hard # timeout=10
 > git clean -fdx # timeout=10
[EnvInject] - Executing scripts and injecting environment variables after the SCM step.
[EnvInject] - Injecting as environment variables the properties content 
SPARK_LOCAL_IP=127.0.0.1

[EnvInject] - Variables injected successfully.
[Gradle] - Launching build.
[src] $ <https://builds.apache.org/job/beam_PostCommit_Java_ValidatesRunner_Dataflow_Gradle/ws/src/gradlew>
--info --continue --rerun-tasks :runners:google-cloud-dataflow-java:validatesRunner
Initialized native services in: /home/jenkins/.gradle/native
Using 4 worker leases.
Starting Build
Settings evaluated using settings file '<https://builds.apache.org/job/beam_PostCommit_Java_ValidatesRunner_Dataflow_Gradle/ws/src/settings.gradle'.>
Projects loaded. Root project using build file '<https://builds.apache.org/job/beam_PostCommit_Java_ValidatesRunner_Dataflow_Gradle/ws/src/build.gradle'.>
Included projects: [root project 'beam', project ':beam-examples-java', project ':beam-local-artifact-service-java',
project ':beam-model-fn-execution', project ':beam-model-job-management', project ':beam-model-pipeline',
project ':beam-runners-apex', project ':beam-runners-core-construction-java', project ':beam-runners-core-java',
project ':beam-runners-direct-java', project ':beam-runners-flink_2.11', project ':beam-runners-gcp-gcemd',
project ':beam-runners-gcp-gcsproxy', project ':beam-runners-gearpump', project ':beam-runners-google-cloud-dataflow-java',
project ':beam-runners-java-fn-execution', project ':beam-runners-local-java-core', project
':beam-runners-reference-java', project ':beam-runners-reference-job-server', project ':beam-runners-spark',
project ':beam-sdks-go', project ':beam-sdks-go-container', project ':beam-sdks-go-examples',
project ':beam-sdks-java-build-tools', project ':beam-sdks-java-container', project ':beam-sdks-java-core',
project ':beam-sdks-java-extensions-google-cloud-platform-core', project ':beam-sdks-java-extensions-join-library',
project ':beam-sdks-java-extensions-json-jackson', project ':beam-sdks-java-extensions-protobuf',
project ':beam-sdks-java-extensions-sketching', project ':beam-sdks-java-extensions-sorter',
project ':beam-sdks-java-extensions-sql', project ':beam-sdks-java-fn-execution', project
':beam-sdks-java-harness', project ':beam-sdks-java-io-amazon-web-services', project ':beam-sdks-java-io-amqp',
project ':beam-sdks-java-io-cassandra', project ':beam-sdks-java-io-common', project ':beam-sdks-java-io-elasticsearch',
project ':beam-sdks-java-io-elasticsearch-tests-2', project ':beam-sdks-java-io-elasticsearch-tests-5',
project ':beam-sdks-java-io-elasticsearch-tests-common', project ':beam-sdks-java-io-file-based-io-tests',
project ':beam-sdks-java-io-google-cloud-platform', project ':beam-sdks-java-io-hadoop-common',
project ':beam-sdks-java-io-hadoop-file-system', project ':beam-sdks-java-io-hadoop-input-format',
project ':beam-sdks-java-io-hbase', project ':beam-sdks-java-io-hcatalog', project ':beam-sdks-java-io-jdbc',
project ':beam-sdks-java-io-jms', project ':beam-sdks-java-io-kafka', project ':beam-sdks-java-io-kinesis',
project ':beam-sdks-java-io-mongodb', project ':beam-sdks-java-io-mqtt', project ':beam-sdks-java-io-redis',
project ':beam-sdks-java-io-solr', project ':beam-sdks-java-io-tika', project ':beam-sdks-java-io-xml',
project ':beam-sdks-java-maven-archetypes-examples', project ':beam-sdks-java-maven-archetypes-starter',
project ':beam-sdks-java-nexmark', project ':beam-sdks-python', project ':beam-sdks-python-container',
project ':release']
Parallel execution with configuration on demand is an incubating feature.
Evaluating root project 'beam' using build file '<https://builds.apache.org/job/beam_PostCommit_Java_ValidatesRunner_Dataflow_Gradle/ws/src/build.gradle'.>
Applying build_rules.gradle to beam
Offline dependencies root configured at 'offline-repository'
Adding 47 .gitignore exclusions to Apache Rat

FAILURE: Build failed with an exception.

* What went wrong:
Project 'runners' not found in root project 'beam'.

* Try:
Run with --stacktrace option to get the stack trace. Run with --debug option to get more log
output. Run with --scan to get full insights.

* Get more help at https://help.gradle.org

BUILD FAILED in 7s
Build step 'Invoke Gradle script' changed build result to FAILURE
Build step 'Invoke Gradle script' marked build as failure
Recording test results
ERROR: Step ‘Publish JUnit test result report’ failed: No test report files were found.
Configuration error?
Not sending mail to unregistered user swegner@google.com
Not sending mail to unregistered user relax@relax-macbookpro2.roam.corp.google.com
Not sending mail to unregistered user ccy@google.com
Not sending mail to unregistered user amyrvold@google.com
Not sending mail to unregistered user alan.myrvold@comcast.net
Not sending mail to unregistered user swegner2@gmail.com
Not sending mail to unregistered user herohde@google.com
Not sending mail to unregistered user wcn@google.com
Not sending mail to unregistered user github@alasdairhodge.co.uk

Mime
View raw message