beam-commits mailing list archives

Site index · List index
Message view « Date » · « Thread »
Top « Date » · « Thread »
From Apache Jenkins Server <jenk...@builds.apache.org>
Subject Build failed in Jenkins: beam_PerformanceTests_XmlIOIT_HDFS #28
Date Mon, 09 Apr 2018 18:39:56 GMT
See <https://builds.apache.org/job/beam_PerformanceTests_XmlIOIT_HDFS/28/display/redirect?page=changes>

Changes:

[lcwik] Attempt to produce release artifacts.

[lcwik] Sign the published artifacts.

[lcwik] Rename a few of the projects so that the artifact names are correctly

[lcwik] Rewrite even more names.

[lcwik] fixup! fix a few names

[swegner] Add Apache header into generated POM

[lcwik] Finish renaming the projects so that they produce valid maven artifact

[lcwik] Gate signing/publishing configuration on 'release', 'publishing' project

[swegner] Use correct project description in generated pom

[swegner] Add license to generated poms

[swegner] Add scm information to generated pom

[swegner] Add JIRA information to generated pom

[swegner] Add mailing list information to generated pom

[swegner] Add developer info to generated pom files

[swegner] Add top-level metadata to generate poms

[alan.myrvold] only sign when releasing, to avoid gpg erors

[lcwik] Add exclusion rules that are defined on the configuration and the

[lcwik] Only apply maven-publish / signing plugins if actually needed.

[lcwik] Fix relocated paths after renaming modules.

[swegner] Fix Apache license header in generated POM.

[swegner] fixup: tabs -> spaces

[lcwik] Publish shaded jars when signing

[lcwik] Mirate back to using compile as the dependency type since our archetypes

[lcwik] Also publish the beam-sdks-java-harness package.

[lcwik] Move signing configuration under same block that controls whether

[swegner] Add proper descriptions to generated pom files.

[lcwik] Minor description clean-ups.

[swegner] fixup: Update project name to new convention

[swegner2] Address some comments on PR/5048 (#19)

[swegner] Move generated pom configuration into build_rules.gradle.

[lcwik] [BEAM-4014] Replace the Java maven based PostCommit with a Gradle based

[amyrvold] [BEAM-3255] Move from maven to gradle with nightly builds

[github] Update job_beam_Release_Gradle_NightlySnapshot.groovy

[lcwik] [BEAM-4014] Remove previous names because this renames the existing job

------------------------------------------
[...truncated 189.76 KB...]
	at org.apache.hadoop.io.retry.RetryInvocationHandler.invoke(RetryInvocationHandler.java:102)
	at com.sun.proxy.$Proxy61.create(Unknown Source)
	at org.apache.hadoop.hdfs.DFSOutputStream.newStreamForCreate(DFSOutputStream.java:1623)
	at org.apache.hadoop.hdfs.DFSClient.create(DFSClient.java:1703)
	at org.apache.hadoop.hdfs.DFSClient.create(DFSClient.java:1638)
	at org.apache.hadoop.hdfs.DistributedFileSystem$7.doCall(DistributedFileSystem.java:448)
	at org.apache.hadoop.hdfs.DistributedFileSystem$7.doCall(DistributedFileSystem.java:444)
	at org.apache.hadoop.fs.FileSystemLinkResolver.resolve(FileSystemLinkResolver.java:81)
	at org.apache.hadoop.hdfs.DistributedFileSystem.create(DistributedFileSystem.java:459)
	at org.apache.hadoop.hdfs.DistributedFileSystem.create(DistributedFileSystem.java:387)
	at org.apache.hadoop.fs.FileSystem.create(FileSystem.java:911)
	at org.apache.hadoop.fs.FileSystem.create(FileSystem.java:892)
	at org.apache.hadoop.fs.FileSystem.create(FileSystem.java:789)
	at org.apache.hadoop.fs.FileSystem.create(FileSystem.java:778)
	at org.apache.beam.sdk.io.hdfs.HadoopFileSystem.create(HadoopFileSystem.java:109)
	at org.apache.beam.sdk.io.hdfs.HadoopFileSystem.create(HadoopFileSystem.java:68)
	at org.apache.beam.sdk.io.FileSystems.create(FileSystems.java:248)
	at org.apache.beam.sdk.io.FileSystems.create(FileSystems.java:235)
	at org.apache.beam.sdk.io.FileBasedSink$Writer.open(FileBasedSink.java:923)
	at org.apache.beam.sdk.io.WriteFiles$WriteUnshardedTempFilesWithSpillingFn.processElement(WriteFiles.java:503)
Caused by: java.net.ConnectException: Connection refused
	at sun.nio.ch.SocketChannelImpl.checkConnect(Native Method)
	at sun.nio.ch.SocketChannelImpl.finishConnect(SocketChannelImpl.java:717)
	at org.apache.hadoop.net.SocketIOWithTimeout.connect(SocketIOWithTimeout.java:206)
	at org.apache.hadoop.net.NetUtils.connect(NetUtils.java:531)
	at org.apache.hadoop.net.NetUtils.connect(NetUtils.java:495)
	at org.apache.hadoop.ipc.Client$Connection.setupConnection(Client.java:614)
	at org.apache.hadoop.ipc.Client$Connection.setupIOstreams(Client.java:712)
	at org.apache.hadoop.ipc.Client$Connection.access$2900(Client.java:375)
	at org.apache.hadoop.ipc.Client.getConnection(Client.java:1528)
	at org.apache.hadoop.ipc.Client.call(Client.java:1451)
	at org.apache.hadoop.ipc.Client.call(Client.java:1412)
	at org.apache.hadoop.ipc.ProtobufRpcEngine$Invoker.invoke(ProtobufRpcEngine.java:229)
	at com.sun.proxy.$Proxy60.create(Unknown Source)
	at org.apache.hadoop.hdfs.protocolPB.ClientNamenodeProtocolTranslatorPB.create(ClientNamenodeProtocolTranslatorPB.java:296)
	at sun.reflect.NativeMethodAccessorImpl.invoke0(Native Method)
	at sun.reflect.NativeMethodAccessorImpl.invoke(NativeMethodAccessorImpl.java:62)
	at sun.reflect.DelegatingMethodAccessorImpl.invoke(DelegatingMethodAccessorImpl.java:43)
	at java.lang.reflect.Method.invoke(Method.java:498)
	at org.apache.hadoop.io.retry.RetryInvocationHandler.invokeMethod(RetryInvocationHandler.java:191)
	at org.apache.hadoop.io.retry.RetryInvocationHandler.invoke(RetryInvocationHandler.java:102)
	at com.sun.proxy.$Proxy61.create(Unknown Source)
	at org.apache.hadoop.hdfs.DFSOutputStream.newStreamForCreate(DFSOutputStream.java:1623)
	at org.apache.hadoop.hdfs.DFSClient.create(DFSClient.java:1703)
	at org.apache.hadoop.hdfs.DFSClient.create(DFSClient.java:1638)
	at org.apache.hadoop.hdfs.DistributedFileSystem$7.doCall(DistributedFileSystem.java:448)
	at org.apache.hadoop.hdfs.DistributedFileSystem$7.doCall(DistributedFileSystem.java:444)
	at org.apache.hadoop.fs.FileSystemLinkResolver.resolve(FileSystemLinkResolver.java:81)
	at org.apache.hadoop.hdfs.DistributedFileSystem.create(DistributedFileSystem.java:459)
	at org.apache.hadoop.hdfs.DistributedFileSystem.create(DistributedFileSystem.java:387)
	at org.apache.hadoop.fs.FileSystem.create(FileSystem.java:911)
	at org.apache.hadoop.fs.FileSystem.create(FileSystem.java:892)
	at org.apache.hadoop.fs.FileSystem.create(FileSystem.java:789)
	at org.apache.hadoop.fs.FileSystem.create(FileSystem.java:778)
	at org.apache.beam.sdk.io.hdfs.HadoopFileSystem.create(HadoopFileSystem.java:109)
	at org.apache.beam.sdk.io.hdfs.HadoopFileSystem.create(HadoopFileSystem.java:68)
	at org.apache.beam.sdk.io.FileSystems.create(FileSystems.java:248)
	at org.apache.beam.sdk.io.FileSystems.create(FileSystems.java:235)
	at org.apache.beam.sdk.io.FileBasedSink$Writer.open(FileBasedSink.java:923)
	at org.apache.beam.sdk.io.WriteFiles$WriteUnshardedTempFilesWithSpillingFn.processElement(WriteFiles.java:503)
	at org.apache.beam.sdk.io.WriteFiles$WriteUnshardedTempFilesWithSpillingFn$DoFnInvoker.invokeProcessElement(Unknown
Source)
	at org.apache.beam.runners.core.SimpleDoFnRunner.invokeProcessElement(SimpleDoFnRunner.java:177)
	at org.apache.beam.runners.core.SimpleDoFnRunner.processElement(SimpleDoFnRunner.java:138)
	at com.google.cloud.dataflow.worker.SimpleParDoFn.processElement(SimpleParDoFn.java:323)
	at com.google.cloud.dataflow.worker.util.common.worker.ParDoOperation.process(ParDoOperation.java:43)
	at com.google.cloud.dataflow.worker.util.common.worker.OutputReceiver.process(OutputReceiver.java:48)
	at com.google.cloud.dataflow.worker.SimpleParDoFn$1.output(SimpleParDoFn.java:271)
	at org.apache.beam.runners.core.SimpleDoFnRunner.outputWindowedValue(SimpleDoFnRunner.java:211)
	at org.apache.beam.runners.core.SimpleDoFnRunner.access$700(SimpleDoFnRunner.java:66)
	at org.apache.beam.runners.core.SimpleDoFnRunner$DoFnProcessContext.output(SimpleDoFnRunner.java:436)
	at org.apache.beam.runners.core.SimpleDoFnRunner$DoFnProcessContext.output(SimpleDoFnRunner.java:424)
	at org.apache.beam.sdk.transforms.MapElements$1.processElement(MapElements.java:129)
	at org.apache.beam.sdk.transforms.MapElements$1$DoFnInvoker.invokeProcessElement(Unknown
Source)
	at org.apache.beam.runners.core.SimpleDoFnRunner.invokeProcessElement(SimpleDoFnRunner.java:177)
	at org.apache.beam.runners.core.SimpleDoFnRunner.processElement(SimpleDoFnRunner.java:141)
	at com.google.cloud.dataflow.worker.SimpleParDoFn.processElement(SimpleParDoFn.java:323)
	at com.google.cloud.dataflow.worker.util.common.worker.ParDoOperation.process(ParDoOperation.java:43)
	at com.google.cloud.dataflow.worker.util.common.worker.OutputReceiver.process(OutputReceiver.java:48)
	at com.google.cloud.dataflow.worker.util.common.worker.ReadOperation.runReadLoop(ReadOperation.java:189)
	at com.google.cloud.dataflow.worker.util.common.worker.ReadOperation.start(ReadOperation.java:150)
	at com.google.cloud.dataflow.worker.util.common.worker.MapTaskExecutor.execute(MapTaskExecutor.java:74)
	at com.google.cloud.dataflow.worker.BatchDataflowWorker.executeWork(BatchDataflowWorker.java:381)
	at com.google.cloud.dataflow.worker.BatchDataflowWorker.doWork(BatchDataflowWorker.java:353)
	at com.google.cloud.dataflow.worker.BatchDataflowWorker.getAndPerformWork(BatchDataflowWorker.java:284)
	at com.google.cloud.dataflow.worker.DataflowBatchWorkerHarness$WorkerThread.doWork(DataflowBatchWorkerHarness.java:134)
	at com.google.cloud.dataflow.worker.DataflowBatchWorkerHarness$WorkerThread.call(DataflowBatchWorkerHarness.java:114)
	at com.google.cloud.dataflow.worker.DataflowBatchWorkerHarness$WorkerThread.call(DataflowBatchWorkerHarness.java:101)
	at java.util.concurrent.FutureTask.run(FutureTask.java:266)
	at java.util.concurrent.ThreadPoolExecutor.runWorker(ThreadPoolExecutor.java:1142)
	at java.util.concurrent.ThreadPoolExecutor$Worker.run(ThreadPoolExecutor.java:617)
	at java.lang.Thread.run(Thread.java:745)
Workflow failed. Causes: S03:Generate sequence/Read(BoundedCountingSource)+Create xml records/Map+Write
xml files/WriteFiles/WriteUnshardedBundlesToTempFiles/WriteUnshardedBundles+Write xml files/WriteFiles/GatherTempFileResults/Add
void key/AddKeys/Map+Write xml files/WriteFiles/GatherTempFileResults/Reshuffle/Window.Into()/Window.Assign+Write
xml files/WriteFiles/GatherTempFileResults/Reshuffle/GroupByKey/Reify+Write xml files/WriteFiles/GatherTempFileResults/Reshuffle/GroupByKey/Write+Write
xml files/WriteFiles/WriteUnshardedBundlesToTempFiles/GroupUnwritten/Reify+Write xml files/WriteFiles/WriteUnshardedBundlesToTempFiles/GroupUnwritten/Write
failed., A work item was attempted 4 times without success. Each time the worker eventually
lost contact with the service. The work item was attempted on: 
  xmlioit0writethenreadall--04091135-jqg8-harness-867z,
  xmlioit0writethenreadall--04091135-jqg8-harness-hzwx,
  xmlioit0writethenreadall--04091135-jqg8-harness-llf7,
  xmlioit0writethenreadall--04091135-jqg8-harness-9tfh
	at org.apache.beam.runners.dataflow.TestDataflowRunner.run(TestDataflowRunner.java:134)
	at org.apache.beam.runners.dataflow.TestDataflowRunner.run(TestDataflowRunner.java:90)
	at org.apache.beam.runners.dataflow.TestDataflowRunner.run(TestDataflowRunner.java:55)
	at org.apache.beam.sdk.Pipeline.run(Pipeline.java:311)
	at org.apache.beam.sdk.testing.TestPipeline.run(TestPipeline.java:346)
	at org.apache.beam.sdk.testing.TestPipeline.run(TestPipeline.java:328)
	at org.apache.beam.sdk.io.xml.XmlIOIT.writeThenReadAll(XmlIOIT.java:131)
	at sun.reflect.NativeMethodAccessorImpl.invoke0(Native Method)
	at sun.reflect.NativeMethodAccessorImpl.invoke(NativeMethodAccessorImpl.java:62)
	at sun.reflect.DelegatingMethodAccessorImpl.invoke(DelegatingMethodAccessorImpl.java:43)
	at java.lang.reflect.Method.invoke(Method.java:498)
	at org.junit.runners.model.FrameworkMethod$1.runReflectiveCall(FrameworkMethod.java:50)
	at org.junit.internal.runners.model.ReflectiveCallable.run(ReflectiveCallable.java:12)
	at org.junit.runners.model.FrameworkMethod.invokeExplosively(FrameworkMethod.java:47)
	at org.junit.internal.runners.statements.InvokeMethod.evaluate(InvokeMethod.java:17)
	at org.apache.beam.sdk.testing.TestPipeline$1.evaluate(TestPipeline.java:317)
	at org.junit.rules.RunRules.evaluate(RunRules.java:20)
	at org.junit.runners.ParentRunner.runLeaf(ParentRunner.java:325)
	at org.junit.runners.BlockJUnit4ClassRunner.runChild(BlockJUnit4ClassRunner.java:78)
	at org.junit.runners.BlockJUnit4ClassRunner.runChild(BlockJUnit4ClassRunner.java:57)
	at org.junit.runners.ParentRunner$3.run(ParentRunner.java:290)
	at org.apache.maven.surefire.junitcore.pc.Scheduler$1.run(Scheduler.java:410)
	at java.util.concurrent.Executors$RunnableAdapter.call(Executors.java:511)
	at java.util.concurrent.FutureTask.run(FutureTask.java:266)
	at java.util.concurrent.ThreadPoolExecutor.runWorker(ThreadPoolExecutor.java:1149)
	at java.util.concurrent.ThreadPoolExecutor$Worker.run(ThreadPoolExecutor.java:624)
	at java.lang.Thread.run(Thread.java:748)

[INFO] 
[INFO] Results:
[INFO] 
[ERROR] Errors: 
[ERROR]   XmlIOIT.writeThenReadAll:131  Runtime java.net.ConnectException: Call From xm...
[INFO] 
[ERROR] Tests run: 1, Failures: 0, Errors: 1, Skipped: 0
[INFO] 
[INFO] 
[INFO] --- maven-dependency-plugin:3.0.2:analyze-only (default) @ beam-sdks-java-io-file-based-io-tests
---
[INFO] No dependency problems found
[INFO] 
[INFO] --- maven-failsafe-plugin:2.21.0:verify (default) @ beam-sdks-java-io-file-based-io-tests
---
[INFO] Failsafe report directory: <https://builds.apache.org/job/beam_PerformanceTests_XmlIOIT_HDFS/ws/runs/557fce1a/beam/sdks/java/io/file-based-io-tests/target/failsafe-reports>
[INFO] ------------------------------------------------------------------------
[INFO] BUILD FAILURE
[INFO] ------------------------------------------------------------------------
[INFO] Total time: 05:11 min
[INFO] Finished at: 2018-04-09T18:39:54Z
[INFO] Final Memory: 106M/1407M
[INFO] ------------------------------------------------------------------------
[ERROR] Failed to execute goal org.apache.maven.plugins:maven-failsafe-plugin:2.21.0:verify
(default) on project beam-sdks-java-io-file-based-io-tests: There are test failures.
[ERROR] 
[ERROR] Please refer to <https://builds.apache.org/job/beam_PerformanceTests_XmlIOIT_HDFS/ws/runs/557fce1a/beam/sdks/java/io/file-based-io-tests/target/failsafe-reports>
for the individual test results.
[ERROR] Please refer to dump files (if any exist) [date]-jvmRun[N].dump, [date].dumpstream
and [date]-jvmRun[N].dumpstream.
[ERROR] -> [Help 1]
org.apache.maven.lifecycle.LifecycleExecutionException: Failed to execute goal org.apache.maven.plugins:maven-failsafe-plugin:2.21.0:verify
(default) on project beam-sdks-java-io-file-based-io-tests: There are test failures.

Please refer to <https://builds.apache.org/job/beam_PerformanceTests_XmlIOIT_HDFS/ws/runs/557fce1a/beam/sdks/java/io/file-based-io-tests/target/failsafe-reports>
for the individual test results.
Please refer to dump files (if any exist) [date]-jvmRun[N].dump, [date].dumpstream and [date]-jvmRun[N].dumpstream.
    at org.apache.maven.lifecycle.internal.MojoExecutor.execute (MojoExecutor.java:213)
    at org.apache.maven.lifecycle.internal.MojoExecutor.execute (MojoExecutor.java:154)
    at org.apache.maven.lifecycle.internal.MojoExecutor.execute (MojoExecutor.java:146)
    at org.apache.maven.lifecycle.internal.LifecycleModuleBuilder.buildProject (LifecycleModuleBuilder.java:117)
    at org.apache.maven.lifecycle.internal.LifecycleModuleBuilder.buildProject (LifecycleModuleBuilder.java:81)
    at org.apache.maven.lifecycle.internal.builder.singlethreaded.SingleThreadedBuilder.build
(SingleThreadedBuilder.java:51)
    at org.apache.maven.lifecycle.internal.LifecycleStarter.execute (LifecycleStarter.java:128)
    at org.apache.maven.DefaultMaven.doExecute (DefaultMaven.java:309)
    at org.apache.maven.DefaultMaven.doExecute (DefaultMaven.java:194)
    at org.apache.maven.DefaultMaven.execute (DefaultMaven.java:107)
    at org.apache.maven.cli.MavenCli.execute (MavenCli.java:955)
    at org.apache.maven.cli.MavenCli.doMain (MavenCli.java:290)
    at org.apache.maven.cli.MavenCli.main (MavenCli.java:194)
    at sun.reflect.NativeMethodAccessorImpl.invoke0 (Native Method)
    at sun.reflect.NativeMethodAccessorImpl.invoke (NativeMethodAccessorImpl.java:62)
    at sun.reflect.DelegatingMethodAccessorImpl.invoke (DelegatingMethodAccessorImpl.java:43)
    at java.lang.reflect.Method.invoke (Method.java:498)
    at org.codehaus.plexus.classworlds.launcher.Launcher.launchEnhanced (Launcher.java:289)
    at org.codehaus.plexus.classworlds.launcher.Launcher.launch (Launcher.java:229)
    at org.codehaus.plexus.classworlds.launcher.Launcher.mainWithExitCode (Launcher.java:415)
    at org.codehaus.plexus.classworlds.launcher.Launcher.main (Launcher.java:356)
Caused by: org.apache.maven.plugin.MojoFailureException: There are test failures.

Please refer to <https://builds.apache.org/job/beam_PerformanceTests_XmlIOIT_HDFS/ws/runs/557fce1a/beam/sdks/java/io/file-based-io-tests/target/failsafe-reports>
for the individual test results.
Please refer to dump files (if any exist) [date]-jvmRun[N].dump, [date].dumpstream and [date]-jvmRun[N].dumpstream.
    at org.apache.maven.plugin.surefire.SurefireHelper.throwException (SurefireHelper.java:240)
    at org.apache.maven.plugin.surefire.SurefireHelper.reportExecution (SurefireHelper.java:112)
    at org.apache.maven.plugin.failsafe.VerifyMojo.execute (VerifyMojo.java:192)
    at org.apache.maven.plugin.DefaultBuildPluginManager.executeMojo (DefaultBuildPluginManager.java:134)
    at org.apache.maven.lifecycle.internal.MojoExecutor.execute (MojoExecutor.java:208)
    at org.apache.maven.lifecycle.internal.MojoExecutor.execute (MojoExecutor.java:154)
    at org.apache.maven.lifecycle.internal.MojoExecutor.execute (MojoExecutor.java:146)
    at org.apache.maven.lifecycle.internal.LifecycleModuleBuilder.buildProject (LifecycleModuleBuilder.java:117)
    at org.apache.maven.lifecycle.internal.LifecycleModuleBuilder.buildProject (LifecycleModuleBuilder.java:81)
    at org.apache.maven.lifecycle.internal.builder.singlethreaded.SingleThreadedBuilder.build
(SingleThreadedBuilder.java:51)
    at org.apache.maven.lifecycle.internal.LifecycleStarter.execute (LifecycleStarter.java:128)
    at org.apache.maven.DefaultMaven.doExecute (DefaultMaven.java:309)
    at org.apache.maven.DefaultMaven.doExecute (DefaultMaven.java:194)
    at org.apache.maven.DefaultMaven.execute (DefaultMaven.java:107)
    at org.apache.maven.cli.MavenCli.execute (MavenCli.java:955)
    at org.apache.maven.cli.MavenCli.doMain (MavenCli.java:290)
    at org.apache.maven.cli.MavenCli.main (MavenCli.java:194)
    at sun.reflect.NativeMethodAccessorImpl.invoke0 (Native Method)
    at sun.reflect.NativeMethodAccessorImpl.invoke (NativeMethodAccessorImpl.java:62)
    at sun.reflect.DelegatingMethodAccessorImpl.invoke (DelegatingMethodAccessorImpl.java:43)
    at java.lang.reflect.Method.invoke (Method.java:498)
    at org.codehaus.plexus.classworlds.launcher.Launcher.launchEnhanced (Launcher.java:289)
    at org.codehaus.plexus.classworlds.launcher.Launcher.launch (Launcher.java:229)
    at org.codehaus.plexus.classworlds.launcher.Launcher.mainWithExitCode (Launcher.java:415)
    at org.codehaus.plexus.classworlds.launcher.Launcher.main (Launcher.java:356)
[ERROR] 
[ERROR] Re-run Maven using the -X switch to enable full debug logging.
[ERROR] 
[ERROR] For more information about the errors and possible solutions, please read the following
articles:
[ERROR] [Help 1] http://cwiki.apache.org/confluence/display/MAVEN/MojoFailureException

STDERR: 
2018-04-09 18:39:55,063 557fce1a MainThread beam_integration_benchmark(1/1) ERROR    Error
during benchmark beam_integration_benchmark
Traceback (most recent call last):
  File "<https://builds.apache.org/job/beam_PerformanceTests_XmlIOIT_HDFS/ws/PerfKitBenchmarker/perfkitbenchmarker/pkb.py",>
line 624, in RunBenchmark
    DoRunPhase(spec, collector, detailed_timer)
  File "<https://builds.apache.org/job/beam_PerformanceTests_XmlIOIT_HDFS/ws/PerfKitBenchmarker/perfkitbenchmarker/pkb.py",>
line 527, in DoRunPhase
    samples = spec.BenchmarkRun(spec)
  File "<https://builds.apache.org/job/beam_PerformanceTests_XmlIOIT_HDFS/ws/PerfKitBenchmarker/perfkitbenchmarker/linux_benchmarks/beam_integration_benchmark.py",>
line 159, in Run
    job_type=job_type)
  File "<https://builds.apache.org/job/beam_PerformanceTests_XmlIOIT_HDFS/ws/PerfKitBenchmarker/perfkitbenchmarker/providers/gcp/gcp_dpb_dataflow.py",>
line 90, in SubmitJob
    assert retcode == 0, "Integration Test Failed."
AssertionError: Integration Test Failed.
2018-04-09 18:39:55,064 557fce1a MainThread beam_integration_benchmark(1/1) INFO     Cleaning
up benchmark beam_integration_benchmark
2018-04-09 18:39:55,064 557fce1a MainThread beam_integration_benchmark(1/1) INFO     Running:
kubectl --kubeconfig=<https://builds.apache.org/job/beam_PerformanceTests_XmlIOIT_HDFS/ws/config-filebasedioithdfs-1523297793577>
delete -f <https://builds.apache.org/job/beam_PerformanceTests_XmlIOIT_HDFS/ws/src/.test-infra/kubernetes/hadoop/SmallITCluster/hdfs-single-datanode-cluster.yml>
2018-04-09 18:39:55,832 557fce1a MainThread beam_integration_benchmark(1/1) INFO     Running:
kubectl --kubeconfig=<https://builds.apache.org/job/beam_PerformanceTests_XmlIOIT_HDFS/ws/config-filebasedioithdfs-1523297793577>
delete -f <https://builds.apache.org/job/beam_PerformanceTests_XmlIOIT_HDFS/ws/src/.test-infra/kubernetes/hadoop/SmallITCluster/hdfs-single-datanode-cluster-for-local-dev.yml>
2018-04-09 18:39:56,042 557fce1a MainThread beam_integration_benchmark(1/1) ERROR    Exception
running benchmark
Traceback (most recent call last):
  File "<https://builds.apache.org/job/beam_PerformanceTests_XmlIOIT_HDFS/ws/PerfKitBenchmarker/perfkitbenchmarker/pkb.py",>
line 758, in RunBenchmarkTask
    RunBenchmark(spec, collector)
  File "<https://builds.apache.org/job/beam_PerformanceTests_XmlIOIT_HDFS/ws/PerfKitBenchmarker/perfkitbenchmarker/pkb.py",>
line 624, in RunBenchmark
    DoRunPhase(spec, collector, detailed_timer)
  File "<https://builds.apache.org/job/beam_PerformanceTests_XmlIOIT_HDFS/ws/PerfKitBenchmarker/perfkitbenchmarker/pkb.py",>
line 527, in DoRunPhase
    samples = spec.BenchmarkRun(spec)
  File "<https://builds.apache.org/job/beam_PerformanceTests_XmlIOIT_HDFS/ws/PerfKitBenchmarker/perfkitbenchmarker/linux_benchmarks/beam_integration_benchmark.py",>
line 159, in Run
    job_type=job_type)
  File "<https://builds.apache.org/job/beam_PerformanceTests_XmlIOIT_HDFS/ws/PerfKitBenchmarker/perfkitbenchmarker/providers/gcp/gcp_dpb_dataflow.py",>
line 90, in SubmitJob
    assert retcode == 0, "Integration Test Failed."
AssertionError: Integration Test Failed.
2018-04-09 18:39:56,042 557fce1a MainThread beam_integration_benchmark(1/1) ERROR    Benchmark
1/1 beam_integration_benchmark (UID: beam_integration_benchmark0) failed. Execution will continue.
2018-04-09 18:39:56,091 557fce1a MainThread INFO     Benchmark run statuses:
---------------------------------------------------------------------------------
Name                        UID                          Status  Failed Substatus
---------------------------------------------------------------------------------
beam_integration_benchmark  beam_integration_benchmark0  FAILED                  
---------------------------------------------------------------------------------
Success rate: 0.00% (0/1)
2018-04-09 18:39:56,092 557fce1a MainThread INFO     Complete logs can be found at: <https://builds.apache.org/job/beam_PerformanceTests_XmlIOIT_HDFS/ws/runs/557fce1a/pkb.log>
2018-04-09 18:39:56,092 557fce1a MainThread INFO     Completion statuses can be found at:
<https://builds.apache.org/job/beam_PerformanceTests_XmlIOIT_HDFS/ws/runs/557fce1a/completion_statuses.json>
Build step 'Execute shell' marked build as failure

Mime
View raw message