beam-commits mailing list archives

Site index · List index
Message view « Date » · « Thread »
Top « Date » · « Thread »
From Apache Jenkins Server <jenk...@builds.apache.org>
Subject Build failed in Jenkins: beam_PerformanceTests_AvroIOIT #345
Date Fri, 06 Apr 2018 18:04:16 GMT
See <https://builds.apache.org/job/beam_PerformanceTests_AvroIOIT/345/display/redirect?page=changes>

Changes:

[coheigea] Put String literals first when comparing using String.equals

[wcn] BEAM-xxxx Performance

------------------------------------------
[...truncated 29.09 KB...]
[INFO] Excluding org.apache.beam:beam-sdks-java-extensions-protobuf:jar:2.5.0-SNAPSHOT from
the shaded jar.
[INFO] Excluding io.grpc:grpc-core:jar:1.2.0 from the shaded jar.
[INFO] Excluding com.google.errorprone:error_prone_annotations:jar:2.0.15 from the shaded
jar.
[INFO] Excluding io.grpc:grpc-context:jar:1.2.0 from the shaded jar.
[INFO] Excluding com.google.instrumentation:instrumentation-api:jar:0.3.0 from the shaded
jar.
[INFO] Excluding com.google.apis:google-api-services-bigquery:jar:v2-rev374-1.22.0 from the
shaded jar.
[INFO] Excluding com.google.api:gax-grpc:jar:0.20.0 from the shaded jar.
[INFO] Excluding io.grpc:grpc-protobuf:jar:1.2.0 from the shaded jar.
[INFO] Excluding com.google.api:api-common:jar:1.0.0-rc2 from the shaded jar.
[INFO] Excluding com.google.auto.value:auto-value:jar:1.5.3 from the shaded jar.
[INFO] Excluding com.google.api:gax:jar:1.3.1 from the shaded jar.
[INFO] Excluding org.threeten:threetenbp:jar:1.3.3 from the shaded jar.
[INFO] Excluding com.google.cloud:google-cloud-core-grpc:jar:1.2.0 from the shaded jar.
[INFO] Excluding com.google.apis:google-api-services-pubsub:jar:v1-rev10-1.22.0 from the shaded
jar.
[INFO] Excluding com.google.api.grpc:grpc-google-cloud-pubsub-v1:jar:0.1.18 from the shaded
jar.
[INFO] Excluding com.google.api.grpc:proto-google-cloud-pubsub-v1:jar:0.1.18 from the shaded
jar.
[INFO] Excluding com.google.api.grpc:proto-google-iam-v1:jar:0.1.18 from the shaded jar.
[INFO] Excluding com.google.cloud.datastore:datastore-v1-proto-client:jar:1.4.0 from the shaded
jar.
[INFO] Excluding com.google.http-client:google-http-client-protobuf:jar:1.22.0 from the shaded
jar.
[INFO] Excluding com.google.http-client:google-http-client-jackson:jar:1.22.0 from the shaded
jar.
[INFO] Excluding com.google.cloud.datastore:datastore-v1-protos:jar:1.3.0 from the shaded
jar.
[INFO] Excluding com.google.api.grpc:grpc-google-common-protos:jar:0.1.9 from the shaded jar.
[INFO] Excluding io.grpc:grpc-auth:jar:1.2.0 from the shaded jar.
[INFO] Excluding io.grpc:grpc-netty:jar:1.2.0 from the shaded jar.
[INFO] Excluding io.netty:netty-codec-http2:jar:4.1.8.Final from the shaded jar.
[INFO] Excluding io.netty:netty-codec-http:jar:4.1.8.Final from the shaded jar.
[INFO] Excluding io.netty:netty-handler-proxy:jar:4.1.8.Final from the shaded jar.
[INFO] Excluding io.netty:netty-codec-socks:jar:4.1.8.Final from the shaded jar.
[INFO] Excluding io.netty:netty-handler:jar:4.1.8.Final from the shaded jar.
[INFO] Excluding io.netty:netty-buffer:jar:4.1.8.Final from the shaded jar.
[INFO] Excluding io.netty:netty-common:jar:4.1.8.Final from the shaded jar.
[INFO] Excluding io.netty:netty-transport:jar:4.1.8.Final from the shaded jar.
[INFO] Excluding io.netty:netty-resolver:jar:4.1.8.Final from the shaded jar.
[INFO] Excluding io.netty:netty-codec:jar:4.1.8.Final from the shaded jar.
[INFO] Excluding io.grpc:grpc-stub:jar:1.2.0 from the shaded jar.
[INFO] Excluding com.google.cloud:google-cloud-core:jar:1.0.2 from the shaded jar.
[INFO] Excluding org.json:json:jar:20160810 from the shaded jar.
[INFO] Excluding com.google.cloud:google-cloud-spanner:jar:0.20.0b-beta from the shaded jar.
[INFO] Excluding com.google.api.grpc:proto-google-cloud-spanner-v1:jar:0.1.11b from the shaded
jar.
[INFO] Excluding com.google.api.grpc:proto-google-cloud-spanner-admin-instance-v1:jar:0.1.11
from the shaded jar.
[INFO] Excluding com.google.api.grpc:grpc-google-cloud-spanner-v1:jar:0.1.11b from the shaded
jar.
[INFO] Excluding com.google.api.grpc:grpc-google-cloud-spanner-admin-database-v1:jar:0.1.11
from the shaded jar.
[INFO] Excluding com.google.api.grpc:grpc-google-cloud-spanner-admin-instance-v1:jar:0.1.11
from the shaded jar.
[INFO] Excluding com.google.api.grpc:grpc-google-longrunning-v1:jar:0.1.11 from the shaded
jar.
[INFO] Excluding com.google.api.grpc:proto-google-longrunning-v1:jar:0.1.11 from the shaded
jar.
[INFO] Excluding com.google.cloud.bigtable:bigtable-protos:jar:1.0.0-pre3 from the shaded
jar.
[INFO] Excluding com.google.cloud.bigtable:bigtable-client-core:jar:1.0.0 from the shaded
jar.
[INFO] Excluding commons-logging:commons-logging:jar:1.2 from the shaded jar.
[INFO] Excluding com.google.auth:google-auth-library-appengine:jar:0.7.0 from the shaded jar.
[INFO] Excluding io.opencensus:opencensus-contrib-grpc-util:jar:0.7.0 from the shaded jar.
[INFO] Excluding io.opencensus:opencensus-api:jar:0.7.0 from the shaded jar.
[INFO] Excluding io.dropwizard.metrics:metrics-core:jar:3.1.2 from the shaded jar.
[INFO] Excluding com.google.protobuf:protobuf-java:jar:3.2.0 from the shaded jar.
[INFO] Excluding com.google.api.grpc:proto-google-cloud-spanner-admin-database-v1:jar:0.1.9
from the shaded jar.
[INFO] Excluding com.google.api.grpc:proto-google-common-protos:jar:0.1.9 from the shaded
jar.
[INFO] Excluding io.grpc:grpc-all:jar:1.2.0 from the shaded jar.
[INFO] Excluding io.grpc:grpc-okhttp:jar:1.2.0 from the shaded jar.
[INFO] Excluding com.squareup.okhttp:okhttp:jar:2.5.0 from the shaded jar.
[INFO] Excluding com.squareup.okio:okio:jar:1.6.0 from the shaded jar.
[INFO] Excluding io.grpc:grpc-protobuf-lite:jar:1.2.0 from the shaded jar.
[INFO] Excluding io.grpc:grpc-protobuf-nano:jar:1.2.0 from the shaded jar.
[INFO] Excluding com.google.protobuf.nano:protobuf-javanano:jar:3.0.0-alpha-5 from the shaded
jar.
[INFO] Excluding io.netty:netty-tcnative-boringssl-static:jar:1.1.33.Fork26 from the shaded
jar.
[INFO] Replacing original artifact with shaded artifact.
[INFO] Replacing <https://builds.apache.org/job/beam_PerformanceTests_AvroIOIT/ws/runs/b14b8c4f/beam/sdks/java/io/file-based-io-tests/target/beam-sdks-java-io-file-based-io-tests-2.5.0-SNAPSHOT.jar>
with <https://builds.apache.org/job/beam_PerformanceTests_AvroIOIT/ws/runs/b14b8c4f/beam/sdks/java/io/file-based-io-tests/target/beam-sdks-java-io-file-based-io-tests-2.5.0-SNAPSHOT-shaded.jar>
[INFO] Replacing original test artifact with shaded test artifact.
[INFO] Replacing <https://builds.apache.org/job/beam_PerformanceTests_AvroIOIT/ws/runs/b14b8c4f/beam/sdks/java/io/file-based-io-tests/target/beam-sdks-java-io-file-based-io-tests-2.5.0-SNAPSHOT-tests.jar>
with <https://builds.apache.org/job/beam_PerformanceTests_AvroIOIT/ws/runs/b14b8c4f/beam/sdks/java/io/file-based-io-tests/target/beam-sdks-java-io-file-based-io-tests-2.5.0-SNAPSHOT-shaded-tests.jar>
[INFO] 
[INFO] --- maven-failsafe-plugin:2.21.0:integration-test (default) @ beam-sdks-java-io-file-based-io-tests
---
[INFO] Failsafe report directory: <https://builds.apache.org/job/beam_PerformanceTests_AvroIOIT/ws/runs/b14b8c4f/beam/sdks/java/io/file-based-io-tests/target/failsafe-reports>
[INFO] parallel='all', perCoreThreadCount=true, threadCount=4, useUnlimitedThreads=false,
threadCountSuites=0, threadCountClasses=0, threadCountMethods=0, parallelOptimized=true
[INFO] 
[INFO] -------------------------------------------------------
[INFO]  T E S T S
[INFO] -------------------------------------------------------
[INFO] Running org.apache.beam.sdk.io.avro.AvroIOIT
[ERROR] Tests run: 1, Failures: 0, Errors: 1, Skipped: 0, Time elapsed: 1.832 s <<<
FAILURE! - in org.apache.beam.sdk.io.avro.AvroIOIT
[ERROR] writeThenReadAll(org.apache.beam.sdk.io.avro.AvroIOIT)  Time elapsed: 1.832 s  <<<
ERROR!
java.lang.NoClassDefFoundError: org/apache/beam/runners/core/SplittableParDoViaKeyedWorkItems$ProcessElements
	at org.apache.beam.runners.direct.TransformEvaluatorRegistry$DirectTransformsRegistrar.getTransformPayloadTranslators(TransformEvaluatorRegistry.java:113)
	at org.apache.beam.runners.core.construction.PTransformTranslation.loadTransformPayloadTranslators(PTransformTranslation.java:102)
	at org.apache.beam.runners.core.construction.PTransformTranslation.<clinit>(PTransformTranslation.java:86)
	at org.apache.beam.runners.core.construction.UnconsumedReads$1.visitValue(UnconsumedReads.java:49)
	at org.apache.beam.sdk.runners.TransformHierarchy$Node.visit(TransformHierarchy.java:677)
	at org.apache.beam.sdk.runners.TransformHierarchy$Node.visit(TransformHierarchy.java:660)
	at org.apache.beam.sdk.runners.TransformHierarchy$Node.visit(TransformHierarchy.java:660)
	at org.apache.beam.sdk.runners.TransformHierarchy$Node.access$600(TransformHierarchy.java:311)
	at org.apache.beam.sdk.runners.TransformHierarchy.visit(TransformHierarchy.java:245)
	at org.apache.beam.sdk.Pipeline.traverseTopologically(Pipeline.java:458)
	at org.apache.beam.runners.core.construction.UnconsumedReads.ensureAllReadsConsumed(UnconsumedReads.java:40)
	at org.apache.beam.runners.dataflow.DataflowRunner.replaceTransforms(DataflowRunner.java:864)
	at org.apache.beam.runners.dataflow.DataflowRunner.run(DataflowRunner.java:656)
	at org.apache.beam.runners.dataflow.TestDataflowRunner.run(TestDataflowRunner.java:98)
	at org.apache.beam.runners.dataflow.TestDataflowRunner.run(TestDataflowRunner.java:90)
	at org.apache.beam.runners.dataflow.TestDataflowRunner.run(TestDataflowRunner.java:55)
	at org.apache.beam.sdk.Pipeline.run(Pipeline.java:311)
	at org.apache.beam.sdk.testing.TestPipeline.run(TestPipeline.java:346)
	at org.apache.beam.sdk.testing.TestPipeline.run(TestPipeline.java:328)
	at org.apache.beam.sdk.io.avro.AvroIOIT.writeThenReadAll(AvroIOIT.java:126)
	at sun.reflect.NativeMethodAccessorImpl.invoke0(Native Method)
	at sun.reflect.NativeMethodAccessorImpl.invoke(NativeMethodAccessorImpl.java:62)
	at sun.reflect.DelegatingMethodAccessorImpl.invoke(DelegatingMethodAccessorImpl.java:43)
	at java.lang.reflect.Method.invoke(Method.java:498)
	at org.junit.runners.model.FrameworkMethod$1.runReflectiveCall(FrameworkMethod.java:50)
	at org.junit.internal.runners.model.ReflectiveCallable.run(ReflectiveCallable.java:12)
	at org.junit.runners.model.FrameworkMethod.invokeExplosively(FrameworkMethod.java:47)
	at org.junit.internal.runners.statements.InvokeMethod.evaluate(InvokeMethod.java:17)
	at org.apache.beam.sdk.testing.TestPipeline$1.evaluate(TestPipeline.java:317)
	at org.junit.rules.RunRules.evaluate(RunRules.java:20)
	at org.junit.runners.ParentRunner.runLeaf(ParentRunner.java:325)
	at org.junit.runners.BlockJUnit4ClassRunner.runChild(BlockJUnit4ClassRunner.java:78)
	at org.junit.runners.BlockJUnit4ClassRunner.runChild(BlockJUnit4ClassRunner.java:57)
	at org.junit.runners.ParentRunner$3.run(ParentRunner.java:290)
	at org.apache.maven.surefire.junitcore.pc.Scheduler$1.run(Scheduler.java:410)
	at java.util.concurrent.Executors$RunnableAdapter.call(Executors.java:511)
	at java.util.concurrent.FutureTask.run(FutureTask.java:266)
	at java.util.concurrent.ThreadPoolExecutor.runWorker(ThreadPoolExecutor.java:1149)
	at java.util.concurrent.ThreadPoolExecutor$Worker.run(ThreadPoolExecutor.java:624)
	at java.lang.Thread.run(Thread.java:748)
Caused by: java.lang.ClassNotFoundException: org.apache.beam.runners.core.SplittableParDoViaKeyedWorkItems$ProcessElements
	at java.net.URLClassLoader.findClass(URLClassLoader.java:381)
	at java.lang.ClassLoader.loadClass(ClassLoader.java:424)
	at sun.misc.Launcher$AppClassLoader.loadClass(Launcher.java:338)
	at java.lang.ClassLoader.loadClass(ClassLoader.java:357)
	... 40 more

[INFO] 
[INFO] Results:
[INFO] 
[ERROR] Errors: 
[ERROR]   AvroIOIT.writeThenReadAll:126  NoClassDefFound org/apache/beam/runners/core/S...
[INFO] 
[ERROR] Tests run: 1, Failures: 0, Errors: 1, Skipped: 0
[INFO] 
[INFO] 
[INFO] --- maven-dependency-plugin:3.0.2:analyze-only (default) @ beam-sdks-java-io-file-based-io-tests
---
[INFO] No dependency problems found
[INFO] 
[INFO] --- maven-failsafe-plugin:2.21.0:verify (default) @ beam-sdks-java-io-file-based-io-tests
---
[INFO] Failsafe report directory: <https://builds.apache.org/job/beam_PerformanceTests_AvroIOIT/ws/runs/b14b8c4f/beam/sdks/java/io/file-based-io-tests/target/failsafe-reports>
[INFO] ------------------------------------------------------------------------
[INFO] BUILD FAILURE
[INFO] ------------------------------------------------------------------------
[INFO] Total time: 40.436 s
[INFO] Finished at: 2018-04-06T18:04:14Z
[INFO] Final Memory: 79M/812M
[INFO] ------------------------------------------------------------------------
[ERROR] Failed to execute goal org.apache.maven.plugins:maven-failsafe-plugin:2.21.0:verify
(default) on project beam-sdks-java-io-file-based-io-tests: There are test failures.
[ERROR] 
[ERROR] Please refer to <https://builds.apache.org/job/beam_PerformanceTests_AvroIOIT/ws/runs/b14b8c4f/beam/sdks/java/io/file-based-io-tests/target/failsafe-reports>
for the individual test results.
[ERROR] Please refer to dump files (if any exist) [date]-jvmRun[N].dump, [date].dumpstream
and [date]-jvmRun[N].dumpstream.
[ERROR] -> [Help 1]
org.apache.maven.lifecycle.LifecycleExecutionException: Failed to execute goal org.apache.maven.plugins:maven-failsafe-plugin:2.21.0:verify
(default) on project beam-sdks-java-io-file-based-io-tests: There are test failures.

Please refer to <https://builds.apache.org/job/beam_PerformanceTests_AvroIOIT/ws/runs/b14b8c4f/beam/sdks/java/io/file-based-io-tests/target/failsafe-reports>
for the individual test results.
Please refer to dump files (if any exist) [date]-jvmRun[N].dump, [date].dumpstream and [date]-jvmRun[N].dumpstream.
    at org.apache.maven.lifecycle.internal.MojoExecutor.execute (MojoExecutor.java:213)
    at org.apache.maven.lifecycle.internal.MojoExecutor.execute (MojoExecutor.java:154)
    at org.apache.maven.lifecycle.internal.MojoExecutor.execute (MojoExecutor.java:146)
    at org.apache.maven.lifecycle.internal.LifecycleModuleBuilder.buildProject (LifecycleModuleBuilder.java:117)
    at org.apache.maven.lifecycle.internal.LifecycleModuleBuilder.buildProject (LifecycleModuleBuilder.java:81)
    at org.apache.maven.lifecycle.internal.builder.singlethreaded.SingleThreadedBuilder.build
(SingleThreadedBuilder.java:51)
    at org.apache.maven.lifecycle.internal.LifecycleStarter.execute (LifecycleStarter.java:128)
    at org.apache.maven.DefaultMaven.doExecute (DefaultMaven.java:309)
    at org.apache.maven.DefaultMaven.doExecute (DefaultMaven.java:194)
    at org.apache.maven.DefaultMaven.execute (DefaultMaven.java:107)
    at org.apache.maven.cli.MavenCli.execute (MavenCli.java:955)
    at org.apache.maven.cli.MavenCli.doMain (MavenCli.java:290)
    at org.apache.maven.cli.MavenCli.main (MavenCli.java:194)
    at sun.reflect.NativeMethodAccessorImpl.invoke0 (Native Method)
    at sun.reflect.NativeMethodAccessorImpl.invoke (NativeMethodAccessorImpl.java:62)
    at sun.reflect.DelegatingMethodAccessorImpl.invoke (DelegatingMethodAccessorImpl.java:43)
    at java.lang.reflect.Method.invoke (Method.java:498)
    at org.codehaus.plexus.classworlds.launcher.Launcher.launchEnhanced (Launcher.java:289)
    at org.codehaus.plexus.classworlds.launcher.Launcher.launch (Launcher.java:229)
    at org.codehaus.plexus.classworlds.launcher.Launcher.mainWithExitCode (Launcher.java:415)
    at org.codehaus.plexus.classworlds.launcher.Launcher.main (Launcher.java:356)
Caused by: org.apache.maven.plugin.MojoFailureException: There are test failures.

Please refer to <https://builds.apache.org/job/beam_PerformanceTests_AvroIOIT/ws/runs/b14b8c4f/beam/sdks/java/io/file-based-io-tests/target/failsafe-reports>
for the individual test results.
Please refer to dump files (if any exist) [date]-jvmRun[N].dump, [date].dumpstream and [date]-jvmRun[N].dumpstream.
    at org.apache.maven.plugin.surefire.SurefireHelper.throwException (SurefireHelper.java:240)
    at org.apache.maven.plugin.surefire.SurefireHelper.reportExecution (SurefireHelper.java:112)
    at org.apache.maven.plugin.failsafe.VerifyMojo.execute (VerifyMojo.java:192)
    at org.apache.maven.plugin.DefaultBuildPluginManager.executeMojo (DefaultBuildPluginManager.java:134)
    at org.apache.maven.lifecycle.internal.MojoExecutor.execute (MojoExecutor.java:208)
    at org.apache.maven.lifecycle.internal.MojoExecutor.execute (MojoExecutor.java:154)
    at org.apache.maven.lifecycle.internal.MojoExecutor.execute (MojoExecutor.java:146)
    at org.apache.maven.lifecycle.internal.LifecycleModuleBuilder.buildProject (LifecycleModuleBuilder.java:117)
    at org.apache.maven.lifecycle.internal.LifecycleModuleBuilder.buildProject (LifecycleModuleBuilder.java:81)
    at org.apache.maven.lifecycle.internal.builder.singlethreaded.SingleThreadedBuilder.build
(SingleThreadedBuilder.java:51)
    at org.apache.maven.lifecycle.internal.LifecycleStarter.execute (LifecycleStarter.java:128)
    at org.apache.maven.DefaultMaven.doExecute (DefaultMaven.java:309)
    at org.apache.maven.DefaultMaven.doExecute (DefaultMaven.java:194)
    at org.apache.maven.DefaultMaven.execute (DefaultMaven.java:107)
    at org.apache.maven.cli.MavenCli.execute (MavenCli.java:955)
    at org.apache.maven.cli.MavenCli.doMain (MavenCli.java:290)
    at org.apache.maven.cli.MavenCli.main (MavenCli.java:194)
    at sun.reflect.NativeMethodAccessorImpl.invoke0 (Native Method)
    at sun.reflect.NativeMethodAccessorImpl.invoke (NativeMethodAccessorImpl.java:62)
    at sun.reflect.DelegatingMethodAccessorImpl.invoke (DelegatingMethodAccessorImpl.java:43)
    at java.lang.reflect.Method.invoke (Method.java:498)
    at org.codehaus.plexus.classworlds.launcher.Launcher.launchEnhanced (Launcher.java:289)
    at org.codehaus.plexus.classworlds.launcher.Launcher.launch (Launcher.java:229)
    at org.codehaus.plexus.classworlds.launcher.Launcher.mainWithExitCode (Launcher.java:415)
    at org.codehaus.plexus.classworlds.launcher.Launcher.main (Launcher.java:356)
[ERROR] 
[ERROR] Re-run Maven using the -X switch to enable full debug logging.
[ERROR] 
[ERROR] For more information about the errors and possible solutions, please read the following
articles:
[ERROR] [Help 1] http://cwiki.apache.org/confluence/display/MAVEN/MojoFailureException

STDERR: 
2018-04-06 18:04:15,389 b14b8c4f MainThread beam_integration_benchmark(1/1) ERROR    Error
during benchmark beam_integration_benchmark
Traceback (most recent call last):
  File "<https://builds.apache.org/job/beam_PerformanceTests_AvroIOIT/ws/PerfKitBenchmarker/perfkitbenchmarker/pkb.py",>
line 624, in RunBenchmark
    DoRunPhase(spec, collector, detailed_timer)
  File "<https://builds.apache.org/job/beam_PerformanceTests_AvroIOIT/ws/PerfKitBenchmarker/perfkitbenchmarker/pkb.py",>
line 527, in DoRunPhase
    samples = spec.BenchmarkRun(spec)
  File "<https://builds.apache.org/job/beam_PerformanceTests_AvroIOIT/ws/PerfKitBenchmarker/perfkitbenchmarker/linux_benchmarks/beam_integration_benchmark.py",>
line 159, in Run
    job_type=job_type)
  File "<https://builds.apache.org/job/beam_PerformanceTests_AvroIOIT/ws/PerfKitBenchmarker/perfkitbenchmarker/providers/gcp/gcp_dpb_dataflow.py",>
line 90, in SubmitJob
    assert retcode == 0, "Integration Test Failed."
AssertionError: Integration Test Failed.
2018-04-06 18:04:15,390 b14b8c4f MainThread beam_integration_benchmark(1/1) INFO     Cleaning
up benchmark beam_integration_benchmark
2018-04-06 18:04:15,392 b14b8c4f MainThread beam_integration_benchmark(1/1) ERROR    Exception
running benchmark
Traceback (most recent call last):
  File "<https://builds.apache.org/job/beam_PerformanceTests_AvroIOIT/ws/PerfKitBenchmarker/perfkitbenchmarker/pkb.py",>
line 758, in RunBenchmarkTask
    RunBenchmark(spec, collector)
  File "<https://builds.apache.org/job/beam_PerformanceTests_AvroIOIT/ws/PerfKitBenchmarker/perfkitbenchmarker/pkb.py",>
line 624, in RunBenchmark
    DoRunPhase(spec, collector, detailed_timer)
  File "<https://builds.apache.org/job/beam_PerformanceTests_AvroIOIT/ws/PerfKitBenchmarker/perfkitbenchmarker/pkb.py",>
line 527, in DoRunPhase
    samples = spec.BenchmarkRun(spec)
  File "<https://builds.apache.org/job/beam_PerformanceTests_AvroIOIT/ws/PerfKitBenchmarker/perfkitbenchmarker/linux_benchmarks/beam_integration_benchmark.py",>
line 159, in Run
    job_type=job_type)
  File "<https://builds.apache.org/job/beam_PerformanceTests_AvroIOIT/ws/PerfKitBenchmarker/perfkitbenchmarker/providers/gcp/gcp_dpb_dataflow.py",>
line 90, in SubmitJob
    assert retcode == 0, "Integration Test Failed."
AssertionError: Integration Test Failed.
2018-04-06 18:04:15,392 b14b8c4f MainThread beam_integration_benchmark(1/1) ERROR    Benchmark
1/1 beam_integration_benchmark (UID: beam_integration_benchmark0) failed. Execution will continue.
2018-04-06 18:04:15,441 b14b8c4f MainThread INFO     Benchmark run statuses:
---------------------------------------------------------------------------------
Name                        UID                          Status  Failed Substatus
---------------------------------------------------------------------------------
beam_integration_benchmark  beam_integration_benchmark0  FAILED                  
---------------------------------------------------------------------------------
Success rate: 0.00% (0/1)
2018-04-06 18:04:15,442 b14b8c4f MainThread INFO     Complete logs can be found at: <https://builds.apache.org/job/beam_PerformanceTests_AvroIOIT/ws/runs/b14b8c4f/pkb.log>
2018-04-06 18:04:15,442 b14b8c4f MainThread INFO     Completion statuses can be found at:
<https://builds.apache.org/job/beam_PerformanceTests_AvroIOIT/ws/runs/b14b8c4f/completion_statuses.json>
Build step 'Execute shell' marked build as failure

Mime
View raw message