beam-commits mailing list archives

Site index · List index
Message view « Date » · « Thread »
Top « Date » · « Thread »
From Apache Jenkins Server <jenk...@builds.apache.org>
Subject Build failed in Jenkins: beam_PostCommit_Java_ValidatesRunner_Dataflow_Gradle #17
Date Mon, 09 Apr 2018 16:17:39 GMT
See <https://builds.apache.org/job/beam_PostCommit_Java_ValidatesRunner_Dataflow_Gradle/17/display/redirect?page=changes>

Changes:

[lcwik] Attempt to produce release artifacts.

[lcwik] Sign the published artifacts.

[lcwik] Rename a few of the projects so that the artifact names are correctly

[lcwik] Rewrite even more names.

[lcwik] fixup! fix a few names

[swegner] Add Apache header into generated POM

[lcwik] Finish renaming the projects so that they produce valid maven artifact

[lcwik] Gate signing/publishing configuration on 'release', 'publishing' project

[swegner] Use correct project description in generated pom

[swegner] Add license to generated poms

[swegner] Add scm information to generated pom

[swegner] Add JIRA information to generated pom

[swegner] Add mailing list information to generated pom

[swegner] Add developer info to generated pom files

[swegner] Add top-level metadata to generate poms

[alan.myrvold] only sign when releasing, to avoid gpg erors

[lcwik] Add exclusion rules that are defined on the configuration and the

[lcwik] Only apply maven-publish / signing plugins if actually needed.

[lcwik] Fix relocated paths after renaming modules.

[swegner] Fix Apache license header in generated POM.

[swegner] fixup: tabs -> spaces

[lcwik] Publish shaded jars when signing

[lcwik] Mirate back to using compile as the dependency type since our archetypes

[lcwik] Also publish the beam-sdks-java-harness package.

[lcwik] Move signing configuration under same block that controls whether

[swegner] Add proper descriptions to generated pom files.

[lcwik] Minor description clean-ups.

[swegner] fixup: Update project name to new convention

[swegner2] Address some comments on PR/5048 (#19)

[swegner] Move generated pom configuration into build_rules.gradle.

------------------------------------------
Started by GitHub push by lukecwik
[EnvInject] - Loading node environment variables.
Building remotely on beam6 (beam) in workspace <https://builds.apache.org/job/beam_PostCommit_Java_ValidatesRunner_Dataflow_Gradle/ws/>
 > git rev-parse --is-inside-work-tree # timeout=10
Fetching changes from the remote Git repository
 > git config remote.origin.url https://github.com/apache/beam.git # timeout=10
Fetching upstream changes from https://github.com/apache/beam.git
 > git --version # timeout=10
 > git fetch --tags --progress https://github.com/apache/beam.git +refs/heads/*:refs/remotes/origin/*
+refs/pull/${ghprbPullId}/*:refs/remotes/origin/pr/${ghprbPullId}/*
 > git rev-parse origin/master^{commit} # timeout=10
Checking out Revision fb6ba3bfd43605a0f4944828b5f19e75840fa7aa (origin/master)
 > git config core.sparsecheckout # timeout=10
 > git checkout -f fb6ba3bfd43605a0f4944828b5f19e75840fa7aa
Commit message: "[BEAM-3255] Updates to support the release process via Gradle"
 > git rev-list --no-walk c2d674448611d0490804533b96c41ba05e071572 # timeout=10
Cleaning workspace
 > git rev-parse --verify HEAD # timeout=10
Resetting working tree
 > git reset --hard # timeout=10
 > git clean -fdx # timeout=10
[EnvInject] - Executing scripts and injecting environment variables after the SCM step.
[EnvInject] - Injecting as environment variables the properties content 
SPARK_LOCAL_IP=127.0.0.1

[EnvInject] - Variables injected successfully.
[Gradle] - Launching build.
[src] $ <https://builds.apache.org/job/beam_PostCommit_Java_ValidatesRunner_Dataflow_Gradle/ws/src/gradlew>
--info --continue --rerun-tasks :runners:google-cloud-dataflow-java:validatesRunner
Initialized native services in: /home/jenkins/.gradle/native
Using 4 worker leases.
Starting Build
Compiling settings file '<https://builds.apache.org/job/beam_PostCommit_Java_ValidatesRunner_Dataflow_Gradle/ws/src/settings.gradle'>
using SubsetScriptTransformer.
Compiling settings file '<https://builds.apache.org/job/beam_PostCommit_Java_ValidatesRunner_Dataflow_Gradle/ws/src/settings.gradle'>
using BuildScriptTransformer.
Settings evaluated using settings file '<https://builds.apache.org/job/beam_PostCommit_Java_ValidatesRunner_Dataflow_Gradle/ws/src/settings.gradle'.>
Projects loaded. Root project using build file '<https://builds.apache.org/job/beam_PostCommit_Java_ValidatesRunner_Dataflow_Gradle/ws/src/build.gradle'.>
Included projects: [root project 'beam', project ':beam-examples-java', project ':beam-local-artifact-service-java',
project ':beam-model-fn-execution', project ':beam-model-job-management', project ':beam-model-pipeline',
project ':beam-runners-apex', project ':beam-runners-core-construction-java', project ':beam-runners-core-java',
project ':beam-runners-direct-java', project ':beam-runners-flink_2.11', project ':beam-runners-gcp-gcemd',
project ':beam-runners-gcp-gcsproxy', project ':beam-runners-gearpump', project ':beam-runners-google-cloud-dataflow-java',
project ':beam-runners-java-fn-execution', project ':beam-runners-local-java-core', project
':beam-runners-reference-java', project ':beam-runners-reference-job-server', project ':beam-runners-spark',
project ':beam-sdks-go', project ':beam-sdks-go-container', project ':beam-sdks-go-examples',
project ':beam-sdks-java-build-tools', project ':beam-sdks-java-container', project ':beam-sdks-java-core',
project ':beam-sdks-java-extensions-google-cloud-platform-core', project ':beam-sdks-java-extensions-join-library',
project ':beam-sdks-java-extensions-json-jackson', project ':beam-sdks-java-extensions-protobuf',
project ':beam-sdks-java-extensions-sketching', project ':beam-sdks-java-extensions-sorter',
project ':beam-sdks-java-extensions-sql', project ':beam-sdks-java-fn-execution', project
':beam-sdks-java-harness', project ':beam-sdks-java-io-amazon-web-services', project ':beam-sdks-java-io-amqp',
project ':beam-sdks-java-io-cassandra', project ':beam-sdks-java-io-common', project ':beam-sdks-java-io-elasticsearch',
project ':beam-sdks-java-io-elasticsearch-tests-2', project ':beam-sdks-java-io-elasticsearch-tests-5',
project ':beam-sdks-java-io-elasticsearch-tests-common', project ':beam-sdks-java-io-file-based-io-tests',
project ':beam-sdks-java-io-google-cloud-platform', project ':beam-sdks-java-io-hadoop-common',
project ':beam-sdks-java-io-hadoop-file-system', project ':beam-sdks-java-io-hadoop-input-format',
project ':beam-sdks-java-io-hbase', project ':beam-sdks-java-io-hcatalog', project ':beam-sdks-java-io-jdbc',
project ':beam-sdks-java-io-jms', project ':beam-sdks-java-io-kafka', project ':beam-sdks-java-io-kinesis',
project ':beam-sdks-java-io-mongodb', project ':beam-sdks-java-io-mqtt', project ':beam-sdks-java-io-redis',
project ':beam-sdks-java-io-solr', project ':beam-sdks-java-io-tika', project ':beam-sdks-java-io-xml',
project ':beam-sdks-java-maven-archetypes-examples', project ':beam-sdks-java-maven-archetypes-starter',
project ':beam-sdks-java-nexmark', project ':beam-sdks-python', project ':beam-sdks-python-container',
project ':release']
Parallel execution with configuration on demand is an incubating feature.
Evaluating root project 'beam' using build file '<https://builds.apache.org/job/beam_PostCommit_Java_ValidatesRunner_Dataflow_Gradle/ws/src/build.gradle'.>
Compiling build file '<https://builds.apache.org/job/beam_PostCommit_Java_ValidatesRunner_Dataflow_Gradle/ws/src/build.gradle'>
using SubsetScriptTransformer.
Compiling build file '<https://builds.apache.org/job/beam_PostCommit_Java_ValidatesRunner_Dataflow_Gradle/ws/src/build.gradle'>
using BuildScriptTransformer.
Compiling script '<https://builds.apache.org/job/beam_PostCommit_Java_ValidatesRunner_Dataflow_Gradle/ws/src/build_rules.gradle'>
using SubsetScriptTransformer.
Compiling script '<https://builds.apache.org/job/beam_PostCommit_Java_ValidatesRunner_Dataflow_Gradle/ws/src/build_rules.gradle'>
using BuildScriptTransformer.
Applying build_rules.gradle to beam
Offline dependencies root configured at 'offline-repository'
Adding 47 .gitignore exclusions to Apache Rat

FAILURE: Build failed with an exception.

* What went wrong:
Project 'runners' not found in root project 'beam'.

* Try:
Run with --stacktrace option to get the stack trace. Run with --debug option to get more log
output. Run with --scan to get full insights.

* Get more help at https://help.gradle.org

BUILD FAILED in 6s
Build step 'Invoke Gradle script' changed build result to FAILURE
Build step 'Invoke Gradle script' marked build as failure
Recording test results
ERROR: Step ‘Publish JUnit test result report’ failed: No test report files were found.
Configuration error?
Not sending mail to unregistered user swegner@google.com
Not sending mail to unregistered user relax@relax-macbookpro2.roam.corp.google.com
Not sending mail to unregistered user ccy@google.com
Not sending mail to unregistered user alan.myrvold@comcast.net
Not sending mail to unregistered user swegner2@gmail.com
Not sending mail to unregistered user herohde@google.com
Not sending mail to unregistered user wcn@google.com

Mime
View raw message