beam-commits mailing list archives

Site index · List index
Message view « Date » · « Thread »
Top « Date » · « Thread »
From Apache Jenkins Server <jenk...@builds.apache.org>
Subject Build failed in Jenkins: beam_PostCommit_Python_Verify #4564
Date Mon, 02 Apr 2018 18:51:48 GMT
See <https://builds.apache.org/job/beam_PostCommit_Python_Verify/4564/display/redirect>

------------------------------------------
[...truncated 1013.93 KB...]
copying apache_beam/runners/direct/consumer_tracking_pipeline_visitor.py -> apache-beam-2.5.0.dev0/apache_beam/runners/direct
copying apache_beam/runners/direct/consumer_tracking_pipeline_visitor_test.py -> apache-beam-2.5.0.dev0/apache_beam/runners/direct
copying apache_beam/runners/direct/direct_metrics.py -> apache-beam-2.5.0.dev0/apache_beam/runners/direct
copying apache_beam/runners/direct/direct_metrics_test.py -> apache-beam-2.5.0.dev0/apache_beam/runners/direct
copying apache_beam/runners/direct/direct_runner.py -> apache-beam-2.5.0.dev0/apache_beam/runners/direct
copying apache_beam/runners/direct/direct_runner_test.py -> apache-beam-2.5.0.dev0/apache_beam/runners/direct
copying apache_beam/runners/direct/evaluation_context.py -> apache-beam-2.5.0.dev0/apache_beam/runners/direct
copying apache_beam/runners/direct/executor.py -> apache-beam-2.5.0.dev0/apache_beam/runners/direct
copying apache_beam/runners/direct/helper_transforms.py -> apache-beam-2.5.0.dev0/apache_beam/runners/direct
copying apache_beam/runners/direct/sdf_direct_runner.py -> apache-beam-2.5.0.dev0/apache_beam/runners/direct
copying apache_beam/runners/direct/sdf_direct_runner_test.py -> apache-beam-2.5.0.dev0/apache_beam/runners/direct
copying apache_beam/runners/direct/transform_evaluator.py -> apache-beam-2.5.0.dev0/apache_beam/runners/direct
copying apache_beam/runners/direct/util.py -> apache-beam-2.5.0.dev0/apache_beam/runners/direct
copying apache_beam/runners/direct/watermark_manager.py -> apache-beam-2.5.0.dev0/apache_beam/runners/direct
copying apache_beam/runners/experimental/__init__.py -> apache-beam-2.5.0.dev0/apache_beam/runners/experimental
copying apache_beam/runners/experimental/python_rpc_direct/__init__.py -> apache-beam-2.5.0.dev0/apache_beam/runners/experimental/python_rpc_direct
copying apache_beam/runners/experimental/python_rpc_direct/python_rpc_direct_runner.py ->
apache-beam-2.5.0.dev0/apache_beam/runners/experimental/python_rpc_direct
copying apache_beam/runners/experimental/python_rpc_direct/server.py -> apache-beam-2.5.0.dev0/apache_beam/runners/experimental/python_rpc_direct
copying apache_beam/runners/job/__init__.py -> apache-beam-2.5.0.dev0/apache_beam/runners/job
copying apache_beam/runners/job/manager.py -> apache-beam-2.5.0.dev0/apache_beam/runners/job
copying apache_beam/runners/job/utils.py -> apache-beam-2.5.0.dev0/apache_beam/runners/job
copying apache_beam/runners/portability/__init__.py -> apache-beam-2.5.0.dev0/apache_beam/runners/portability
copying apache_beam/runners/portability/fn_api_runner.py -> apache-beam-2.5.0.dev0/apache_beam/runners/portability
copying apache_beam/runners/portability/fn_api_runner_test.py -> apache-beam-2.5.0.dev0/apache_beam/runners/portability
copying apache_beam/runners/portability/universal_local_runner.py -> apache-beam-2.5.0.dev0/apache_beam/runners/portability
copying apache_beam/runners/portability/universal_local_runner_main.py -> apache-beam-2.5.0.dev0/apache_beam/runners/portability
copying apache_beam/runners/portability/universal_local_runner_test.py -> apache-beam-2.5.0.dev0/apache_beam/runners/portability
copying apache_beam/runners/test/__init__.py -> apache-beam-2.5.0.dev0/apache_beam/runners/test
copying apache_beam/runners/worker/__init__.py -> apache-beam-2.5.0.dev0/apache_beam/runners/worker
copying apache_beam/runners/worker/bundle_processor.py -> apache-beam-2.5.0.dev0/apache_beam/runners/worker
copying apache_beam/runners/worker/data_plane.py -> apache-beam-2.5.0.dev0/apache_beam/runners/worker
copying apache_beam/runners/worker/data_plane_test.py -> apache-beam-2.5.0.dev0/apache_beam/runners/worker
copying apache_beam/runners/worker/log_handler.py -> apache-beam-2.5.0.dev0/apache_beam/runners/worker
copying apache_beam/runners/worker/log_handler_test.py -> apache-beam-2.5.0.dev0/apache_beam/runners/worker
copying apache_beam/runners/worker/logger.pxd -> apache-beam-2.5.0.dev0/apache_beam/runners/worker
copying apache_beam/runners/worker/logger.py -> apache-beam-2.5.0.dev0/apache_beam/runners/worker
copying apache_beam/runners/worker/logger_test.py -> apache-beam-2.5.0.dev0/apache_beam/runners/worker
copying apache_beam/runners/worker/opcounters.pxd -> apache-beam-2.5.0.dev0/apache_beam/runners/worker
copying apache_beam/runners/worker/opcounters.py -> apache-beam-2.5.0.dev0/apache_beam/runners/worker
copying apache_beam/runners/worker/opcounters_test.py -> apache-beam-2.5.0.dev0/apache_beam/runners/worker
copying apache_beam/runners/worker/operation_specs.py -> apache-beam-2.5.0.dev0/apache_beam/runners/worker
copying apache_beam/runners/worker/operations.pxd -> apache-beam-2.5.0.dev0/apache_beam/runners/worker
copying apache_beam/runners/worker/operations.py -> apache-beam-2.5.0.dev0/apache_beam/runners/worker
copying apache_beam/runners/worker/sdk_worker.py -> apache-beam-2.5.0.dev0/apache_beam/runners/worker
copying apache_beam/runners/worker/sdk_worker_main.py -> apache-beam-2.5.0.dev0/apache_beam/runners/worker
copying apache_beam/runners/worker/sdk_worker_main_test.py -> apache-beam-2.5.0.dev0/apache_beam/runners/worker
copying apache_beam/runners/worker/sdk_worker_test.py -> apache-beam-2.5.0.dev0/apache_beam/runners/worker
copying apache_beam/runners/worker/sideinputs.py -> apache-beam-2.5.0.dev0/apache_beam/runners/worker
copying apache_beam/runners/worker/sideinputs_test.py -> apache-beam-2.5.0.dev0/apache_beam/runners/worker
copying apache_beam/runners/worker/statesampler.py -> apache-beam-2.5.0.dev0/apache_beam/runners/worker
copying apache_beam/runners/worker/statesampler_fast.pyx -> apache-beam-2.5.0.dev0/apache_beam/runners/worker
copying apache_beam/runners/worker/statesampler_slow.py -> apache-beam-2.5.0.dev0/apache_beam/runners/worker
copying apache_beam/runners/worker/statesampler_test.py -> apache-beam-2.5.0.dev0/apache_beam/runners/worker
copying apache_beam/runners/worker/worker_id_interceptor.py -> apache-beam-2.5.0.dev0/apache_beam/runners/worker
copying apache_beam/runners/worker/worker_id_interceptor_test.py -> apache-beam-2.5.0.dev0/apache_beam/runners/worker
copying apache_beam/testing/__init__.py -> apache-beam-2.5.0.dev0/apache_beam/testing
copying apache_beam/testing/pipeline_verifiers.py -> apache-beam-2.5.0.dev0/apache_beam/testing
copying apache_beam/testing/pipeline_verifiers_test.py -> apache-beam-2.5.0.dev0/apache_beam/testing
copying apache_beam/testing/test_pipeline.py -> apache-beam-2.5.0.dev0/apache_beam/testing
copying apache_beam/testing/test_pipeline_test.py -> apache-beam-2.5.0.dev0/apache_beam/testing
copying apache_beam/testing/test_stream.py -> apache-beam-2.5.0.dev0/apache_beam/testing
copying apache_beam/testing/test_stream_test.py -> apache-beam-2.5.0.dev0/apache_beam/testing
copying apache_beam/testing/test_utils.py -> apache-beam-2.5.0.dev0/apache_beam/testing
copying apache_beam/testing/test_utils_test.py -> apache-beam-2.5.0.dev0/apache_beam/testing
copying apache_beam/testing/util.py -> apache-beam-2.5.0.dev0/apache_beam/testing
copying apache_beam/testing/util_test.py -> apache-beam-2.5.0.dev0/apache_beam/testing
copying apache_beam/testing/data/standard_coders.yaml -> apache-beam-2.5.0.dev0/apache_beam/testing/data
copying apache_beam/testing/data/trigger_transcripts.yaml -> apache-beam-2.5.0.dev0/apache_beam/testing/data
copying apache_beam/tools/__init__.py -> apache-beam-2.5.0.dev0/apache_beam/tools
copying apache_beam/tools/distribution_counter_microbenchmark.py -> apache-beam-2.5.0.dev0/apache_beam/tools
copying apache_beam/tools/map_fn_microbenchmark.py -> apache-beam-2.5.0.dev0/apache_beam/tools
copying apache_beam/tools/utils.py -> apache-beam-2.5.0.dev0/apache_beam/tools
copying apache_beam/transforms/__init__.py -> apache-beam-2.5.0.dev0/apache_beam/transforms
copying apache_beam/transforms/combiners.py -> apache-beam-2.5.0.dev0/apache_beam/transforms
copying apache_beam/transforms/combiners_test.py -> apache-beam-2.5.0.dev0/apache_beam/transforms
copying apache_beam/transforms/core.py -> apache-beam-2.5.0.dev0/apache_beam/transforms
copying apache_beam/transforms/create_test.py -> apache-beam-2.5.0.dev0/apache_beam/transforms
copying apache_beam/transforms/cy_combiners.pxd -> apache-beam-2.5.0.dev0/apache_beam/transforms
copying apache_beam/transforms/cy_combiners.py -> apache-beam-2.5.0.dev0/apache_beam/transforms
copying apache_beam/transforms/cy_combiners_test.py -> apache-beam-2.5.0.dev0/apache_beam/transforms
copying apache_beam/transforms/display.py -> apache-beam-2.5.0.dev0/apache_beam/transforms
copying apache_beam/transforms/display_test.py -> apache-beam-2.5.0.dev0/apache_beam/transforms
copying apache_beam/transforms/ptransform.py -> apache-beam-2.5.0.dev0/apache_beam/transforms
copying apache_beam/transforms/ptransform_test.py -> apache-beam-2.5.0.dev0/apache_beam/transforms
copying apache_beam/transforms/sideinputs.py -> apache-beam-2.5.0.dev0/apache_beam/transforms
copying apache_beam/transforms/sideinputs_test.py -> apache-beam-2.5.0.dev0/apache_beam/transforms
copying apache_beam/transforms/timeutil.py -> apache-beam-2.5.0.dev0/apache_beam/transforms
copying apache_beam/transforms/trigger.py -> apache-beam-2.5.0.dev0/apache_beam/transforms
copying apache_beam/transforms/trigger_test.py -> apache-beam-2.5.0.dev0/apache_beam/transforms
copying apache_beam/transforms/util.py -> apache-beam-2.5.0.dev0/apache_beam/transforms
copying apache_beam/transforms/util_test.py -> apache-beam-2.5.0.dev0/apache_beam/transforms
copying apache_beam/transforms/window.py -> apache-beam-2.5.0.dev0/apache_beam/transforms
copying apache_beam/transforms/window_test.py -> apache-beam-2.5.0.dev0/apache_beam/transforms
copying apache_beam/transforms/write_ptransform_test.py -> apache-beam-2.5.0.dev0/apache_beam/transforms
copying apache_beam/typehints/__init__.py -> apache-beam-2.5.0.dev0/apache_beam/typehints
copying apache_beam/typehints/decorators.py -> apache-beam-2.5.0.dev0/apache_beam/typehints
copying apache_beam/typehints/native_type_compatibility.py -> apache-beam-2.5.0.dev0/apache_beam/typehints
copying apache_beam/typehints/native_type_compatibility_test.py -> apache-beam-2.5.0.dev0/apache_beam/typehints
copying apache_beam/typehints/opcodes.py -> apache-beam-2.5.0.dev0/apache_beam/typehints
copying apache_beam/typehints/trivial_inference.py -> apache-beam-2.5.0.dev0/apache_beam/typehints
copying apache_beam/typehints/trivial_inference_test.py -> apache-beam-2.5.0.dev0/apache_beam/typehints
copying apache_beam/typehints/typecheck.py -> apache-beam-2.5.0.dev0/apache_beam/typehints
copying apache_beam/typehints/typed_pipeline_test.py -> apache-beam-2.5.0.dev0/apache_beam/typehints
copying apache_beam/typehints/typehints.py -> apache-beam-2.5.0.dev0/apache_beam/typehints
copying apache_beam/typehints/typehints_test.py -> apache-beam-2.5.0.dev0/apache_beam/typehints
copying apache_beam/utils/__init__.py -> apache-beam-2.5.0.dev0/apache_beam/utils
copying apache_beam/utils/annotations.py -> apache-beam-2.5.0.dev0/apache_beam/utils
copying apache_beam/utils/annotations_test.py -> apache-beam-2.5.0.dev0/apache_beam/utils
copying apache_beam/utils/counters.pxd -> apache-beam-2.5.0.dev0/apache_beam/utils
copying apache_beam/utils/counters.py -> apache-beam-2.5.0.dev0/apache_beam/utils
copying apache_beam/utils/counters_test.py -> apache-beam-2.5.0.dev0/apache_beam/utils
copying apache_beam/utils/plugin.py -> apache-beam-2.5.0.dev0/apache_beam/utils
copying apache_beam/utils/processes.py -> apache-beam-2.5.0.dev0/apache_beam/utils
copying apache_beam/utils/processes_test.py -> apache-beam-2.5.0.dev0/apache_beam/utils
copying apache_beam/utils/profiler.py -> apache-beam-2.5.0.dev0/apache_beam/utils
copying apache_beam/utils/proto_utils.py -> apache-beam-2.5.0.dev0/apache_beam/utils
copying apache_beam/utils/retry.py -> apache-beam-2.5.0.dev0/apache_beam/utils
copying apache_beam/utils/retry_test.py -> apache-beam-2.5.0.dev0/apache_beam/utils
copying apache_beam/utils/timestamp.py -> apache-beam-2.5.0.dev0/apache_beam/utils
copying apache_beam/utils/timestamp_test.py -> apache-beam-2.5.0.dev0/apache_beam/utils
copying apache_beam/utils/urns.py -> apache-beam-2.5.0.dev0/apache_beam/utils
copying apache_beam/utils/windowed_value.pxd -> apache-beam-2.5.0.dev0/apache_beam/utils
copying apache_beam/utils/windowed_value.py -> apache-beam-2.5.0.dev0/apache_beam/utils
copying apache_beam/utils/windowed_value_test.py -> apache-beam-2.5.0.dev0/apache_beam/utils
Writing apache-beam-2.5.0.dev0/setup.cfg
creating dist
Creating tar archive
removing 'apache-beam-2.5.0.dev0' (and everything under it)

SDK_LOCATION=$(find dist/apache-beam-*.tar.gz)
find dist/apache-beam-*.tar.gz

# Run integration tests on the Google Cloud Dataflow service
# and validate that jobs finish successfully.
echo ">>> RUNNING TEST DATAFLOW RUNNER it tests"
>>> RUNNING TEST DATAFLOW RUNNER it tests
python setup.py nosetests \
  --attr IT \
  --nocapture \
  --processes=4 \
  --process-timeout=900 \
  --test-pipeline-options=" \
    --runner=TestDataflowRunner \
    --project=$PROJECT \
    --staging_location=$GCS_LOCATION/staging-it \
    --temp_location=$GCS_LOCATION/temp-it \
    --output=$GCS_LOCATION/py-it-cloud/output \
    --sdk_location=$SDK_LOCATION \
    --num_workers=1 \
    --sleep_secs=20"
<https://builds.apache.org/job/beam_PostCommit_Python_Verify/ws/src/sdks/python/local/lib/python2.7/site-packages/setuptools/dist.py>:397:
UserWarning: Normalizing '2.5.0.dev' to '2.5.0.dev0'
  normalized_version,
running nosetests
running egg_info
writing requirements to apache_beam.egg-info/requires.txt
writing apache_beam.egg-info/PKG-INFO
writing top-level names to apache_beam.egg-info/top_level.txt
writing dependency_links to apache_beam.egg-info/dependency_links.txt
writing entry points to apache_beam.egg-info/entry_points.txt
reading manifest file 'apache_beam.egg-info/SOURCES.txt'
reading manifest template 'MANIFEST.in'
warning: no files found matching 'README.md'
warning: no files found matching 'NOTICE'
warning: no files found matching 'LICENSE'
writing manifest file 'apache_beam.egg-info/SOURCES.txt'
<https://builds.apache.org/job/beam_PostCommit_Python_Verify/ws/src/sdks/python/apache_beam/io/gcp/gcsio.py>:168:
DeprecationWarning: object() takes no parameters
  super(GcsIO, cls).__new__(cls, storage_client))
<https://builds.apache.org/job/beam_PostCommit_Python_Verify/ws/src/sdks/python/apache_beam/io/gcp/gcsio.py>:168:
DeprecationWarning: object() takes no parameters
  super(GcsIO, cls).__new__(cls, storage_client))
<https://builds.apache.org/job/beam_PostCommit_Python_Verify/ws/src/sdks/python/apache_beam/runners/dataflow/test_dataflow_runner.py>:49:
DeprecationWarning: options is deprecated since First stable release.. References to <pipeline>.options
will not be supported
  print('Found: %s.' % self.build_console_url(pipeline.options))
<https://builds.apache.org/job/beam_PostCommit_Python_Verify/ws/src/sdks/python/apache_beam/runners/dataflow/test_dataflow_runner.py>:49:
DeprecationWarning: options is deprecated since First stable release.. References to <pipeline>.options
will not be supported
  print('Found: %s.' % self.build_console_url(pipeline.options))
<https://builds.apache.org/job/beam_PostCommit_Python_Verify/ws/src/sdks/python/apache_beam/runners/dataflow/test_dataflow_runner.py>:49:
DeprecationWarning: options is deprecated since First stable release.. References to <pipeline>.options
will not be supported
  print('Found: %s.' % self.build_console_url(pipeline.options))
<https://builds.apache.org/job/beam_PostCommit_Python_Verify/ws/src/sdks/python/apache_beam/runners/dataflow/dataflow_runner.py>:743:
DeprecationWarning: options is deprecated since First stable release.. References to <pipeline>.options
will not be supported
  transform_node.inputs[0].pipeline.options.view_as(StandardOptions))
<https://builds.apache.org/job/beam_PostCommit_Python_Verify/ws/src/sdks/python/apache_beam/runners/dataflow/test_dataflow_runner.py>:49:
DeprecationWarning: options is deprecated since First stable release.. References to <pipeline>.options
will not be supported
  print('Found: %s.' % self.build_console_url(pipeline.options))
test_wordcount_fnapi_it (apache_beam.examples.wordcount_it_test.WordCountIT) ... ok
test_bigquery_tornadoes_it (apache_beam.examples.cookbook.bigquery_tornadoes_it_test.BigqueryTornadoesIT)
... ok
test_wordcount_it (apache_beam.examples.wordcount_it_test.WordCountIT) ... ok
Found: https://console.cloud.google.com/dataflow/jobsDetail/locations/us-central1/jobs/2018-04-02_11_36_59-13656055784273228892?project=apache-beam-testing.
test_streaming_wordcount_it (apache_beam.examples.streaming_wordcount_it_test.StreamingWordCountIT)
... ERROR

======================================================================
ERROR: test_streaming_wordcount_it (apache_beam.examples.streaming_wordcount_it_test.StreamingWordCountIT)
----------------------------------------------------------------------
Traceback (most recent call last):
  File "<https://builds.apache.org/job/beam_PostCommit_Python_Verify/ws/src/sdks/python/local/lib/python2.7/site-packages/nose/plugins/multiprocess.py",>
line 812, in run
    test(orig)
  File "<https://builds.apache.org/job/beam_PostCommit_Python_Verify/ws/src/sdks/python/local/lib/python2.7/site-packages/nose/case.py",>
line 45, in __call__
    return self.run(*arg, **kwarg)
  File "<https://builds.apache.org/job/beam_PostCommit_Python_Verify/ws/src/sdks/python/local/lib/python2.7/site-packages/nose/case.py",>
line 133, in run
    self.runTest(result)
  File "<https://builds.apache.org/job/beam_PostCommit_Python_Verify/ws/src/sdks/python/local/lib/python2.7/site-packages/nose/case.py",>
line 151, in runTest
    test(result)
  File "/usr/lib/python2.7/unittest/case.py", line 395, in __call__
    return self.run(*args, **kwds)
  File "/usr/lib/python2.7/unittest/case.py", line 331, in run
    testMethod()
  File "<https://builds.apache.org/job/beam_PostCommit_Python_Verify/ws/src/sdks/python/apache_beam/examples/streaming_wordcount_it_test.py",>
line 113, in test_streaming_wordcount_it
    self.test_pipeline.get_full_options_as_args(**extra_opts))
  File "<https://builds.apache.org/job/beam_PostCommit_Python_Verify/ws/src/sdks/python/apache_beam/examples/streaming_wordcount.py",>
line 92, in run
    result = p.run()
  File "<https://builds.apache.org/job/beam_PostCommit_Python_Verify/ws/src/sdks/python/apache_beam/pipeline.py",>
line 402, in run
    return self.runner.run_pipeline(self)
  File "<https://builds.apache.org/job/beam_PostCommit_Python_Verify/ws/src/sdks/python/apache_beam/runners/dataflow/test_dataflow_runner.py",>
line 58, in run_pipeline
    hc_assert_that(self.result, pickler.loads(on_success_matcher))
  File "<https://builds.apache.org/job/beam_PostCommit_Python_Verify/ws/src/sdks/python/local/lib/python2.7/site-packages/hamcrest/core/assert_that.py",>
line 43, in assert_that
    _assert_match(actual=arg1, matcher=arg2, reason=arg3)
  File "<https://builds.apache.org/job/beam_PostCommit_Python_Verify/ws/src/sdks/python/local/lib/python2.7/site-packages/hamcrest/core/assert_that.py",>
line 55, in _assert_match
    matcher.describe_mismatch(actual, description)
  File "<https://builds.apache.org/job/beam_PostCommit_Python_Verify/ws/src/sdks/python/local/lib/python2.7/site-packages/hamcrest/core/core/allof.py",>
line 25, in describe_mismatch
    self.matches(item, mismatch_description)
  File "<https://builds.apache.org/job/beam_PostCommit_Python_Verify/ws/src/sdks/python/local/lib/python2.7/site-packages/hamcrest/core/core/allof.py",>
line 16, in matches
    if not matcher.matches(item):
  File "<https://builds.apache.org/job/beam_PostCommit_Python_Verify/ws/src/sdks/python/local/lib/python2.7/site-packages/hamcrest/core/base_matcher.py",>
line 28, in matches
    match_result = self._matches(item)
  File "<https://builds.apache.org/job/beam_PostCommit_Python_Verify/ws/src/sdks/python/apache_beam/io/gcp/tests/pubsub_matcher.py",>
line 81, in _matches
    self.timeout)
  File "<https://builds.apache.org/job/beam_PostCommit_Python_Verify/ws/src/sdks/python/apache_beam/io/gcp/tests/pubsub_matcher.py",>
line 90, in _wait_for_messages
    pulled = subscription.pull(max_messages=MAX_MESSAGES_IN_ONE_PULL)
  File "<https://builds.apache.org/job/beam_PostCommit_Python_Verify/ws/src/sdks/python/local/lib/python2.7/site-packages/google/cloud/pubsub/subscription.py",>
line 367, in pull
    self.full_name, return_immediately, max_messages)
  File "<https://builds.apache.org/job/beam_PostCommit_Python_Verify/ws/src/sdks/python/local/lib/python2.7/site-packages/google/cloud/pubsub/_gax.py",>
line 440, in subscription_pull
    return_immediately=return_immediately)
  File "<https://builds.apache.org/job/beam_PostCommit_Python_Verify/ws/src/sdks/python/local/lib/python2.7/site-packages/google/cloud/gapic/pubsub/v1/subscriber_client.py",>
line 706, in pull
    return self._pull(request, options)
  File "<https://builds.apache.org/job/beam_PostCommit_Python_Verify/ws/src/sdks/python/local/lib/python2.7/site-packages/google/gax/api_callable.py",>
line 452, in inner
    return api_caller(api_call, this_settings, request)
  File "<https://builds.apache.org/job/beam_PostCommit_Python_Verify/ws/src/sdks/python/local/lib/python2.7/site-packages/google/gax/api_callable.py",>
line 438, in base_caller
    return api_call(*args)
  File "<https://builds.apache.org/job/beam_PostCommit_Python_Verify/ws/src/sdks/python/local/lib/python2.7/site-packages/google/gax/api_callable.py",>
line 376, in inner
    return a_func(*args, **kwargs)
  File "<https://builds.apache.org/job/beam_PostCommit_Python_Verify/ws/src/sdks/python/local/lib/python2.7/site-packages/google/gax/retry.py",>
line 135, in inner
    time.sleep(to_sleep / _MILLIS_PER_SECOND)
  File "<https://builds.apache.org/job/beam_PostCommit_Python_Verify/ws/src/sdks/python/local/lib/python2.7/site-packages/nose/plugins/multiprocess.py",>
line 276, in signalhandler
    raise TimedOutException()
TimedOutException: 'test_streaming_wordcount_it (apache_beam.examples.streaming_wordcount_it_test.StreamingWordCountIT)'

----------------------------------------------------------------------
Ran 4 tests in 907.926s

FAILED (errors=1)
Found: https://console.cloud.google.com/dataflow/jobsDetail/locations/us-central1/jobs/2018-04-02_11_36_41-12999608036772592389?project=apache-beam-testing.
Found: https://console.cloud.google.com/dataflow/jobsDetail/locations/us-central1/jobs/2018-04-02_11_36_44-7985544151903182017?project=apache-beam-testing.
Found: https://console.cloud.google.com/dataflow/jobsDetail/locations/us-central1/jobs/2018-04-02_11_36_43-16062626378513411426?project=apache-beam-testing.
Build step 'Execute shell' marked build as failure

Mime
View raw message