beam-commits mailing list archives

Site index · List index
Message view « Date » · « Thread »
Top « Date » · « Thread »
From Apache Jenkins Server <jenk...@builds.apache.org>
Subject Build failed in Jenkins: beam_PerformanceTests_Python #1190
Date Wed, 25 Apr 2018 06:08:31 GMT
See <https://builds.apache.org/job/beam_PerformanceTests_Python/1190/display/redirect?page=changes>

Changes:

[kedin] Add JsonToRow Transform

[kedin] Convert JsonToRow from MapElements.via() to ParDo

------------------------------------------
[...truncated 4.29 KB...]
Collecting contextlib2>=0.5.1 (from -r PerfKitBenchmarker/requirements.txt (line 24))
  Using cached https://files.pythonhosted.org/packages/a2/71/8273a7eeed0aff6a854237ab5453bc9aa67deb49df4832801c21f0ff3782/contextlib2-0.5.5-py2.py3-none-any.whl
Collecting pywinrm (from -r PerfKitBenchmarker/requirements.txt (line 25))
  Using cached https://files.pythonhosted.org/packages/0d/12/13a3117bbd2230043aa32dcfa2198c33269665eaa1a8fa26174ce49b338f/pywinrm-0.3.0-py2.py3-none-any.whl
Requirement already satisfied: six in /usr/local/lib/python2.7/dist-packages (from absl-py->-r
PerfKitBenchmarker/requirements.txt (line 14)) (1.11.0)
Requirement already satisfied: MarkupSafe>=0.23 in /usr/local/lib/python2.7/dist-packages
(from jinja2>=2.7->-r PerfKitBenchmarker/requirements.txt (line 15)) (1.0)
Collecting colorama; extra == "windows" (from colorlog[windows]==2.6.0->-r PerfKitBenchmarker/requirements.txt
(line 17))
  Using cached https://files.pythonhosted.org/packages/db/c8/7dcf9dbcb22429512708fe3a547f8b6101c0d02137acbd892505aee57adf/colorama-0.3.9-py2.py3-none-any.whl
Collecting requests-ntlm>=0.3.0 (from pywinrm->-r PerfKitBenchmarker/requirements.txt
(line 25))
  Using cached https://files.pythonhosted.org/packages/03/4b/8b9a1afde8072c4d5710d9fa91433d504325821b038e00237dc8d6d833dc/requests_ntlm-1.1.0-py2.py3-none-any.whl
Requirement already satisfied: requests>=2.9.1 in /usr/local/lib/python2.7/dist-packages
(from pywinrm->-r PerfKitBenchmarker/requirements.txt (line 25)) (2.18.4)
Collecting xmltodict (from pywinrm->-r PerfKitBenchmarker/requirements.txt (line 25))
  Using cached https://files.pythonhosted.org/packages/42/a9/7e99652c6bc619d19d58cdd8c47560730eb5825d43a7e25db2e1d776ceb7/xmltodict-0.11.0-py2.py3-none-any.whl
Requirement already satisfied: cryptography>=1.3 in /usr/local/lib/python2.7/dist-packages
(from requests-ntlm>=0.3.0->pywinrm->-r PerfKitBenchmarker/requirements.txt (line
25)) (2.2.2)
Collecting ntlm-auth>=1.0.2 (from requests-ntlm>=0.3.0->pywinrm->-r PerfKitBenchmarker/requirements.txt
(line 25))
  Using cached https://files.pythonhosted.org/packages/69/bc/230987c0dc22c763529330b2e669dbdba374d6a10c1f61232274184731be/ntlm_auth-1.1.0-py2.py3-none-any.whl
Requirement already satisfied: certifi>=2017.4.17 in /usr/local/lib/python2.7/dist-packages
(from requests>=2.9.1->pywinrm->-r PerfKitBenchmarker/requirements.txt (line 25))
(2018.4.16)
Requirement already satisfied: chardet<3.1.0,>=3.0.2 in /usr/local/lib/python2.7/dist-packages
(from requests>=2.9.1->pywinrm->-r PerfKitBenchmarker/requirements.txt (line 25))
(3.0.4)
Requirement already satisfied: idna<2.7,>=2.5 in /usr/local/lib/python2.7/dist-packages
(from requests>=2.9.1->pywinrm->-r PerfKitBenchmarker/requirements.txt (line 25))
(2.6)
Requirement already satisfied: urllib3<1.23,>=1.21.1 in /usr/local/lib/python2.7/dist-packages
(from requests>=2.9.1->pywinrm->-r PerfKitBenchmarker/requirements.txt (line 25))
(1.22)
Requirement already satisfied: cffi>=1.7; platform_python_implementation != "PyPy" in /usr/local/lib/python2.7/dist-packages
(from cryptography>=1.3->requests-ntlm>=0.3.0->pywinrm->-r PerfKitBenchmarker/requirements.txt
(line 25)) (1.11.5)
Requirement already satisfied: enum34; python_version < "3" in /usr/local/lib/python2.7/dist-packages
(from cryptography>=1.3->requests-ntlm>=0.3.0->pywinrm->-r PerfKitBenchmarker/requirements.txt
(line 25)) (1.1.6)
Requirement already satisfied: asn1crypto>=0.21.0 in /usr/local/lib/python2.7/dist-packages
(from cryptography>=1.3->requests-ntlm>=0.3.0->pywinrm->-r PerfKitBenchmarker/requirements.txt
(line 25)) (0.24.0)
Requirement already satisfied: ipaddress; python_version < "3" in /usr/local/lib/python2.7/dist-packages
(from cryptography>=1.3->requests-ntlm>=0.3.0->pywinrm->-r PerfKitBenchmarker/requirements.txt
(line 25)) (1.0.22)
Requirement already satisfied: pycparser in /usr/local/lib/python2.7/dist-packages (from cffi>=1.7;
platform_python_implementation != "PyPy"->cryptography>=1.3->requests-ntlm>=0.3.0->pywinrm->-r
PerfKitBenchmarker/requirements.txt (line 25)) (2.18)
Installing collected packages: absl-py, colorama, colorlog, blinker, futures, pint, numpy,
contextlib2, ntlm-auth, requests-ntlm, xmltodict, pywinrm
Successfully installed absl-py-0.2.0 blinker-1.4 colorama-0.3.9 colorlog-2.6.0 contextlib2-0.5.5
futures-3.2.0 ntlm-auth-1.1.0 numpy-1.13.3 pint-0.8.1 pywinrm-0.3.0 requests-ntlm-1.1.0 xmltodict-0.11.0
[beam_PerformanceTests_Python] $ /bin/bash -xe /tmp/jenkins62554953466333455.sh
+ .env/bin/pip install -e 'src/sdks/python/[gcp,test]'
Obtaining file://<https://builds.apache.org/job/beam_PerformanceTests_Python/ws/src/sdks/python>
Collecting avro<2.0.0,>=1.8.1 (from apache-beam==2.5.0.dev0)
Requirement already satisfied: crcmod<2.0,>=1.7 in /usr/lib/python2.7/dist-packages
(from apache-beam==2.5.0.dev0) (1.7)
Collecting dill==0.2.6 (from apache-beam==2.5.0.dev0)
Collecting grpcio<2,>=1.8 (from apache-beam==2.5.0.dev0)
  Using cached https://files.pythonhosted.org/packages/0d/54/b647a6323be6526be27b2c90bb042769f1a7a6e59bd1a5f2eeb795bfece4/grpcio-1.11.0-cp27-cp27mu-manylinux1_x86_64.whl
Collecting hdfs<3.0.0,>=2.1.0 (from apache-beam==2.5.0.dev0)
Collecting httplib2<0.10,>=0.8 (from apache-beam==2.5.0.dev0)
Collecting mock<3.0.0,>=1.0.1 (from apache-beam==2.5.0.dev0)
  Using cached https://files.pythonhosted.org/packages/e6/35/f187bdf23be87092bd0f1200d43d23076cee4d0dec109f195173fd3ebc79/mock-2.0.0-py2.py3-none-any.whl
Collecting oauth2client<5,>=2.0.1 (from apache-beam==2.5.0.dev0)
  Using cached https://files.pythonhosted.org/packages/82/d8/3eab58811282ac7271a081ba5c0d4b875ce786ca68ce43e2a62ade32e9a8/oauth2client-4.1.2-py2.py3-none-any.whl
Collecting protobuf<4,>=3.5.0.post1 (from apache-beam==2.5.0.dev0)
  Using cached https://files.pythonhosted.org/packages/9d/61/54c3a9cfde6ffe0ca6a1786ddb8874263f4ca32e7693ad383bd8cf935015/protobuf-3.5.2.post1-cp27-cp27mu-manylinux1_x86_64.whl
Collecting pytz>=2018.3 (from apache-beam==2.5.0.dev0)
  Using cached https://files.pythonhosted.org/packages/dc/83/15f7833b70d3e067ca91467ca245bae0f6fe56ddc7451aa0dc5606b120f2/pytz-2018.4-py2.py3-none-any.whl
Requirement already satisfied: pyyaml<4.0.0,>=3.12 in /usr/local/lib/python2.7/dist-packages
(from apache-beam==2.5.0.dev0) (3.12)
Collecting pyvcf<0.7.0,>=0.6.8 (from apache-beam==2.5.0.dev0)
Requirement already satisfied: six<1.12,>=1.9 in /usr/local/lib/python2.7/dist-packages
(from apache-beam==2.5.0.dev0) (1.11.0)
Collecting typing<3.7.0,>=3.6.0 (from apache-beam==2.5.0.dev0)
  Using cached https://files.pythonhosted.org/packages/0d/4d/4e5985d075d241d686a1663fa1f88b61d544658d08c1375c7c6aac32afc3/typing-3.6.4-py2-none-any.whl
Requirement already satisfied: futures<4.0.0,>=3.1.1 in ./.env/lib/python2.7/site-packages
(from apache-beam==2.5.0.dev0) (3.2.0)
Collecting google-apitools<=0.5.20,>=0.5.18 (from apache-beam==2.5.0.dev0)
  Using cached https://files.pythonhosted.org/packages/1d/0c/64f84f91643f775fdb64c6c10f4a4f0d827f8b0d98a2ba2b4bb9dc2f8646/google_apitools-0.5.20-py2-none-any.whl
Collecting proto-google-cloud-datastore-v1<=0.90.4,>=0.90.0 (from apache-beam==2.5.0.dev0)
Collecting googledatastore==7.0.1 (from apache-beam==2.5.0.dev0)
Collecting google-cloud-pubsub==0.26.0 (from apache-beam==2.5.0.dev0)
  Using cached https://files.pythonhosted.org/packages/37/92/c74a643126d58505daec9addf872dfaffea3305981b90cc435f4b9213cdd/google_cloud_pubsub-0.26.0-py2.py3-none-any.whl
Collecting proto-google-cloud-pubsub-v1==0.15.4 (from apache-beam==2.5.0.dev0)
Collecting google-cloud-bigquery==0.25.0 (from apache-beam==2.5.0.dev0)
  Using cached https://files.pythonhosted.org/packages/76/67/6165c516ff6ceaa62eb61f11d8451e1b0acc4d3775e181630aba9652babb/google_cloud_bigquery-0.25.0-py2.py3-none-any.whl
Collecting nose>=1.3.7 (from apache-beam==2.5.0.dev0)
  Using cached https://files.pythonhosted.org/packages/99/4f/13fb671119e65c4dce97c60e67d3fd9e6f7f809f2b307e2611f4701205cb/nose-1.3.7-py2-none-any.whl
Collecting pyhamcrest<2.0,>=1.9 (from apache-beam==2.5.0.dev0)
  Using cached https://files.pythonhosted.org/packages/9a/d5/d37fd731b7d0e91afcc84577edeccf4638b4f9b82f5ffe2f8b62e2ddc609/PyHamcrest-1.9.0-py2.py3-none-any.whl
Requirement already satisfied: enum34>=1.0.4 in /usr/local/lib/python2.7/dist-packages
(from grpcio<2,>=1.8->apache-beam==2.5.0.dev0) (1.1.6)
Requirement already satisfied: docopt in /usr/local/lib/python2.7/dist-packages (from hdfs<3.0.0,>=2.1.0->apache-beam==2.5.0.dev0)
(0.6.2)
Requirement already satisfied: requests>=2.7.0 in /usr/local/lib/python2.7/dist-packages
(from hdfs<3.0.0,>=2.1.0->apache-beam==2.5.0.dev0) (2.18.4)
Requirement already satisfied: pbr>=0.11 in /usr/lib/python2.7/dist-packages (from mock<3.0.0,>=1.0.1->apache-beam==2.5.0.dev0)
(1.8.0)
Collecting funcsigs>=1; python_version < "3.3" (from mock<3.0.0,>=1.0.1->apache-beam==2.5.0.dev0)
  Using cached https://files.pythonhosted.org/packages/69/cb/f5be453359271714c01b9bd06126eaf2e368f1fddfff30818754b5ac2328/funcsigs-1.0.2-py2.py3-none-any.whl
Requirement already satisfied: pyasn1>=0.1.7 in /usr/local/lib/python2.7/dist-packages
(from oauth2client<5,>=2.0.1->apache-beam==2.5.0.dev0) (0.4.2)
Collecting pyasn1-modules>=0.0.5 (from oauth2client<5,>=2.0.1->apache-beam==2.5.0.dev0)
  Using cached https://files.pythonhosted.org/packages/e9/51/bcd96bf6231d4b2cc5e023c511bee86637ba375c44a6f9d1b4b7ad1ce4b9/pyasn1_modules-0.2.1-py2.py3-none-any.whl
Collecting rsa>=3.1.4 (from oauth2client<5,>=2.0.1->apache-beam==2.5.0.dev0)
  Using cached https://files.pythonhosted.org/packages/e1/ae/baedc9cb175552e95f3395c43055a6a5e125ae4d48a1d7a924baca83e92e/rsa-3.4.2-py2.py3-none-any.whl
Requirement already satisfied: setuptools in ./.env/lib/python2.7/site-packages (from protobuf<4,>=3.5.0.post1->apache-beam==2.5.0.dev0)
(39.0.1)
Collecting fasteners>=0.14 (from google-apitools<=0.5.20,>=0.5.18->apache-beam==2.5.0.dev0)
  Using cached https://files.pythonhosted.org/packages/14/3a/096c7ad18e102d4f219f5dd15951f9728ca5092a3385d2e8f79a7c1e1017/fasteners-0.14.1-py2.py3-none-any.whl
Collecting googleapis-common-protos<2.0dev,>=1.5.2 (from proto-google-cloud-datastore-v1<=0.90.4,>=0.90.0->apache-beam==2.5.0.dev0)
Collecting gapic-google-cloud-pubsub-v1<0.16dev,>=0.15.0 (from google-cloud-pubsub==0.26.0->apache-beam==2.5.0.dev0)
Collecting google-cloud-core<0.26dev,>=0.25.0 (from google-cloud-pubsub==0.26.0->apache-beam==2.5.0.dev0)
  Using cached https://files.pythonhosted.org/packages/ef/dd/00e90bd1f6788f06ca5ea83a0ec8dd76350b38303bb8f09d2bf692eb1294/google_cloud_core-0.25.0-py2.py3-none-any.whl
Requirement already satisfied: certifi>=2017.4.17 in /usr/local/lib/python2.7/dist-packages
(from requests>=2.7.0->hdfs<3.0.0,>=2.1.0->apache-beam==2.5.0.dev0) (2018.4.16)
Requirement already satisfied: chardet<3.1.0,>=3.0.2 in /usr/local/lib/python2.7/dist-packages
(from requests>=2.7.0->hdfs<3.0.0,>=2.1.0->apache-beam==2.5.0.dev0) (3.0.4)
Requirement already satisfied: idna<2.7,>=2.5 in /usr/local/lib/python2.7/dist-packages
(from requests>=2.7.0->hdfs<3.0.0,>=2.1.0->apache-beam==2.5.0.dev0) (2.6)
Requirement already satisfied: urllib3<1.23,>=1.21.1 in /usr/local/lib/python2.7/dist-packages
(from requests>=2.7.0->hdfs<3.0.0,>=2.1.0->apache-beam==2.5.0.dev0) (1.22)
Collecting monotonic>=0.1 (from fasteners>=0.14->google-apitools<=0.5.20,>=0.5.18->apache-beam==2.5.0.dev0)
  Using cached https://files.pythonhosted.org/packages/9f/ff/68860dec8b90424028ca54df8b9fc8cd1c47ef58710bd5e591ec8c619243/monotonic-1.4-py2.py3-none-any.whl
Collecting google-gax<0.16dev,>=0.15.7 (from gapic-google-cloud-pubsub-v1<0.16dev,>=0.15.0->google-cloud-pubsub==0.26.0->apache-beam==2.5.0.dev0)
  Using cached https://files.pythonhosted.org/packages/4f/b4/ff312fa42f91535c67567c1d08e972db0e7c548e9a63c6f3bcc5213b32fc/google_gax-0.15.16-py2.py3-none-any.whl
Collecting grpc-google-iam-v1<0.12dev,>=0.11.1 (from gapic-google-cloud-pubsub-v1<0.16dev,>=0.15.0->google-cloud-pubsub==0.26.0->apache-beam==2.5.0.dev0)
Collecting google-auth-httplib2 (from google-cloud-core<0.26dev,>=0.25.0->google-cloud-pubsub==0.26.0->apache-beam==2.5.0.dev0)
  Using cached https://files.pythonhosted.org/packages/33/49/c814d6d438b823441552198f096fcd0377fd6c88714dbed34f1d3c8c4389/google_auth_httplib2-0.0.3-py2.py3-none-any.whl
Collecting google-auth<2.0.0dev,>=0.4.0 (from google-cloud-core<0.26dev,>=0.25.0->google-cloud-pubsub==0.26.0->apache-beam==2.5.0.dev0)
  Using cached https://files.pythonhosted.org/packages/e0/18/e282ecb28c7eb0ef5ea9a69fb3290658a9ab37bb69647f6ba7f0f78987c4/google_auth-1.4.1-py2.py3-none-any.whl
Collecting ply==3.8 (from google-gax<0.16dev,>=0.15.7->gapic-google-cloud-pubsub-v1<0.16dev,>=0.15.0->google-cloud-pubsub==0.26.0->apache-beam==2.5.0.dev0)
Collecting future<0.17dev,>=0.16.0 (from google-gax<0.16dev,>=0.15.7->gapic-google-cloud-pubsub-v1<0.16dev,>=0.15.0->google-cloud-pubsub==0.26.0->apache-beam==2.5.0.dev0)
Collecting cachetools>=2.0.0 (from google-auth<2.0.0dev,>=0.4.0->google-cloud-core<0.26dev,>=0.25.0->google-cloud-pubsub==0.26.0->apache-beam==2.5.0.dev0)
  Using cached https://files.pythonhosted.org/packages/ac/e8/5492fd5ada0b05a1bc485bcb634b559acdec59383eef5c4203b5e22be296/cachetools-2.0.1-py2.py3-none-any.whl
gapic-google-cloud-pubsub-v1 0.15.4 has requirement oauth2client<4.0dev,>=2.0.0, but
you'll have oauth2client 4.1.2 which is incompatible.
proto-google-cloud-datastore-v1 0.90.4 has requirement oauth2client<4.0dev,>=2.0.0,
but you'll have oauth2client 4.1.2 which is incompatible.
proto-google-cloud-pubsub-v1 0.15.4 has requirement oauth2client<4.0dev,>=2.0.0, but
you'll have oauth2client 4.1.2 which is incompatible.
googledatastore 7.0.1 has requirement oauth2client<4.0.0,>=2.0.1, but you'll have oauth2client
4.1.2 which is incompatible.
Installing collected packages: avro, dill, protobuf, grpcio, hdfs, httplib2, funcsigs, mock,
pyasn1-modules, rsa, oauth2client, pytz, pyvcf, typing, monotonic, fasteners, google-apitools,
googleapis-common-protos, proto-google-cloud-datastore-v1, googledatastore, proto-google-cloud-pubsub-v1,
ply, future, cachetools, google-auth, google-gax, grpc-google-iam-v1, gapic-google-cloud-pubsub-v1,
google-auth-httplib2, google-cloud-core, google-cloud-pubsub, google-cloud-bigquery, nose,
pyhamcrest, apache-beam
  Running setup.py develop for apache-beam
Successfully installed apache-beam avro-1.8.2 cachetools-2.0.1 dill-0.2.6 fasteners-0.14.1
funcsigs-1.0.2 future-0.16.0 gapic-google-cloud-pubsub-v1-0.15.4 google-apitools-0.5.20 google-auth-1.4.1
google-auth-httplib2-0.0.3 google-cloud-bigquery-0.25.0 google-cloud-core-0.25.0 google-cloud-pubsub-0.26.0
google-gax-0.15.16 googleapis-common-protos-1.5.3 googledatastore-7.0.1 grpc-google-iam-v1-0.11.4
grpcio-1.11.0 hdfs-2.1.0 httplib2-0.9.2 mock-2.0.0 monotonic-1.4 nose-1.3.7 oauth2client-4.1.2
ply-3.8 proto-google-cloud-datastore-v1-0.90.4 proto-google-cloud-pubsub-v1-0.15.4 protobuf-3.5.2.post1
pyasn1-modules-0.2.1 pyhamcrest-1.9.0 pytz-2018.4 pyvcf-0.6.8 rsa-3.4.2 typing-3.6.4
[beam_PerformanceTests_Python] $ /bin/bash -xe /tmp/jenkins3216440880046143805.sh
+ .env/bin/python PerfKitBenchmarker/pkb.py --project=apache-beam-testing --dpb_log_level=INFO
--maven_binary=/home/jenkins/tools/maven/latest/bin/mvn --bigquery_table=beam_performance.pkb_results
--temp_dir=<https://builds.apache.org/job/beam_PerformanceTests_Python/ws/> --official=true
--beam_sdk=python --benchmarks=beam_integration_benchmark --beam_it_args=--project=apache-beam-testing,--staging_location=gs://temp-storage-for-end-to-end-tests/staging-it,--temp_location=gs://temp-storage-for-end-to-end-tests/temp-it,--output=gs://temp-storage-for-end-to-end-tests/py-it-cloud/output
2018-04-25 06:01:01,465 8b17c8bb MainThread INFO     Verbose logging to: <https://builds.apache.org/job/beam_PerformanceTests_Python/ws/runs/8b17c8bb/pkb.log>
2018-04-25 06:01:01,465 8b17c8bb MainThread INFO     PerfKitBenchmarker version: v1.12.0-511-g5db1fe4
2018-04-25 06:01:01,466 8b17c8bb MainThread INFO     Flag values:
--beam_sdk=python
--temp_dir=<https://builds.apache.org/job/beam_PerformanceTests_Python/ws/>
--beam_it_args=--project=apache-beam-testing,--staging_location=gs://temp-storage-for-end-to-end-tests/staging-it,--temp_location=gs://temp-storage-for-end-to-end-tests/temp-it,--output=gs://temp-storage-for-end-to-end-tests/py-it-cloud/output
--maven_binary=/home/jenkins/tools/maven/latest/bin/mvn
--project=apache-beam-testing
--bigquery_table=beam_performance.pkb_results
--official
--dpb_log_level=INFO
--benchmarks=beam_integration_benchmark
2018-04-25 06:01:01,705 8b17c8bb MainThread WARNING  The key "flags" was not in the default
config, but was in user overrides. This may indicate a typo.
2018-04-25 06:01:01,705 8b17c8bb MainThread INFO     Initializing the edw service decoder
2018-04-25 06:01:01,891 8b17c8bb MainThread beam_integration_benchmark(1/1) INFO     Provisioning
resources for benchmark beam_integration_benchmark
2018-04-25 06:01:01,895 8b17c8bb MainThread beam_integration_benchmark(1/1) INFO     Preparing
benchmark beam_integration_benchmark
2018-04-25 06:01:01,896 8b17c8bb MainThread beam_integration_benchmark(1/1) INFO     Running:
git clone https://github.com/apache/beam.git
2018-04-25 06:01:10,140 8b17c8bb MainThread beam_integration_benchmark(1/1) INFO     Running:
/home/jenkins/tools/maven/latest/bin/mvn clean install -DskipTests -Dcheckstyle.skip=true
-Pdataflow-runner
2018-04-25 06:08:19,006 8b17c8bb MainThread beam_integration_benchmark(1/1) INFO     Running
benchmark beam_integration_benchmark
2018-04-25 06:08:19,025 8b17c8bb MainThread beam_integration_benchmark(1/1) INFO     Running:
python setup.py nosetests --tests=apache_beam.examples.wordcount_it_test --attr=IT --test-pipeline-options="--project=apache-beam-testing"
"--staging_location=gs://temp-storage-for-end-to-end-tests/staging-it" "--temp_location=gs://temp-storage-for-end-to-end-tests/temp-it"
"--output=gs://temp-storage-for-end-to-end-tests/py-it-cloud/output" --runner=TestDataflowRunner
--sdk_location=<https://builds.apache.org/job/beam_PerformanceTests_Python/ws/runs/8b17c8bb/beam/sdks/python/target/apache-beam-2.5.0.dev0.tar.gz>
2018-04-25 06:08:19,280 8b17c8bb MainThread beam_integration_benchmark(1/1) INFO     Ran:
{python setup.py nosetests --tests=apache_beam.examples.wordcount_it_test --attr=IT --test-pipeline-options="--project=apache-beam-testing"
"--staging_location=gs://temp-storage-for-end-to-end-tests/staging-it" "--temp_location=gs://temp-storage-for-end-to-end-tests/temp-it"
"--output=gs://temp-storage-for-end-to-end-tests/py-it-cloud/output" --runner=TestDataflowRunner
--sdk_location=<https://builds.apache.org/job/beam_PerformanceTests_Python/ws/runs/8b17c8bb/beam/sdks/python/target/apache-beam-2.5.0.dev0.tar.gz}>
 ReturnCode:1
STDOUT: 
STDERR: /usr/local/lib/python2.7/dist-packages/setuptools/dist.py:397: UserWarning: Normalizing
'2.5.0.dev' to '2.5.0.dev0'
  normalized_version,
usage: setup.py [global_opts] cmd1 [cmd1_opts] [cmd2 [cmd2_opts] ...]
   or: setup.py --help [cmd1 cmd2 ...]
   or: setup.py --help-commands
   or: setup.py cmd --help

error: invalid command 'nosetests'

2018-04-25 06:08:19,281 8b17c8bb MainThread beam_integration_benchmark(1/1) ERROR    Error
during benchmark beam_integration_benchmark
Traceback (most recent call last):
  File "<https://builds.apache.org/job/beam_PerformanceTests_Python/ws/PerfKitBenchmarker/perfkitbenchmarker/pkb.py",>
line 646, in RunBenchmark
    DoRunPhase(spec, collector, detailed_timer)
  File "<https://builds.apache.org/job/beam_PerformanceTests_Python/ws/PerfKitBenchmarker/perfkitbenchmarker/pkb.py",>
line 526, in DoRunPhase
    samples = spec.BenchmarkRun(spec)
  File "<https://builds.apache.org/job/beam_PerformanceTests_Python/ws/PerfKitBenchmarker/perfkitbenchmarker/linux_benchmarks/beam_integration_benchmark.py",>
line 159, in Run
    job_type=job_type)
  File "<https://builds.apache.org/job/beam_PerformanceTests_Python/ws/PerfKitBenchmarker/perfkitbenchmarker/providers/gcp/gcp_dpb_dataflow.py",>
line 90, in SubmitJob
    assert retcode == 0, "Integration Test Failed."
AssertionError: Integration Test Failed.
2018-04-25 06:08:19,282 8b17c8bb MainThread beam_integration_benchmark(1/1) INFO     Cleaning
up benchmark beam_integration_benchmark
2018-04-25 06:08:19,284 8b17c8bb MainThread beam_integration_benchmark(1/1) ERROR    Exception
running benchmark
Traceback (most recent call last):
  File "<https://builds.apache.org/job/beam_PerformanceTests_Python/ws/PerfKitBenchmarker/perfkitbenchmarker/pkb.py",>
line 780, in RunBenchmarkTask
    RunBenchmark(spec, collector)
  File "<https://builds.apache.org/job/beam_PerformanceTests_Python/ws/PerfKitBenchmarker/perfkitbenchmarker/pkb.py",>
line 646, in RunBenchmark
    DoRunPhase(spec, collector, detailed_timer)
  File "<https://builds.apache.org/job/beam_PerformanceTests_Python/ws/PerfKitBenchmarker/perfkitbenchmarker/pkb.py",>
line 526, in DoRunPhase
    samples = spec.BenchmarkRun(spec)
  File "<https://builds.apache.org/job/beam_PerformanceTests_Python/ws/PerfKitBenchmarker/perfkitbenchmarker/linux_benchmarks/beam_integration_benchmark.py",>
line 159, in Run
    job_type=job_type)
  File "<https://builds.apache.org/job/beam_PerformanceTests_Python/ws/PerfKitBenchmarker/perfkitbenchmarker/providers/gcp/gcp_dpb_dataflow.py",>
line 90, in SubmitJob
    assert retcode == 0, "Integration Test Failed."
AssertionError: Integration Test Failed.
2018-04-25 06:08:19,284 8b17c8bb MainThread beam_integration_benchmark(1/1) ERROR    Benchmark
1/1 beam_integration_benchmark (UID: beam_integration_benchmark0) failed. Execution will continue.
2018-04-25 06:08:19,308 8b17c8bb MainThread INFO     Benchmark run statuses:
---------------------------------------------------------------------------------
Name                        UID                          Status  Failed Substatus
---------------------------------------------------------------------------------
beam_integration_benchmark  beam_integration_benchmark0  FAILED                  
---------------------------------------------------------------------------------
Success rate: 0.00% (0/1)
2018-04-25 06:08:19,309 8b17c8bb MainThread INFO     Complete logs can be found at: <https://builds.apache.org/job/beam_PerformanceTests_Python/ws/runs/8b17c8bb/pkb.log>
2018-04-25 06:08:19,309 8b17c8bb MainThread INFO     Completion statuses can be found at:
<https://builds.apache.org/job/beam_PerformanceTests_Python/ws/runs/8b17c8bb/completion_statuses.json>
Build step 'Execute shell' marked build as failure
Not sending mail to unregistered user herohde@google.com
Not sending mail to unregistered user klk@google.com
Not sending mail to unregistered user amyrvold@google.com
Not sending mail to unregistered user valentyn@google.com
Not sending mail to unregistered user dawid@getindata.com
Not sending mail to unregistered user geet.kumar75@gmail.com
Not sending mail to unregistered user pawel.pk.kaczmarczyk@gmail.com
Not sending mail to unregistered user lukasz.gajowy@polidea.com
Not sending mail to unregistered user batbat@batbat-linuxworkstation.sea.corp.google.com
Not sending mail to unregistered user holdenkarau@google.com
Not sending mail to unregistered user samuel.waggoner@healthsparq.com
Not sending mail to unregistered user zoy@giggles.nyc.corp.google.com
Not sending mail to unregistered user markliu@google.com
Not sending mail to unregistered user grzegorz.kolakowski@getindata.com
Not sending mail to unregistered user wcn@google.com
Not sending mail to unregistered user daniel.o.programmer@gmail.com
Not sending mail to unregistered user mariand@google.com
Not sending mail to unregistered user swegner@google.com
Not sending mail to unregistered user jb@nanthrax.net
Not sending mail to unregistered user xumingmingv@gmail.com
Not sending mail to unregistered user arostami@google.com
Not sending mail to unregistered user sduskis@google.com
Not sending mail to unregistered user ankurgoenka@gmail.com
Not sending mail to unregistered user robert@frantil.com
Not sending mail to unregistered user dariusz.aniszewski@polidea.com
Not sending mail to unregistered user ehudm@google.com
Not sending mail to unregistered user owenzhang1990@gmail.com
Not sending mail to unregistered user XuMingmin@users.noreply.github.com
Not sending mail to unregistered user aromanenko.dev@gmail.com
Not sending mail to unregistered user kedin@google.com
Not sending mail to unregistered user apilloud@google.com
Not sending mail to unregistered user arnaudfournier921@gmail.com
Not sending mail to unregistered user bbassingthwaite@vendasta.com
Not sending mail to unregistered user 1147435+chuanyu@users.noreply.github.com
Not sending mail to unregistered user fjetumale@gmail.com
Not sending mail to unregistered user jiangkai@gmail.com
Not sending mail to unregistered user rezarokni@google.com
Not sending mail to unregistered user mairbek@google.com
Not sending mail to unregistered user niemo@google.com
Not sending mail to unregistered user axelmagn@gmail.com
Not sending mail to unregistered user luke_zhu@brown.edu
Not sending mail to unregistered user swegner2@gmail.com
Not sending mail to unregistered user joey.baruch@gmail.com
Not sending mail to unregistered user mariagh@mariagh.svl.corp.google.com
Not sending mail to unregistered user zhouhai02@meituan.com
Not sending mail to unregistered user dcavazos@google.com
Not sending mail to unregistered user kirpichov@google.com
Not sending mail to unregistered user willy@bounceexchange.com
Not sending mail to unregistered user samuelw@google.com
Not sending mail to unregistered user timrobertson100@gmail.com
Not sending mail to unregistered user gene@telligent-data.com
Not sending mail to unregistered user djiofack007@gmail.com
Not sending mail to unregistered user alan.myrvold@comcast.net
Not sending mail to unregistered user rober@frantil.com
Not sending mail to unregistered user ccy@google.com
Not sending mail to unregistered user relax@relax-macbookpro2.roam.corp.google.com
Not sending mail to unregistered user github@alasdairhodge.co.uk
Not sending mail to unregistered user ekirpichov@gmail.com
Not sending mail to unregistered user shoyer@google.com
Not sending mail to unregistered user 7542791+rezarokni@users.noreply.github.com
Not sending mail to unregistered user aljoscha.krettek@gmail.com
Not sending mail to unregistered user melissapa@google.com
Not sending mail to unregistered user sidhom@google.com
Not sending mail to unregistered user andreas.ehrencrona@velik.it
Not sending mail to unregistered user abhyankar@gmail.com
Not sending mail to unregistered user aaltay@gmail.com
Not sending mail to unregistered user cclauss@bluewin.ch
Not sending mail to unregistered user 1028332163@qq.com
Not sending mail to unregistered user Mottyg1@gmail.com
Not sending mail to unregistered user arnaudfournier021@gmail.com
Not sending mail to unregistered user szewinho@gmail.com
Not sending mail to unregistered user yifanzou@yifanzou-linuxworkstation.sea.corp.google.com
Not sending mail to unregistered user wtanaka@yahoo.com
Not sending mail to unregistered user boyuanz@google.com

Mime
View raw message