beam-commits mailing list archives

Site index · List index
Message view « Date » · « Thread »
Top « Date » · « Thread »
From Apache Jenkins Server <jenk...@builds.apache.org>
Subject Build failed in Jenkins: beam_PerformanceTests_TextIOIT_HDFS #11
Date Tue, 03 Apr 2018 13:04:47 GMT
See <https://builds.apache.org/job/beam_PerformanceTests_TextIOIT_HDFS/11/display/redirect>

------------------------------------------
[...truncated 56.85 KB...]
[INFO] Excluding io.dropwizard.metrics:metrics-core:jar:3.1.2 from the shaded jar.
[INFO] Excluding io.netty:netty-tcnative-boringssl-static:jar:1.1.33.Fork26 from the shaded
jar.
[INFO] Excluding com.google.api.grpc:proto-google-cloud-spanner-admin-database-v1:jar:0.1.9
from the shaded jar.
[INFO] Excluding com.google.api.grpc:proto-google-common-protos:jar:0.1.9 from the shaded
jar.
[INFO] Excluding com.google.api-client:google-api-client:jar:1.22.0 from the shaded jar.
[INFO] Excluding com.google.oauth-client:google-oauth-client:jar:1.22.0 from the shaded jar.
[INFO] Excluding com.google.http-client:google-http-client:jar:1.22.0 from the shaded jar.
[INFO] Excluding org.apache.httpcomponents:httpclient:jar:4.0.1 from the shaded jar.
[INFO] Excluding org.apache.httpcomponents:httpcore:jar:4.0.1 from the shaded jar.
[INFO] Excluding com.google.http-client:google-http-client-jackson2:jar:1.22.0 from the shaded
jar.
[INFO] Excluding com.google.apis:google-api-services-dataflow:jar:v1b3-rev221-1.22.0 from
the shaded jar.
[INFO] Excluding com.google.apis:google-api-services-clouddebugger:jar:v2-rev8-1.22.0 from
the shaded jar.
[INFO] Excluding com.google.apis:google-api-services-storage:jar:v1-rev71-1.22.0 from the
shaded jar.
[INFO] Excluding com.google.auth:google-auth-library-credentials:jar:0.7.1 from the shaded
jar.
[INFO] Excluding com.google.auth:google-auth-library-oauth2-http:jar:0.7.1 from the shaded
jar.
[INFO] Excluding com.google.cloud.bigdataoss:util:jar:1.4.5 from the shaded jar.
[INFO] Excluding com.google.api-client:google-api-client-java6:jar:1.22.0 from the shaded
jar.
[INFO] Excluding com.google.api-client:google-api-client-jackson2:jar:1.22.0 from the shaded
jar.
[INFO] Excluding com.google.oauth-client:google-oauth-client-java6:jar:1.22.0 from the shaded
jar.
[INFO] Excluding org.apache.beam:beam-sdks-java-io-hadoop-file-system:jar:2.5.0-SNAPSHOT from
the shaded jar.
[INFO] Excluding org.apache.hadoop:hadoop-hdfs:jar:2.7.1 from the shaded jar.
[INFO] Excluding org.mortbay.jetty:jetty:jar:6.1.26 from the shaded jar.
[INFO] Excluding org.mortbay.jetty:jetty-util:jar:6.1.26 from the shaded jar.
[INFO] Excluding com.sun.jersey:jersey-core:jar:1.9 from the shaded jar.
[INFO] Excluding com.sun.jersey:jersey-server:jar:1.9 from the shaded jar.
[INFO] Excluding asm:asm:jar:3.1 from the shaded jar.
[INFO] Excluding commons-cli:commons-cli:jar:1.2 from the shaded jar.
[INFO] Excluding commons-codec:commons-codec:jar:1.4 from the shaded jar.
[INFO] Excluding commons-io:commons-io:jar:2.4 from the shaded jar.
[INFO] Excluding commons-lang:commons-lang:jar:2.6 from the shaded jar.
[INFO] Excluding commons-logging:commons-logging:jar:1.1.3 from the shaded jar.
[INFO] Excluding commons-daemon:commons-daemon:jar:1.0.13 from the shaded jar.
[INFO] Excluding log4j:log4j:jar:1.2.17 from the shaded jar.
[INFO] Excluding com.google.protobuf:protobuf-java:jar:3.2.0 from the shaded jar.
[INFO] Excluding javax.servlet:servlet-api:jar:2.5 from the shaded jar.
[INFO] Excluding xmlenc:xmlenc:jar:0.52 from the shaded jar.
[INFO] Excluding io.netty:netty-all:jar:4.0.23.Final from the shaded jar.
[INFO] Excluding xerces:xercesImpl:jar:2.9.1 from the shaded jar.
[INFO] Excluding xml-apis:xml-apis:jar:1.3.04 from the shaded jar.
[INFO] Excluding org.apache.htrace:htrace-core:jar:3.1.0-incubating from the shaded jar.
[INFO] Excluding org.fusesource.leveldbjni:leveldbjni-all:jar:1.8 from the shaded jar.
[INFO] Excluding org.apache.hadoop:hadoop-client:jar:2.7.1 from the shaded jar.
[INFO] Excluding org.apache.hadoop:hadoop-common:jar:2.7.3 from the shaded jar.
[INFO] Excluding org.apache.commons:commons-math3:jar:3.1.1 from the shaded jar.
[INFO] Excluding commons-httpclient:commons-httpclient:jar:3.1 from the shaded jar.
[INFO] Excluding commons-net:commons-net:jar:3.1 from the shaded jar.
[INFO] Excluding commons-collections:commons-collections:jar:3.2.2 from the shaded jar.
[INFO] Excluding javax.servlet.jsp:jsp-api:jar:2.1 from the shaded jar.
[INFO] Excluding commons-configuration:commons-configuration:jar:1.6 from the shaded jar.
[INFO] Excluding commons-digester:commons-digester:jar:1.8 from the shaded jar.
[INFO] Excluding commons-beanutils:commons-beanutils:jar:1.7.0 from the shaded jar.
[INFO] Excluding commons-beanutils:commons-beanutils-core:jar:1.8.0 from the shaded jar.
[INFO] Excluding org.slf4j:slf4j-log4j12:jar:1.7.10 from the shaded jar.
[INFO] Excluding com.google.code.gson:gson:jar:2.2.4 from the shaded jar.
[INFO] Excluding org.apache.hadoop:hadoop-auth:jar:2.7.3 from the shaded jar.
[INFO] Excluding org.apache.directory.server:apacheds-kerberos-codec:jar:2.0.0-M15 from the
shaded jar.
[INFO] Excluding org.apache.directory.server:apacheds-i18n:jar:2.0.0-M15 from the shaded jar.
[INFO] Excluding org.apache.directory.api:api-asn1-api:jar:1.0.0-M20 from the shaded jar.
[INFO] Excluding org.apache.directory.api:api-util:jar:1.0.0-M20 from the shaded jar.
[INFO] Excluding org.apache.curator:curator-framework:jar:2.7.1 from the shaded jar.
[INFO] Excluding org.apache.curator:curator-client:jar:2.7.1 from the shaded jar.
[INFO] Excluding org.apache.curator:curator-recipes:jar:2.7.1 from the shaded jar.
[INFO] Excluding org.apache.zookeeper:zookeeper:jar:3.4.6 from the shaded jar.
[INFO] Excluding io.netty:netty:jar:3.7.0.Final from the shaded jar.
[INFO] Excluding org.apache.hadoop:hadoop-mapreduce-client-app:jar:2.7.1 from the shaded jar.
[INFO] Excluding org.apache.hadoop:hadoop-mapreduce-client-common:jar:2.7.1 from the shaded
jar.
[INFO] Excluding org.apache.hadoop:hadoop-yarn-client:jar:2.7.1 from the shaded jar.
[INFO] Excluding org.apache.hadoop:hadoop-yarn-server-common:jar:2.7.1 from the shaded jar.
[INFO] Excluding org.apache.hadoop:hadoop-mapreduce-client-shuffle:jar:2.7.1 from the shaded
jar.
[INFO] Excluding org.apache.hadoop:hadoop-yarn-api:jar:2.7.1 from the shaded jar.
[INFO] Excluding org.apache.hadoop:hadoop-mapreduce-client-core:jar:2.7.3 from the shaded
jar.
[INFO] Excluding org.apache.hadoop:hadoop-yarn-common:jar:2.7.3 from the shaded jar.
[INFO] Excluding com.sun.jersey:jersey-client:jar:1.9 from the shaded jar.
[INFO] Excluding org.codehaus.jackson:jackson-jaxrs:jar:1.9.13 from the shaded jar.
[INFO] Excluding org.codehaus.jackson:jackson-xc:jar:1.9.13 from the shaded jar.
[INFO] Excluding org.apache.hadoop:hadoop-mapreduce-client-jobclient:jar:2.7.1 from the shaded
jar.
[INFO] Excluding org.apache.hadoop:hadoop-annotations:jar:2.7.1 from the shaded jar.
[INFO] Replacing original artifact with shaded artifact.
[INFO] Replacing <https://builds.apache.org/job/beam_PerformanceTests_TextIOIT_HDFS/ws/runs/00fc959d/beam/sdks/java/io/file-based-io-tests/target/beam-sdks-java-io-file-based-io-tests-2.5.0-SNAPSHOT.jar>
with <https://builds.apache.org/job/beam_PerformanceTests_TextIOIT_HDFS/ws/runs/00fc959d/beam/sdks/java/io/file-based-io-tests/target/beam-sdks-java-io-file-based-io-tests-2.5.0-SNAPSHOT-shaded.jar>
[INFO] Replacing original test artifact with shaded test artifact.
[INFO] Replacing <https://builds.apache.org/job/beam_PerformanceTests_TextIOIT_HDFS/ws/runs/00fc959d/beam/sdks/java/io/file-based-io-tests/target/beam-sdks-java-io-file-based-io-tests-2.5.0-SNAPSHOT-tests.jar>
with <https://builds.apache.org/job/beam_PerformanceTests_TextIOIT_HDFS/ws/runs/00fc959d/beam/sdks/java/io/file-based-io-tests/target/beam-sdks-java-io-file-based-io-tests-2.5.0-SNAPSHOT-shaded-tests.jar>
[INFO] 
[INFO] --- maven-failsafe-plugin:2.21.0:integration-test (default) @ beam-sdks-java-io-file-based-io-tests
---
[INFO] Failsafe report directory: <https://builds.apache.org/job/beam_PerformanceTests_TextIOIT_HDFS/ws/runs/00fc959d/beam/sdks/java/io/file-based-io-tests/target/failsafe-reports>
[INFO] parallel='all', perCoreThreadCount=true, threadCount=4, useUnlimitedThreads=false,
threadCountSuites=0, threadCountClasses=0, threadCountMethods=0, parallelOptimized=true
[INFO] 
[INFO] -------------------------------------------------------
[INFO]  T E S T S
[INFO] -------------------------------------------------------
[INFO] Running org.apache.beam.sdk.io.text.TextIOIT
[ERROR] Tests run: 1, Failures: 0, Errors: 1, Skipped: 0, Time elapsed: 25.662 s <<<
FAILURE! - in org.apache.beam.sdk.io.text.TextIOIT
[ERROR] writeThenReadAll(org.apache.beam.sdk.io.text.TextIOIT)  Time elapsed: 25.662 s  <<<
ERROR!
java.lang.RuntimeException: 
Workflow failed. Causes: Project apache-beam-testing has insufficient quota(s) to execute
this workflow with 1 instances in region us-central1. Quota summary (required/available):
1/1435 instances, 1/0 CPUs, 250/13800 disk GB, 0/1998 SSD disk GB, 1/65 instance groups, 1/15
managed instance groups, 1/41 instance templates, 1/287 in-use IP addresses.

Please see https://cloud.google.com/compute/docs/resource-quotas about requesting more quota.
	at org.apache.beam.runners.dataflow.TestDataflowRunner.run(TestDataflowRunner.java:134)
	at org.apache.beam.runners.dataflow.TestDataflowRunner.run(TestDataflowRunner.java:90)
	at org.apache.beam.runners.dataflow.TestDataflowRunner.run(TestDataflowRunner.java:55)
	at org.apache.beam.sdk.Pipeline.run(Pipeline.java:311)
	at org.apache.beam.sdk.testing.TestPipeline.run(TestPipeline.java:346)
	at org.apache.beam.sdk.testing.TestPipeline.run(TestPipeline.java:328)
	at org.apache.beam.sdk.io.text.TextIOIT.writeThenReadAll(TextIOIT.java:114)
	at sun.reflect.NativeMethodAccessorImpl.invoke0(Native Method)
	at sun.reflect.NativeMethodAccessorImpl.invoke(NativeMethodAccessorImpl.java:62)
	at sun.reflect.DelegatingMethodAccessorImpl.invoke(DelegatingMethodAccessorImpl.java:43)
	at java.lang.reflect.Method.invoke(Method.java:498)
	at org.junit.runners.model.FrameworkMethod$1.runReflectiveCall(FrameworkMethod.java:50)
	at org.junit.internal.runners.model.ReflectiveCallable.run(ReflectiveCallable.java:12)
	at org.junit.runners.model.FrameworkMethod.invokeExplosively(FrameworkMethod.java:47)
	at org.junit.internal.runners.statements.InvokeMethod.evaluate(InvokeMethod.java:17)
	at org.apache.beam.sdk.testing.TestPipeline$1.evaluate(TestPipeline.java:317)
	at org.junit.rules.RunRules.evaluate(RunRules.java:20)
	at org.junit.runners.ParentRunner.runLeaf(ParentRunner.java:325)
	at org.junit.runners.BlockJUnit4ClassRunner.runChild(BlockJUnit4ClassRunner.java:78)
	at org.junit.runners.BlockJUnit4ClassRunner.runChild(BlockJUnit4ClassRunner.java:57)
	at org.junit.runners.ParentRunner$3.run(ParentRunner.java:290)
	at org.apache.maven.surefire.junitcore.pc.Scheduler$1.run(Scheduler.java:410)
	at java.util.concurrent.Executors$RunnableAdapter.call(Executors.java:511)
	at java.util.concurrent.FutureTask.run(FutureTask.java:266)
	at java.util.concurrent.ThreadPoolExecutor.runWorker(ThreadPoolExecutor.java:1149)
	at java.util.concurrent.ThreadPoolExecutor$Worker.run(ThreadPoolExecutor.java:624)
	at java.lang.Thread.run(Thread.java:748)

[INFO] 
[INFO] Results:
[INFO] 
[ERROR] Errors: 
[ERROR]   TextIOIT.writeThenReadAll:114  Runtime Workflow failed. Causes: Project apach...
[INFO] 
[ERROR] Tests run: 1, Failures: 0, Errors: 1, Skipped: 0
[INFO] 
[INFO] 
[INFO] --- maven-dependency-plugin:3.0.2:analyze-only (default) @ beam-sdks-java-io-file-based-io-tests
---
[INFO] No dependency problems found
[INFO] 
[INFO] --- maven-failsafe-plugin:2.21.0:verify (default) @ beam-sdks-java-io-file-based-io-tests
---
[INFO] Failsafe report directory: <https://builds.apache.org/job/beam_PerformanceTests_TextIOIT_HDFS/ws/runs/00fc959d/beam/sdks/java/io/file-based-io-tests/target/failsafe-reports>
[INFO] ------------------------------------------------------------------------
[INFO] BUILD FAILURE
[INFO] ------------------------------------------------------------------------
[INFO] Total time: 49.297 s
[INFO] Finished at: 2018-04-03T13:04:45Z
[INFO] Final Memory: 93M/940M
[INFO] ------------------------------------------------------------------------
[ERROR] Failed to execute goal org.apache.maven.plugins:maven-failsafe-plugin:2.21.0:verify
(default) on project beam-sdks-java-io-file-based-io-tests: There are test failures.
[ERROR] 
[ERROR] Please refer to <https://builds.apache.org/job/beam_PerformanceTests_TextIOIT_HDFS/ws/runs/00fc959d/beam/sdks/java/io/file-based-io-tests/target/failsafe-reports>
for the individual test results.
[ERROR] Please refer to dump files (if any exist) [date]-jvmRun[N].dump, [date].dumpstream
and [date]-jvmRun[N].dumpstream.
[ERROR] -> [Help 1]
org.apache.maven.lifecycle.LifecycleExecutionException: Failed to execute goal org.apache.maven.plugins:maven-failsafe-plugin:2.21.0:verify
(default) on project beam-sdks-java-io-file-based-io-tests: There are test failures.

Please refer to <https://builds.apache.org/job/beam_PerformanceTests_TextIOIT_HDFS/ws/runs/00fc959d/beam/sdks/java/io/file-based-io-tests/target/failsafe-reports>
for the individual test results.
Please refer to dump files (if any exist) [date]-jvmRun[N].dump, [date].dumpstream and [date]-jvmRun[N].dumpstream.
    at org.apache.maven.lifecycle.internal.MojoExecutor.execute (MojoExecutor.java:213)
    at org.apache.maven.lifecycle.internal.MojoExecutor.execute (MojoExecutor.java:154)
    at org.apache.maven.lifecycle.internal.MojoExecutor.execute (MojoExecutor.java:146)
    at org.apache.maven.lifecycle.internal.LifecycleModuleBuilder.buildProject (LifecycleModuleBuilder.java:117)
    at org.apache.maven.lifecycle.internal.LifecycleModuleBuilder.buildProject (LifecycleModuleBuilder.java:81)
    at org.apache.maven.lifecycle.internal.builder.singlethreaded.SingleThreadedBuilder.build
(SingleThreadedBuilder.java:51)
    at org.apache.maven.lifecycle.internal.LifecycleStarter.execute (LifecycleStarter.java:128)
    at org.apache.maven.DefaultMaven.doExecute (DefaultMaven.java:309)
    at org.apache.maven.DefaultMaven.doExecute (DefaultMaven.java:194)
    at org.apache.maven.DefaultMaven.execute (DefaultMaven.java:107)
    at org.apache.maven.cli.MavenCli.execute (MavenCli.java:955)
    at org.apache.maven.cli.MavenCli.doMain (MavenCli.java:290)
    at org.apache.maven.cli.MavenCli.main (MavenCli.java:194)
    at sun.reflect.NativeMethodAccessorImpl.invoke0 (Native Method)
    at sun.reflect.NativeMethodAccessorImpl.invoke (NativeMethodAccessorImpl.java:62)
    at sun.reflect.DelegatingMethodAccessorImpl.invoke (DelegatingMethodAccessorImpl.java:43)
    at java.lang.reflect.Method.invoke (Method.java:498)
    at org.codehaus.plexus.classworlds.launcher.Launcher.launchEnhanced (Launcher.java:289)
    at org.codehaus.plexus.classworlds.launcher.Launcher.launch (Launcher.java:229)
    at org.codehaus.plexus.classworlds.launcher.Launcher.mainWithExitCode (Launcher.java:415)
    at org.codehaus.plexus.classworlds.launcher.Launcher.main (Launcher.java:356)
Caused by: org.apache.maven.plugin.MojoFailureException: There are test failures.

Please refer to <https://builds.apache.org/job/beam_PerformanceTests_TextIOIT_HDFS/ws/runs/00fc959d/beam/sdks/java/io/file-based-io-tests/target/failsafe-reports>
for the individual test results.
Please refer to dump files (if any exist) [date]-jvmRun[N].dump, [date].dumpstream and [date]-jvmRun[N].dumpstream.
    at org.apache.maven.plugin.surefire.SurefireHelper.throwException (SurefireHelper.java:240)
    at org.apache.maven.plugin.surefire.SurefireHelper.reportExecution (SurefireHelper.java:112)
    at org.apache.maven.plugin.failsafe.VerifyMojo.execute (VerifyMojo.java:192)
    at org.apache.maven.plugin.DefaultBuildPluginManager.executeMojo (DefaultBuildPluginManager.java:134)
    at org.apache.maven.lifecycle.internal.MojoExecutor.execute (MojoExecutor.java:208)
    at org.apache.maven.lifecycle.internal.MojoExecutor.execute (MojoExecutor.java:154)
    at org.apache.maven.lifecycle.internal.MojoExecutor.execute (MojoExecutor.java:146)
    at org.apache.maven.lifecycle.internal.LifecycleModuleBuilder.buildProject (LifecycleModuleBuilder.java:117)
    at org.apache.maven.lifecycle.internal.LifecycleModuleBuilder.buildProject (LifecycleModuleBuilder.java:81)
    at org.apache.maven.lifecycle.internal.builder.singlethreaded.SingleThreadedBuilder.build
(SingleThreadedBuilder.java:51)
    at org.apache.maven.lifecycle.internal.LifecycleStarter.execute (LifecycleStarter.java:128)
    at org.apache.maven.DefaultMaven.doExecute (DefaultMaven.java:309)
    at org.apache.maven.DefaultMaven.doExecute (DefaultMaven.java:194)
    at org.apache.maven.DefaultMaven.execute (DefaultMaven.java:107)
    at org.apache.maven.cli.MavenCli.execute (MavenCli.java:955)
    at org.apache.maven.cli.MavenCli.doMain (MavenCli.java:290)
    at org.apache.maven.cli.MavenCli.main (MavenCli.java:194)
    at sun.reflect.NativeMethodAccessorImpl.invoke0 (Native Method)
    at sun.reflect.NativeMethodAccessorImpl.invoke (NativeMethodAccessorImpl.java:62)
    at sun.reflect.DelegatingMethodAccessorImpl.invoke (DelegatingMethodAccessorImpl.java:43)
    at java.lang.reflect.Method.invoke (Method.java:498)
    at org.codehaus.plexus.classworlds.launcher.Launcher.launchEnhanced (Launcher.java:289)
    at org.codehaus.plexus.classworlds.launcher.Launcher.launch (Launcher.java:229)
    at org.codehaus.plexus.classworlds.launcher.Launcher.mainWithExitCode (Launcher.java:415)
    at org.codehaus.plexus.classworlds.launcher.Launcher.main (Launcher.java:356)
[ERROR] 
[ERROR] Re-run Maven using the -X switch to enable full debug logging.
[ERROR] 
[ERROR] For more information about the errors and possible solutions, please read the following
articles:
[ERROR] [Help 1] http://cwiki.apache.org/confluence/display/MAVEN/MojoFailureException

STDERR: 
2018-04-03 13:04:45,953 00fc959d MainThread beam_integration_benchmark(1/1) ERROR    Error
during benchmark beam_integration_benchmark
Traceback (most recent call last):
  File "<https://builds.apache.org/job/beam_PerformanceTests_TextIOIT_HDFS/ws/PerfKitBenchmarker/perfkitbenchmarker/pkb.py",>
line 624, in RunBenchmark
    DoRunPhase(spec, collector, detailed_timer)
  File "<https://builds.apache.org/job/beam_PerformanceTests_TextIOIT_HDFS/ws/PerfKitBenchmarker/perfkitbenchmarker/pkb.py",>
line 527, in DoRunPhase
    samples = spec.BenchmarkRun(spec)
  File "<https://builds.apache.org/job/beam_PerformanceTests_TextIOIT_HDFS/ws/PerfKitBenchmarker/perfkitbenchmarker/linux_benchmarks/beam_integration_benchmark.py",>
line 159, in Run
    job_type=job_type)
  File "<https://builds.apache.org/job/beam_PerformanceTests_TextIOIT_HDFS/ws/PerfKitBenchmarker/perfkitbenchmarker/providers/gcp/gcp_dpb_dataflow.py",>
line 90, in SubmitJob
    assert retcode == 0, "Integration Test Failed."
AssertionError: Integration Test Failed.
2018-04-03 13:04:45,953 00fc959d MainThread beam_integration_benchmark(1/1) INFO     Cleaning
up benchmark beam_integration_benchmark
2018-04-03 13:04:45,954 00fc959d MainThread beam_integration_benchmark(1/1) INFO     Running:
kubectl --kubeconfig=<https://builds.apache.org/job/beam_PerformanceTests_TextIOIT_HDFS/ws/config-filebasedioithdfs-1522759590804>
delete -f <https://builds.apache.org/job/beam_PerformanceTests_TextIOIT_HDFS/ws/src/.test-infra/kubernetes/hadoop/SmallITCluster/hdfs-single-datanode-cluster.yml>
2018-04-03 13:04:46,676 00fc959d MainThread beam_integration_benchmark(1/1) INFO     Running:
kubectl --kubeconfig=<https://builds.apache.org/job/beam_PerformanceTests_TextIOIT_HDFS/ws/config-filebasedioithdfs-1522759590804>
delete -f <https://builds.apache.org/job/beam_PerformanceTests_TextIOIT_HDFS/ws/src/.test-infra/kubernetes/hadoop/SmallITCluster/hdfs-single-datanode-cluster-for-local-dev.yml>
2018-04-03 13:04:46,844 00fc959d MainThread beam_integration_benchmark(1/1) ERROR    Exception
running benchmark
Traceback (most recent call last):
  File "<https://builds.apache.org/job/beam_PerformanceTests_TextIOIT_HDFS/ws/PerfKitBenchmarker/perfkitbenchmarker/pkb.py",>
line 758, in RunBenchmarkTask
    RunBenchmark(spec, collector)
  File "<https://builds.apache.org/job/beam_PerformanceTests_TextIOIT_HDFS/ws/PerfKitBenchmarker/perfkitbenchmarker/pkb.py",>
line 624, in RunBenchmark
    DoRunPhase(spec, collector, detailed_timer)
  File "<https://builds.apache.org/job/beam_PerformanceTests_TextIOIT_HDFS/ws/PerfKitBenchmarker/perfkitbenchmarker/pkb.py",>
line 527, in DoRunPhase
    samples = spec.BenchmarkRun(spec)
  File "<https://builds.apache.org/job/beam_PerformanceTests_TextIOIT_HDFS/ws/PerfKitBenchmarker/perfkitbenchmarker/linux_benchmarks/beam_integration_benchmark.py",>
line 159, in Run
    job_type=job_type)
  File "<https://builds.apache.org/job/beam_PerformanceTests_TextIOIT_HDFS/ws/PerfKitBenchmarker/perfkitbenchmarker/providers/gcp/gcp_dpb_dataflow.py",>
line 90, in SubmitJob
    assert retcode == 0, "Integration Test Failed."
AssertionError: Integration Test Failed.
2018-04-03 13:04:46,844 00fc959d MainThread beam_integration_benchmark(1/1) ERROR    Benchmark
1/1 beam_integration_benchmark (UID: beam_integration_benchmark0) failed. Execution will continue.
2018-04-03 13:04:46,867 00fc959d MainThread INFO     Benchmark run statuses:
---------------------------------------------------------------------------------
Name                        UID                          Status  Failed Substatus
---------------------------------------------------------------------------------
beam_integration_benchmark  beam_integration_benchmark0  FAILED                  
---------------------------------------------------------------------------------
Success rate: 0.00% (0/1)
2018-04-03 13:04:46,868 00fc959d MainThread INFO     Complete logs can be found at: <https://builds.apache.org/job/beam_PerformanceTests_TextIOIT_HDFS/ws/runs/00fc959d/pkb.log>
2018-04-03 13:04:46,868 00fc959d MainThread INFO     Completion statuses can be found at:
<https://builds.apache.org/job/beam_PerformanceTests_TextIOIT_HDFS/ws/runs/00fc959d/completion_statuses.json>
Build step 'Execute shell' marked build as failure

Mime
View raw message