beam-commits mailing list archives

Site index · List index
Message view « Date » · « Thread »
Top « Date » · « Thread »
From Apache Jenkins Server <jenk...@builds.apache.org>
Subject Build failed in Jenkins: beam_PostCommit_Java_ValidatesRunner_Dataflow #5170
Date Sat, 17 Mar 2018 18:08:49 GMT
See <https://builds.apache.org/job/beam_PostCommit_Java_ValidatesRunner_Dataflow/5170/display/redirect>

------------------------------------------
[...truncated 1.54 MB...]
2018-03-17T18:07:52.977 [INFO] Dependency-reduced POM written at: <https://builds.apache.org/job/beam_PostCommit_Java_ValidatesRunner_Dataflow/ws/src/sdks/java/extensions/google-cloud-platform-core/dependency-reduced-pom.xml>
2018-03-17T18:07:53.197 [INFO] 
2018-03-17T18:07:53.197 [INFO] --- maven-dependency-plugin:3.0.2:analyze-only (default) @
beam-sdks-java-extensions-google-cloud-platform-core ---
2018-03-17T18:07:53.251 [INFO] No dependency problems found
[JENKINS] Archiving disabled
2018-03-17T18:07:55.350 [INFO] 
2018-03-17T18:07:55.350 [INFO] ------------------------------------------------------------------------
2018-03-17T18:07:55.350 [INFO] Building Apache Beam :: Runners 2.5.0-SNAPSHOT
2018-03-17T18:07:55.350 [INFO] ------------------------------------------------------------------------
2018-03-17T18:07:55.352 [INFO] 
2018-03-17T18:07:55.352 [INFO] --- maven-clean-plugin:3.0.0:clean (default-clean) @ beam-runners-parent
---
2018-03-17T18:07:55.354 [INFO] Deleting <https://builds.apache.org/job/beam_PostCommit_Java_ValidatesRunner_Dataflow/ws/src/runners>
(includes = [**/*.pyc, **/*.egg-info/, **/sdks/python/LICENSE, **/sdks/python/NOTICE, **/sdks/python/README.md,
**/sdks/python/apache_beam/portability/api/*pb2*.*, **/sdks/python/apache_beam/portability/common_urns.py,
**/sdks/python/**/*.c, **/sdks/python/**/*.so, **/sdks/python/**/*.egg], excludes = [])
2018-03-17T18:07:55.489 [INFO] 
2018-03-17T18:07:55.489 [INFO] --- maven-enforcer-plugin:3.0.0-M1:enforce (enforce-maven-version)
@ beam-runners-parent ---
2018-03-17T18:07:55.841 [INFO] 
2018-03-17T18:07:55.842 [INFO] --- maven-enforcer-plugin:3.0.0-M1:enforce (enforce) @ beam-runners-parent
---
2018-03-17T18:07:55.843 [INFO] Adding ignore: module-info
2018-03-17T18:07:55.950 [INFO] 
2018-03-17T18:07:55.950 [INFO] --- maven-enforcer-plugin:3.0.0-M1:enforce (enforce-banned-dependencies)
@ beam-runners-parent ---
2018-03-17T18:07:56.149 [INFO] 
2018-03-17T18:07:56.149 [INFO] --- maven-remote-resources-plugin:1.5:process (process-resource-bundles)
@ beam-runners-parent ---
2018-03-17T18:07:56.264 [INFO] 
2018-03-17T18:07:56.264 [INFO] --- maven-checkstyle-plugin:3.0.0:check (default) @ beam-runners-parent
---
2018-03-17T18:07:56.390 [INFO] Starting audit...
Audit done.
2018-03-17T18:07:56.498 [INFO] 
2018-03-17T18:07:56.498 [INFO] --- build-helper-maven-plugin:3.0.0:regex-properties (render-artifact-id)
@ beam-runners-parent ---
2018-03-17T18:07:56.606 [INFO] 
2018-03-17T18:07:56.606 [INFO] --- maven-site-plugin:3.7:attach-descriptor (attach-descriptor)
@ beam-runners-parent ---
2018-03-17T18:07:56.607 [INFO] No site descriptor found: nothing to attach.
2018-03-17T18:07:56.820 [INFO] 
2018-03-17T18:07:56.820 [INFO] --- maven-jar-plugin:3.0.2:jar (default-jar) @ beam-runners-parent
---
2018-03-17T18:07:56.821 [INFO] Skipping packaging of the jar
2018-03-17T18:07:57.035 [INFO] 
2018-03-17T18:07:57.035 [INFO] --- maven-jar-plugin:3.0.2:test-jar (default-test-jar) @ beam-runners-parent
---
2018-03-17T18:07:57.036 [INFO] Skipping packaging of the test-jar
2018-03-17T18:07:57.142 [INFO] 
2018-03-17T18:07:57.142 [INFO] --- maven-shade-plugin:3.1.0:shade (bundle-and-repackage) @
beam-runners-parent ---
2018-03-17T18:07:57.146 [INFO] Replacing original artifact with shaded artifact.
2018-03-17T18:07:57.253 [INFO] 
2018-03-17T18:07:57.253 [INFO] --- maven-dependency-plugin:3.0.2:analyze-only (default) @
beam-runners-parent ---
2018-03-17T18:07:57.254 [INFO] Skipping pom project
[JENKINS] Archiving disabled
2018-03-17T18:07:58.938 [INFO] 
2018-03-17T18:07:58.938 [INFO] ------------------------------------------------------------------------
2018-03-17T18:07:58.938 [INFO] Building Apache Beam :: Runners :: Core Construction Java 2.5.0-SNAPSHOT
2018-03-17T18:07:58.938 [INFO] ------------------------------------------------------------------------
2018-03-17T18:07:58.945 [INFO] 
2018-03-17T18:07:58.945 [INFO] --- maven-clean-plugin:3.0.0:clean (default-clean) @ beam-runners-core-construction-java
---
2018-03-17T18:07:58.947 [INFO] Deleting <https://builds.apache.org/job/beam_PostCommit_Java_ValidatesRunner_Dataflow/ws/src/runners/core-construction-java>
(includes = [**/*.pyc, **/*.egg-info/, **/sdks/python/LICENSE, **/sdks/python/NOTICE, **/sdks/python/README.md,
**/sdks/python/apache_beam/portability/api/*pb2*.*, **/sdks/python/apache_beam/portability/common_urns.py,
**/sdks/python/**/*.c, **/sdks/python/**/*.so, **/sdks/python/**/*.egg], excludes = [])
2018-03-17T18:07:59.057 [INFO] 
2018-03-17T18:07:59.057 [INFO] --- maven-enforcer-plugin:3.0.0-M1:enforce (enforce-maven-version)
@ beam-runners-core-construction-java ---
2018-03-17T18:07:59.294 [INFO] 
2018-03-17T18:07:59.294 [INFO] --- maven-enforcer-plugin:3.0.0-M1:enforce (enforce) @ beam-runners-core-construction-java
---
2018-03-17T18:07:59.328 [INFO] Adding ignore: module-info
2018-03-17T18:07:59.999 [INFO] 
2018-03-17T18:08:00.000 [INFO] --- maven-enforcer-plugin:3.0.0-M1:enforce (enforce-banned-dependencies)
@ beam-runners-core-construction-java ---
2018-03-17T18:08:00.464 [INFO] 
2018-03-17T18:08:00.464 [INFO] --- maven-remote-resources-plugin:1.5:process (process-resource-bundles)
@ beam-runners-core-construction-java ---
2018-03-17T18:08:00.769 [INFO] 
2018-03-17T18:08:00.770 [INFO] --- maven-resources-plugin:3.0.2:resources (default-resources)
@ beam-runners-core-construction-java ---
2018-03-17T18:08:00.771 [INFO] Using 'UTF-8' encoding to copy filtered resources.
2018-03-17T18:08:00.771 [INFO] skip non existing resourceDirectory <https://builds.apache.org/job/beam_PostCommit_Java_ValidatesRunner_Dataflow/ws/src/runners/core-construction-java/src/main/resources>
2018-03-17T18:08:00.771 [INFO] Copying 3 resources
2018-03-17T18:08:00.919 [INFO] 
2018-03-17T18:08:00.919 [INFO] --- maven-compiler-plugin:3.7.0:compile (default-compile) @
beam-runners-core-construction-java ---
2018-03-17T18:08:00.929 [INFO] Changes detected - recompiling the module!
2018-03-17T18:08:00.930 [INFO] Compiling 60 source files to <https://builds.apache.org/job/beam_PostCommit_Java_ValidatesRunner_Dataflow/ws/src/runners/core-construction-java/target/classes>
2018-03-17T18:08:02.318 [INFO] <https://builds.apache.org/job/beam_PostCommit_Java_ValidatesRunner_Dataflow/ws/src/runners/core-construction-java/src/main/java/org/apache/beam/runners/core/construction/TriggerTranslation.java>:
Some input files use or override a deprecated API.
2018-03-17T18:08:02.318 [INFO] <https://builds.apache.org/job/beam_PostCommit_Java_ValidatesRunner_Dataflow/ws/src/runners/core-construction-java/src/main/java/org/apache/beam/runners/core/construction/TriggerTranslation.java>:
Recompile with -Xlint:deprecation for details.
2018-03-17T18:08:02.318 [INFO] <https://builds.apache.org/job/beam_PostCommit_Java_ValidatesRunner_Dataflow/ws/src/runners/core-construction-java/src/main/java/org/apache/beam/runners/core/construction/PTransformTranslation.java>:
Some input files use unchecked or unsafe operations.
2018-03-17T18:08:02.318 [INFO] <https://builds.apache.org/job/beam_PostCommit_Java_ValidatesRunner_Dataflow/ws/src/runners/core-construction-java/src/main/java/org/apache/beam/runners/core/construction/PTransformTranslation.java>:
Recompile with -Xlint:unchecked for details.
2018-03-17T18:08:02.543 [INFO] 
2018-03-17T18:08:02.543 [INFO] --- maven-resources-plugin:3.0.2:testResources (default-testResources)
@ beam-runners-core-construction-java ---
2018-03-17T18:08:02.545 [INFO] Using 'UTF-8' encoding to copy filtered resources.
2018-03-17T18:08:02.545 [INFO] skip non existing resourceDirectory <https://builds.apache.org/job/beam_PostCommit_Java_ValidatesRunner_Dataflow/ws/src/runners/core-construction-java/src/test/resources>
2018-03-17T18:08:02.545 [INFO] Copying 3 resources
2018-03-17T18:08:02.652 [INFO] 
2018-03-17T18:08:02.652 [INFO] --- maven-compiler-plugin:3.7.0:testCompile (default-testCompile)
@ beam-runners-core-construction-java ---
2018-03-17T18:08:02.665 [INFO] Changes detected - recompiling the module!
2018-03-17T18:08:02.665 [INFO] Compiling 44 source files to <https://builds.apache.org/job/beam_PostCommit_Java_ValidatesRunner_Dataflow/ws/src/runners/core-construction-java/target/test-classes>
2018-03-17T18:08:05.631 [INFO] <https://builds.apache.org/job/beam_PostCommit_Java_ValidatesRunner_Dataflow/ws/src/runners/core-construction-java/src/test/java/org/apache/beam/runners/core/construction/PTransformTranslationTest.java>:
Some input files use or override a deprecated API.
2018-03-17T18:08:05.631 [INFO] <https://builds.apache.org/job/beam_PostCommit_Java_ValidatesRunner_Dataflow/ws/src/runners/core-construction-java/src/test/java/org/apache/beam/runners/core/construction/PTransformTranslationTest.java>:
Recompile with -Xlint:deprecation for details.
2018-03-17T18:08:05.631 [INFO] <https://builds.apache.org/job/beam_PostCommit_Java_ValidatesRunner_Dataflow/ws/src/runners/core-construction-java/src/test/java/org/apache/beam/runners/core/construction/ParDoTranslationTest.java>:
Some input files use unchecked or unsafe operations.
2018-03-17T18:08:05.631 [INFO] <https://builds.apache.org/job/beam_PostCommit_Java_ValidatesRunner_Dataflow/ws/src/runners/core-construction-java/src/test/java/org/apache/beam/runners/core/construction/ParDoTranslationTest.java>:
Recompile with -Xlint:unchecked for details.
2018-03-17T18:08:06.117 [INFO] 
2018-03-17T18:08:06.117 [INFO] --- maven-checkstyle-plugin:3.0.0:check (default) @ beam-runners-core-construction-java
---
2018-03-17T18:08:07.433 [INFO] Starting audit...
[ERROR] <https://builds.apache.org/job/beam_PostCommit_Java_ValidatesRunner_Dataflow/ws/src/runners/core-construction-java/src/main/java/org/apache/beam/runners/core/construction/graph/Networks.java>:77:18:
Name 'N' must match pattern '^(((T|K|V|W|X)[0-9]*)|([A-Z][a-z][a-zA-Z]*T))$'. [MethodTypeParameterName]
[ERROR] <https://builds.apache.org/job/beam_PostCommit_Java_ValidatesRunner_Dataflow/ws/src/runners/core-construction-java/src/main/java/org/apache/beam/runners/core/construction/graph/Networks.java>:77:21:
Name 'E' must match pattern '^(((T|K|V|W|X)[0-9]*)|([A-Z][a-z][a-zA-Z]*T))$'. [MethodTypeParameterName]
[ERROR] <https://builds.apache.org/job/beam_PostCommit_Java_ValidatesRunner_Dataflow/ws/src/runners/core-construction-java/src/main/java/org/apache/beam/runners/core/construction/graph/Networks.java>:128:18:
Name 'N' must match pattern '^(((T|K|V|W|X)[0-9]*)|([A-Z][a-z][a-zA-Z]*T))$'. [MethodTypeParameterName]
[ERROR] <https://builds.apache.org/job/beam_PostCommit_Java_ValidatesRunner_Dataflow/ws/src/runners/core-construction-java/src/main/java/org/apache/beam/runners/core/construction/graph/Networks.java>:128:21:
Name 'E' must match pattern '^(((T|K|V|W|X)[0-9]*)|([A-Z][a-z][a-zA-Z]*T))$'. [MethodTypeParameterName]
[ERROR] <https://builds.apache.org/job/beam_PostCommit_Java_ValidatesRunner_Dataflow/ws/src/runners/core-construction-java/src/main/java/org/apache/beam/runners/core/construction/graph/Networks.java>:147:18:
Name 'N' must match pattern '^(((T|K|V|W|X)[0-9]*)|([A-Z][a-z][a-zA-Z]*T))$'. [MethodTypeParameterName]
[ERROR] <https://builds.apache.org/job/beam_PostCommit_Java_ValidatesRunner_Dataflow/ws/src/runners/core-construction-java/src/main/java/org/apache/beam/runners/core/construction/graph/Networks.java>:147:21:
Name 'E' must match pattern '^(((T|K|V|W|X)[0-9]*)|([A-Z][a-z][a-zA-Z]*T))$'. [MethodTypeParameterName]
[ERROR] <https://builds.apache.org/job/beam_PostCommit_Java_ValidatesRunner_Dataflow/ws/src/runners/core-construction-java/src/main/java/org/apache/beam/runners/core/construction/graph/Networks.java>:182:18:
Name 'N' must match pattern '^(((T|K|V|W|X)[0-9]*)|([A-Z][a-z][a-zA-Z]*T))$'. [MethodTypeParameterName]
[ERROR] <https://builds.apache.org/job/beam_PostCommit_Java_ValidatesRunner_Dataflow/ws/src/runners/core-construction-java/src/main/java/org/apache/beam/runners/core/construction/graph/Networks.java>:182:21:
Name 'E' must match pattern '^(((T|K|V|W|X)[0-9]*)|([A-Z][a-z][a-zA-Z]*T))$'. [MethodTypeParameterName]
[ERROR] <https://builds.apache.org/job/beam_PostCommit_Java_ValidatesRunner_Dataflow/ws/src/runners/core-construction-java/src/main/java/org/apache/beam/runners/core/construction/graph/Networks.java>:219:18:
Name 'N' must match pattern '^(((T|K|V|W|X)[0-9]*)|([A-Z][a-z][a-zA-Z]*T))$'. [MethodTypeParameterName]
[ERROR] <https://builds.apache.org/job/beam_PostCommit_Java_ValidatesRunner_Dataflow/ws/src/runners/core-construction-java/src/main/java/org/apache/beam/runners/core/construction/graph/Networks.java>:219:21:
Name 'E' must match pattern '^(((T|K|V|W|X)[0-9]*)|([A-Z][a-z][a-zA-Z]*T))$'. [MethodTypeParameterName]
Audit done.
2018-03-17T18:08:07.434 [INFO] There are 10 errors reported by Checkstyle 8.7 with beam/checkstyle.xml
ruleset.
2018-03-17T18:08:07.435 [ERROR] src/main/java/org/apache/beam/runners/core/construction/graph/Networks.java:[77,18]
(naming) MethodTypeParameterName: Name 'N' must match pattern '^(((T|K|V|W|X)[0-9]*)|([A-Z][a-z][a-zA-Z]*T))$'.
2018-03-17T18:08:07.436 [ERROR] src/main/java/org/apache/beam/runners/core/construction/graph/Networks.java:[77,21]
(naming) MethodTypeParameterName: Name 'E' must match pattern '^(((T|K|V|W|X)[0-9]*)|([A-Z][a-z][a-zA-Z]*T))$'.
2018-03-17T18:08:07.436 [ERROR] src/main/java/org/apache/beam/runners/core/construction/graph/Networks.java:[128,18]
(naming) MethodTypeParameterName: Name 'N' must match pattern '^(((T|K|V|W|X)[0-9]*)|([A-Z][a-z][a-zA-Z]*T))$'.
2018-03-17T18:08:07.436 [ERROR] src/main/java/org/apache/beam/runners/core/construction/graph/Networks.java:[128,21]
(naming) MethodTypeParameterName: Name 'E' must match pattern '^(((T|K|V|W|X)[0-9]*)|([A-Z][a-z][a-zA-Z]*T))$'.
2018-03-17T18:08:07.436 [ERROR] src/main/java/org/apache/beam/runners/core/construction/graph/Networks.java:[147,18]
(naming) MethodTypeParameterName: Name 'N' must match pattern '^(((T|K|V|W|X)[0-9]*)|([A-Z][a-z][a-zA-Z]*T))$'.
2018-03-17T18:08:07.436 [ERROR] src/main/java/org/apache/beam/runners/core/construction/graph/Networks.java:[147,21]
(naming) MethodTypeParameterName: Name 'E' must match pattern '^(((T|K|V|W|X)[0-9]*)|([A-Z][a-z][a-zA-Z]*T))$'.
2018-03-17T18:08:07.436 [ERROR] src/main/java/org/apache/beam/runners/core/construction/graph/Networks.java:[182,18]
(naming) MethodTypeParameterName: Name 'N' must match pattern '^(((T|K|V|W|X)[0-9]*)|([A-Z][a-z][a-zA-Z]*T))$'.
2018-03-17T18:08:07.436 [ERROR] src/main/java/org/apache/beam/runners/core/construction/graph/Networks.java:[182,21]
(naming) MethodTypeParameterName: Name 'E' must match pattern '^(((T|K|V|W|X)[0-9]*)|([A-Z][a-z][a-zA-Z]*T))$'.
2018-03-17T18:08:07.436 [ERROR] src/main/java/org/apache/beam/runners/core/construction/graph/Networks.java:[219,18]
(naming) MethodTypeParameterName: Name 'N' must match pattern '^(((T|K|V|W|X)[0-9]*)|([A-Z][a-z][a-zA-Z]*T))$'.
2018-03-17T18:08:07.436 [ERROR] src/main/java/org/apache/beam/runners/core/construction/graph/Networks.java:[219,21]
(naming) MethodTypeParameterName: Name 'E' must match pattern '^(((T|K|V|W|X)[0-9]*)|([A-Z][a-z][a-zA-Z]*T))$'.
[JENKINS] Archiving disabled
[JENKINS] Archiving disabled
[JENKINS] Archiving disabled
[JENKINS] Archiving disabled
[JENKINS] Archiving disabled
[JENKINS] Archiving disabled
[JENKINS] Archiving disabled
[JENKINS] Archiving disabled
[JENKINS] Archiving disabled
[JENKINS] Archiving disabled
[JENKINS] Archiving disabled
[JENKINS] Archiving disabled
[JENKINS] Archiving disabled
[JENKINS] Archiving disabled
[JENKINS] Archiving disabled
[JENKINS] Archiving disabled
[JENKINS] Archiving disabled
[JENKINS] Archiving disabled
[JENKINS] Archiving disabled
[JENKINS] Archiving disabled
[JENKINS] Archiving disabled
2018-03-17T18:08:21.182 [INFO] ------------------------------------------------------------------------
2018-03-17T18:08:21.182 [INFO] Reactor Summary:
2018-03-17T18:08:21.182 [INFO] 
2018-03-17T18:08:21.182 [INFO] Apache Beam :: Parent .............................. SUCCESS
[ 10.701 s]
2018-03-17T18:08:21.183 [INFO] Apache Beam :: SDKs :: Java :: Build Tools ......... SUCCESS
[  7.083 s]
2018-03-17T18:08:21.183 [INFO] Apache Beam :: Model ............................... SUCCESS
[  2.630 s]
2018-03-17T18:08:21.183 [INFO] Apache Beam :: Model :: Pipeline ................... SUCCESS
[ 17.368 s]
2018-03-17T18:08:21.183 [INFO] Apache Beam :: Model :: Job Management ............. SUCCESS
[  9.474 s]
2018-03-17T18:08:21.183 [INFO] Apache Beam :: Model :: Fn Execution ............... SUCCESS
[ 15.695 s]
2018-03-17T18:08:21.183 [INFO] Apache Beam :: SDKs ................................ SUCCESS
[  3.661 s]
2018-03-17T18:08:21.183 [INFO] Apache Beam :: SDKs :: Java ........................ SUCCESS
[  2.620 s]
2018-03-17T18:08:21.183 [INFO] Apache Beam :: SDKs :: Java :: Core ................ SUCCESS
[02:13 min]
2018-03-17T18:08:21.183 [INFO] Apache Beam :: SDKs :: Java :: Extensions .......... SUCCESS
[  3.121 s]
2018-03-17T18:08:21.183 [INFO] Apache Beam :: SDKs :: Java :: Extensions :: Google Cloud Platform
Core SUCCESS [ 11.043 s]
2018-03-17T18:08:21.183 [INFO] Apache Beam :: Runners ............................. SUCCESS
[  2.308 s]
2018-03-17T18:08:21.183 [INFO] Apache Beam :: Runners :: Core Construction Java ... FAILURE
[  9.034 s]
2018-03-17T18:08:21.183 [INFO] Apache Beam :: Runners :: Core Java ................ SKIPPED
2018-03-17T18:08:21.183 [INFO] Apache Beam :: SDKs :: Java :: IO .................. SKIPPED
2018-03-17T18:08:21.183 [INFO] Apache Beam :: Runners :: Local Java Core .......... SKIPPED
2018-03-17T18:08:21.183 [INFO] Apache Beam :: Runners :: Direct Java .............. SKIPPED
2018-03-17T18:08:21.183 [INFO] Apache Beam :: SDKs :: Java :: Extensions :: Protobuf SKIPPED
2018-03-17T18:08:21.183 [INFO] Apache Beam :: SDKs :: Java :: IO :: Google Cloud Platform
SKIPPED
2018-03-17T18:08:21.183 [INFO] Apache Beam :: Runners :: Google Cloud Dataflow .... SKIPPED
2018-03-17T18:08:21.183 [INFO] ------------------------------------------------------------------------
2018-03-17T18:08:21.183 [INFO] BUILD FAILURE
2018-03-17T18:08:21.183 [INFO] ------------------------------------------------------------------------
2018-03-17T18:08:21.183 [INFO] Total time: 05:51 min
2018-03-17T18:08:21.183 [INFO] Finished at: 2018-03-17T18:08:21Z
2018-03-17T18:08:21.788 [INFO] Final Memory: 142M/1462M
2018-03-17T18:08:21.788 [INFO] ------------------------------------------------------------------------
Waiting for Jenkins to finish collecting data2018-03-17T18:08:23.093 [ERROR] Failed to execute
goal org.apache.maven.plugins:maven-checkstyle-plugin:3.0.0:check (default) on project beam-runners-core-construction-java:
You have 10 Checkstyle violations. -> [Help 1]

org.apache.maven.lifecycle.LifecycleExecutionException: Failed to execute goal org.apache.maven.plugins:maven-checkstyle-plugin:3.0.0:check
(default) on project beam-runners-core-construction-java: You have 10 Checkstyle violations.
    at org.apache.maven.lifecycle.internal.MojoExecutor.execute (MojoExecutor.java:213)
    at org.apache.maven.lifecycle.internal.MojoExecutor.execute (MojoExecutor.java:154)
    at org.apache.maven.lifecycle.internal.MojoExecutor.execute (MojoExecutor.java:146)
    at org.apache.maven.lifecycle.internal.LifecycleModuleBuilder.buildProject (LifecycleModuleBuilder.java:117)
    at org.apache.maven.lifecycle.internal.LifecycleModuleBuilder.buildProject (LifecycleModuleBuilder.java:81)
    at org.apache.maven.lifecycle.internal.builder.singlethreaded.SingleThreadedBuilder.build
(SingleThreadedBuilder.java:51)
    at org.apache.maven.lifecycle.internal.LifecycleStarter.execute (LifecycleStarter.java:128)
    at org.apache.maven.DefaultMaven.doExecute (DefaultMaven.java:309)
    at org.apache.maven.DefaultMaven.doExecute (DefaultMaven.java:194)
    at org.apache.maven.DefaultMaven.execute (DefaultMaven.java:107)
    at org.jvnet.hudson.maven3.launcher.Maven35Launcher.main (Maven35Launcher.java:130)
    at sun.reflect.NativeMethodAccessorImpl.invoke0 (Native Method)
    at sun.reflect.NativeMethodAccessorImpl.invoke (NativeMethodAccessorImpl.java:62)
    at sun.reflect.DelegatingMethodAccessorImpl.invoke (DelegatingMethodAccessorImpl.java:43)
    at java.lang.reflect.Method.invoke (Method.java:498)
    at org.codehaus.plexus.classworlds.launcher.Launcher.launchEnhanced (Launcher.java:289)
    at org.codehaus.plexus.classworlds.launcher.Launcher.launch (Launcher.java:229)
    at jenkins.maven3.agent.Maven35Main.launch (Maven35Main.java:176)
    at sun.reflect.NativeMethodAccessorImpl.invoke0 (Native Method)
    at sun.reflect.NativeMethodAccessorImpl.invoke (NativeMethodAccessorImpl.java:62)
    at sun.reflect.DelegatingMethodAccessorImpl.invoke (DelegatingMethodAccessorImpl.java:43)
    at java.lang.reflect.Method.invoke (Method.java:498)
    at hudson.maven.Maven3Builder.call (Maven3Builder.java:139)
    at hudson.maven.Maven3Builder.call (Maven3Builder.java:70)
    at hudson.remoting.UserRequest.perform (UserRequest.java:207)
    at hudson.remoting.UserRequest.perform (UserRequest.java:53)
    at hudson.remoting.Request$2.run (Request.java:358)
    at hudson.remoting.InterceptingExecutorService$1.call (InterceptingExecutorService.java:72)
    at java.util.concurrent.FutureTask.run (FutureTask.java:266)
    at java.util.concurrent.ThreadPoolExecutor.runWorker (ThreadPoolExecutor.java:1149)
    at java.util.concurrent.ThreadPoolExecutor$Worker.run (ThreadPoolExecutor.java:624)
    at java.lang.Thread.run (Thread.java:748)
Caused by: org.apache.maven.plugin.MojoFailureException: You have 10 Checkstyle violations.
    at org.apache.maven.plugins.checkstyle.CheckstyleViolationCheckMojo.execute (CheckstyleViolationCheckMojo.java:576)
    at org.apache.maven.plugin.DefaultBuildPluginManager.executeMojo (DefaultBuildPluginManager.java:134)
    at org.apache.maven.lifecycle.internal.MojoExecutor.execute (MojoExecutor.java:208)
    at org.apache.maven.lifecycle.internal.MojoExecutor.execute (MojoExecutor.java:154)
    at org.apache.maven.lifecycle.internal.MojoExecutor.execute (MojoExecutor.java:146)
    at org.apache.maven.lifecycle.internal.LifecycleModuleBuilder.buildProject (LifecycleModuleBuilder.java:117)
    at org.apache.maven.lifecycle.internal.LifecycleModuleBuilder.buildProject (LifecycleModuleBuilder.java:81)
    at org.apache.maven.lifecycle.internal.builder.singlethreaded.SingleThreadedBuilder.build
(SingleThreadedBuilder.java:51)
    at org.apache.maven.lifecycle.internal.LifecycleStarter.execute (LifecycleStarter.java:128)
    at org.apache.maven.DefaultMaven.doExecute (DefaultMaven.java:309)
    at org.apache.maven.DefaultMaven.doExecute (DefaultMaven.java:194)
    at org.apache.maven.DefaultMaven.execute (DefaultMaven.java:107)
    at org.jvnet.hudson.maven3.launcher.Maven35Launcher.main (Maven35Launcher.java:130)
    at sun.reflect.NativeMethodAccessorImpl.invoke0 (Native Method)
    at sun.reflect.NativeMethodAccessorImpl.invoke (NativeMethodAccessorImpl.java:62)
    at sun.reflect.DelegatingMethodAccessorImpl.invoke (DelegatingMethodAccessorImpl.java:43)
    at java.lang.reflect.Method.invoke (Method.java:498)
    at org.codehaus.plexus.classworlds.launcher.Launcher.launchEnhanced (Launcher.java:289)
    at org.codehaus.plexus.classworlds.launcher.Launcher.launch (Launcher.java:229)
    at jenkins.maven3.agent.Maven35Main.launch (Maven35Main.java:176)
    at sun.reflect.NativeMethodAccessorImpl.invoke0 (Native Method)
    at sun.reflect.NativeMethodAccessorImpl.invoke (NativeMethodAccessorImpl.java:62)
    at sun.reflect.DelegatingMethodAccessorImpl.invoke (DelegatingMethodAccessorImpl.java:43)
    at java.lang.reflect.Method.invoke (Method.java:498)
    at hudson.maven.Maven3Builder.call (Maven3Builder.java:139)
    at hudson.maven.Maven3Builder.call (Maven3Builder.java:70)
    at hudson.remoting.UserRequest.perform (UserRequest.java:207)
    at hudson.remoting.UserRequest.perform (UserRequest.java:53)
    at hudson.remoting.Request$2.run (Request.java:358)
    at hudson.remoting.InterceptingExecutorService$1.call (InterceptingExecutorService.java:72)
    at java.util.concurrent.FutureTask.run (FutureTask.java:266)
    at java.util.concurrent.ThreadPoolExecutor.runWorker (ThreadPoolExecutor.java:1149)
    at java.util.concurrent.ThreadPoolExecutor$Worker.run (ThreadPoolExecutor.java:624)
    at java.lang.Thread.run (Thread.java:748)
2018-03-17T18:08:23.095 [ERROR] 
2018-03-17T18:08:23.095 [ERROR] Re-run Maven using the -X switch to enable full debug logging.
2018-03-17T18:08:23.095 [ERROR] 
2018-03-17T18:08:23.095 [ERROR] For more information about the errors and possible solutions,
please read the following articles:
2018-03-17T18:08:23.095 [ERROR] [Help 1] http://cwiki.apache.org/confluence/display/MAVEN/MojoFailureException
2018-03-17T18:08:23.095 [ERROR] 
2018-03-17T18:08:23.095 [ERROR] After correcting the problems, you can resume the build with
the command
2018-03-17T18:08:23.095 [ERROR]   mvn <goals> -rf :beam-runners-core-construction-java
channel stopped
Not sending mail to unregistered user aaltay@gmail.com
Not sending mail to unregistered user ekirpichov@gmail.com
Not sending mail to unregistered user lukasz.gajowy@polidea.com
Not sending mail to unregistered user ankurgoenka@gmail.com
Not sending mail to unregistered user markliu@google.com
Not sending mail to unregistered user herohde@google.com
Not sending mail to unregistered user XuMingmin@users.noreply.github.com
Not sending mail to unregistered user sidhom@google.com
Not sending mail to unregistered user rober@frantil.com

Mime
View raw message