beam-commits mailing list archives

Site index · List index
Message view « Date » · « Thread »
Top « Date » · « Thread »
From Apache Jenkins Server <jenk...@builds.apache.org>
Subject Build failed in Jenkins: beam_PostCommit_Java_ValidatesRunner_Flink #5262
Date Sun, 18 Mar 2018 12:09:56 GMT
See <https://builds.apache.org/job/beam_PostCommit_Java_ValidatesRunner_Flink/5262/display/redirect>

------------------------------------------
[...truncated 131.51 KB...]
2018-03-18T12:09:20.357 [INFO] Excluding com.fasterxml.jackson.core:jackson-annotations:jar:2.8.9
from the shaded jar.
2018-03-18T12:09:20.357 [INFO] Excluding com.fasterxml.jackson.core:jackson-databind:jar:2.8.9
from the shaded jar.
2018-03-18T12:09:20.357 [INFO] Excluding com.google.auto.service:auto-service:jar:1.0-rc2
from the shaded jar.
2018-03-18T12:09:20.357 [INFO] Excluding com.google.auto:auto-common:jar:0.3 from the shaded
jar.
2018-03-18T12:09:21.628 [INFO] Replacing original artifact with shaded artifact.
2018-03-18T12:09:21.628 [INFO] Replacing <https://builds.apache.org/job/beam_PostCommit_Java_ValidatesRunner_Flink/ws/src/sdks/java/extensions/google-cloud-platform-core/target/beam-sdks-java-extensions-google-cloud-platform-core-2.5.0-SNAPSHOT.jar>
with <https://builds.apache.org/job/beam_PostCommit_Java_ValidatesRunner_Flink/ws/src/sdks/java/extensions/google-cloud-platform-core/target/beam-sdks-java-extensions-google-cloud-platform-core-2.5.0-SNAPSHOT-shaded.jar>
2018-03-18T12:09:21.628 [INFO] Replacing original test artifact with shaded test artifact.
2018-03-18T12:09:21.628 [INFO] Replacing <https://builds.apache.org/job/beam_PostCommit_Java_ValidatesRunner_Flink/ws/src/sdks/java/extensions/google-cloud-platform-core/target/beam-sdks-java-extensions-google-cloud-platform-core-2.5.0-SNAPSHOT-tests.jar>
with <https://builds.apache.org/job/beam_PostCommit_Java_ValidatesRunner_Flink/ws/src/sdks/java/extensions/google-cloud-platform-core/target/beam-sdks-java-extensions-google-cloud-platform-core-2.5.0-SNAPSHOT-shaded-tests.jar>
2018-03-18T12:09:21.629 [INFO] Dependency-reduced POM written at: <https://builds.apache.org/job/beam_PostCommit_Java_ValidatesRunner_Flink/ws/src/sdks/java/extensions/google-cloud-platform-core/dependency-reduced-pom.xml>
2018-03-18T12:09:21.865 [INFO] 
2018-03-18T12:09:21.865 [INFO] --- maven-dependency-plugin:3.0.2:analyze-only (default) @
beam-sdks-java-extensions-google-cloud-platform-core ---
2018-03-18T12:09:21.924 [INFO] No dependency problems found
[JENKINS] Archiving disabled
2018-03-18T12:09:23.861 [INFO] 
2018-03-18T12:09:23.861 [INFO] ------------------------------------------------------------------------
2018-03-18T12:09:23.861 [INFO] Building Apache Beam :: Runners 2.5.0-SNAPSHOT
2018-03-18T12:09:23.861 [INFO] ------------------------------------------------------------------------
2018-03-18T12:09:23.865 [INFO] 
2018-03-18T12:09:23.865 [INFO] --- maven-clean-plugin:3.0.0:clean (default-clean) @ beam-runners-parent
---
2018-03-18T12:09:23.867 [INFO] Deleting <https://builds.apache.org/job/beam_PostCommit_Java_ValidatesRunner_Flink/ws/src/runners>
(includes = [**/*.pyc, **/*.egg-info/, **/sdks/python/LICENSE, **/sdks/python/NOTICE, **/sdks/python/README.md,
**/sdks/python/apache_beam/portability/api/*pb2*.*, **/sdks/python/apache_beam/portability/common_urns.py,
**/sdks/python/**/*.c, **/sdks/python/**/*.so, **/sdks/python/**/*.egg], excludes = [])
2018-03-18T12:09:24.013 [INFO] 
2018-03-18T12:09:24.013 [INFO] --- maven-enforcer-plugin:3.0.0-M1:enforce (enforce-maven-version)
@ beam-runners-parent ---
2018-03-18T12:09:24.120 [INFO] 
2018-03-18T12:09:24.120 [INFO] --- maven-enforcer-plugin:3.0.0-M1:enforce (enforce) @ beam-runners-parent
---
2018-03-18T12:09:24.122 [INFO] Adding ignore: module-info
2018-03-18T12:09:24.228 [INFO] 
2018-03-18T12:09:24.228 [INFO] --- maven-enforcer-plugin:3.0.0-M1:enforce (enforce-banned-dependencies)
@ beam-runners-parent ---
2018-03-18T12:09:24.338 [INFO] 
2018-03-18T12:09:24.338 [INFO] --- maven-remote-resources-plugin:1.5:process (process-resource-bundles)
@ beam-runners-parent ---
2018-03-18T12:09:24.452 [INFO] 
2018-03-18T12:09:24.452 [INFO] --- maven-checkstyle-plugin:3.0.0:check (default) @ beam-runners-parent
---
2018-03-18T12:09:24.576 [INFO] Starting audit...
Audit done.
2018-03-18T12:09:24.683 [INFO] 
2018-03-18T12:09:24.684 [INFO] --- build-helper-maven-plugin:3.0.0:regex-properties (render-artifact-id)
@ beam-runners-parent ---
2018-03-18T12:09:24.791 [INFO] 
2018-03-18T12:09:24.791 [INFO] --- maven-site-plugin:3.7:attach-descriptor (attach-descriptor)
@ beam-runners-parent ---
2018-03-18T12:09:24.792 [INFO] No site descriptor found: nothing to attach.
2018-03-18T12:09:25.037 [INFO] 
2018-03-18T12:09:25.037 [INFO] --- maven-jar-plugin:3.0.2:jar (default-jar) @ beam-runners-parent
---
2018-03-18T12:09:25.038 [INFO] Skipping packaging of the jar
2018-03-18T12:09:25.291 [INFO] 
2018-03-18T12:09:25.291 [INFO] --- maven-jar-plugin:3.0.2:test-jar (default-test-jar) @ beam-runners-parent
---
2018-03-18T12:09:25.292 [INFO] Skipping packaging of the test-jar
2018-03-18T12:09:25.400 [INFO] 
2018-03-18T12:09:25.400 [INFO] --- maven-shade-plugin:3.1.0:shade (bundle-and-repackage) @
beam-runners-parent ---
2018-03-18T12:09:25.403 [INFO] Replacing original artifact with shaded artifact.
2018-03-18T12:09:25.510 [INFO] 
2018-03-18T12:09:25.511 [INFO] --- maven-dependency-plugin:3.0.2:analyze-only (default) @
beam-runners-parent ---
2018-03-18T12:09:25.512 [INFO] Skipping pom project
[JENKINS] Archiving disabled
2018-03-18T12:09:26.740 [INFO] 
2018-03-18T12:09:26.740 [INFO] ------------------------------------------------------------------------
2018-03-18T12:09:26.740 [INFO] Building Apache Beam :: Runners :: Core Construction Java 2.5.0-SNAPSHOT
2018-03-18T12:09:26.740 [INFO] ------------------------------------------------------------------------
2018-03-18T12:09:26.750 [INFO] 
2018-03-18T12:09:26.750 [INFO] --- maven-clean-plugin:3.0.0:clean (default-clean) @ beam-runners-core-construction-java
---
2018-03-18T12:09:26.752 [INFO] Deleting <https://builds.apache.org/job/beam_PostCommit_Java_ValidatesRunner_Flink/ws/src/runners/core-construction-java>
(includes = [**/*.pyc, **/*.egg-info/, **/sdks/python/LICENSE, **/sdks/python/NOTICE, **/sdks/python/README.md,
**/sdks/python/apache_beam/portability/api/*pb2*.*, **/sdks/python/apache_beam/portability/common_urns.py,
**/sdks/python/**/*.c, **/sdks/python/**/*.so, **/sdks/python/**/*.egg], excludes = [])
2018-03-18T12:09:26.863 [INFO] 
2018-03-18T12:09:26.863 [INFO] --- maven-enforcer-plugin:3.0.0-M1:enforce (enforce-maven-version)
@ beam-runners-core-construction-java ---
2018-03-18T12:09:27.107 [INFO] 
2018-03-18T12:09:27.108 [INFO] --- maven-enforcer-plugin:3.0.0-M1:enforce (enforce) @ beam-runners-core-construction-java
---
2018-03-18T12:09:27.146 [INFO] Adding ignore: module-info
2018-03-18T12:09:27.509 [INFO] 
2018-03-18T12:09:27.509 [INFO] --- maven-enforcer-plugin:3.0.0-M1:enforce (enforce-banned-dependencies)
@ beam-runners-core-construction-java ---
2018-03-18T12:09:27.627 [INFO] 
2018-03-18T12:09:27.627 [INFO] --- maven-remote-resources-plugin:1.5:process (process-resource-bundles)
@ beam-runners-core-construction-java ---
2018-03-18T12:09:27.940 [INFO] 
2018-03-18T12:09:27.941 [INFO] --- maven-resources-plugin:3.0.2:resources (default-resources)
@ beam-runners-core-construction-java ---
2018-03-18T12:09:27.942 [INFO] Using 'UTF-8' encoding to copy filtered resources.
2018-03-18T12:09:27.942 [INFO] skip non existing resourceDirectory <https://builds.apache.org/job/beam_PostCommit_Java_ValidatesRunner_Flink/ws/src/runners/core-construction-java/src/main/resources>
2018-03-18T12:09:27.942 [INFO] Copying 3 resources
2018-03-18T12:09:28.050 [INFO] 
2018-03-18T12:09:28.050 [INFO] --- maven-compiler-plugin:3.7.0:compile (default-compile) @
beam-runners-core-construction-java ---
2018-03-18T12:09:28.064 [INFO] Changes detected - recompiling the module!
2018-03-18T12:09:28.064 [INFO] Compiling 60 source files to <https://builds.apache.org/job/beam_PostCommit_Java_ValidatesRunner_Flink/ws/src/runners/core-construction-java/target/classes>
2018-03-18T12:09:29.314 [INFO] <https://builds.apache.org/job/beam_PostCommit_Java_ValidatesRunner_Flink/ws/src/runners/core-construction-java/src/main/java/org/apache/beam/runners/core/construction/JavaReadViaImpulse.java>:
Some input files use or override a deprecated API.
2018-03-18T12:09:29.314 [INFO] <https://builds.apache.org/job/beam_PostCommit_Java_ValidatesRunner_Flink/ws/src/runners/core-construction-java/src/main/java/org/apache/beam/runners/core/construction/JavaReadViaImpulse.java>:
Recompile with -Xlint:deprecation for details.
2018-03-18T12:09:29.314 [INFO] <https://builds.apache.org/job/beam_PostCommit_Java_ValidatesRunner_Flink/ws/src/runners/core-construction-java/src/main/java/org/apache/beam/runners/core/construction/PTransformTranslation.java>:
Some input files use unchecked or unsafe operations.
2018-03-18T12:09:29.314 [INFO] <https://builds.apache.org/job/beam_PostCommit_Java_ValidatesRunner_Flink/ws/src/runners/core-construction-java/src/main/java/org/apache/beam/runners/core/construction/PTransformTranslation.java>:
Recompile with -Xlint:unchecked for details.
2018-03-18T12:09:29.420 [INFO] 
2018-03-18T12:09:29.421 [INFO] --- maven-resources-plugin:3.0.2:testResources (default-testResources)
@ beam-runners-core-construction-java ---
2018-03-18T12:09:29.422 [INFO] Using 'UTF-8' encoding to copy filtered resources.
2018-03-18T12:09:29.422 [INFO] skip non existing resourceDirectory <https://builds.apache.org/job/beam_PostCommit_Java_ValidatesRunner_Flink/ws/src/runners/core-construction-java/src/test/resources>
2018-03-18T12:09:29.422 [INFO] Copying 3 resources
2018-03-18T12:09:29.530 [INFO] 
2018-03-18T12:09:29.530 [INFO] --- maven-compiler-plugin:3.7.0:testCompile (default-testCompile)
@ beam-runners-core-construction-java ---
2018-03-18T12:09:29.546 [INFO] Changes detected - recompiling the module!
2018-03-18T12:09:29.547 [INFO] Compiling 44 source files to <https://builds.apache.org/job/beam_PostCommit_Java_ValidatesRunner_Flink/ws/src/runners/core-construction-java/target/test-classes>
2018-03-18T12:09:31.380 [INFO] <https://builds.apache.org/job/beam_PostCommit_Java_ValidatesRunner_Flink/ws/src/runners/core-construction-java/src/test/java/org/apache/beam/runners/core/construction/WindowIntoTranslationTest.java>:
Some input files use or override a deprecated API.
2018-03-18T12:09:31.380 [INFO] <https://builds.apache.org/job/beam_PostCommit_Java_ValidatesRunner_Flink/ws/src/runners/core-construction-java/src/test/java/org/apache/beam/runners/core/construction/WindowIntoTranslationTest.java>:
Recompile with -Xlint:deprecation for details.
2018-03-18T12:09:31.380 [INFO] <https://builds.apache.org/job/beam_PostCommit_Java_ValidatesRunner_Flink/ws/src/runners/core-construction-java/src/test/java/org/apache/beam/runners/core/construction/UnsupportedOverrideFactoryTest.java>:
Some input files use unchecked or unsafe operations.
2018-03-18T12:09:31.380 [INFO] <https://builds.apache.org/job/beam_PostCommit_Java_ValidatesRunner_Flink/ws/src/runners/core-construction-java/src/test/java/org/apache/beam/runners/core/construction/UnsupportedOverrideFactoryTest.java>:
Recompile with -Xlint:unchecked for details.
2018-03-18T12:09:31.487 [INFO] 
2018-03-18T12:09:31.488 [INFO] --- maven-checkstyle-plugin:3.0.0:check (default) @ beam-runners-core-construction-java
---
2018-03-18T12:09:33.096 [INFO] Starting audit...
[ERROR] <https://builds.apache.org/job/beam_PostCommit_Java_ValidatesRunner_Flink/ws/src/runners/core-construction-java/src/main/java/org/apache/beam/runners/core/construction/graph/Networks.java>:77:18:
Name 'N' must match pattern '^(((T|K|V|W|X)[0-9]*)|([A-Z][a-z][a-zA-Z]*T))$'. [MethodTypeParameterName]
[ERROR] <https://builds.apache.org/job/beam_PostCommit_Java_ValidatesRunner_Flink/ws/src/runners/core-construction-java/src/main/java/org/apache/beam/runners/core/construction/graph/Networks.java>:77:21:
Name 'E' must match pattern '^(((T|K|V|W|X)[0-9]*)|([A-Z][a-z][a-zA-Z]*T))$'. [MethodTypeParameterName]
[ERROR] <https://builds.apache.org/job/beam_PostCommit_Java_ValidatesRunner_Flink/ws/src/runners/core-construction-java/src/main/java/org/apache/beam/runners/core/construction/graph/Networks.java>:128:18:
Name 'N' must match pattern '^(((T|K|V|W|X)[0-9]*)|([A-Z][a-z][a-zA-Z]*T))$'. [MethodTypeParameterName]
[ERROR] <https://builds.apache.org/job/beam_PostCommit_Java_ValidatesRunner_Flink/ws/src/runners/core-construction-java/src/main/java/org/apache/beam/runners/core/construction/graph/Networks.java>:128:21:
Name 'E' must match pattern '^(((T|K|V|W|X)[0-9]*)|([A-Z][a-z][a-zA-Z]*T))$'. [MethodTypeParameterName]
[ERROR] <https://builds.apache.org/job/beam_PostCommit_Java_ValidatesRunner_Flink/ws/src/runners/core-construction-java/src/main/java/org/apache/beam/runners/core/construction/graph/Networks.java>:147:18:
Name 'N' must match pattern '^(((T|K|V|W|X)[0-9]*)|([A-Z][a-z][a-zA-Z]*T))$'. [MethodTypeParameterName]
[ERROR] <https://builds.apache.org/job/beam_PostCommit_Java_ValidatesRunner_Flink/ws/src/runners/core-construction-java/src/main/java/org/apache/beam/runners/core/construction/graph/Networks.java>:147:21:
Name 'E' must match pattern '^(((T|K|V|W|X)[0-9]*)|([A-Z][a-z][a-zA-Z]*T))$'. [MethodTypeParameterName]
[ERROR] <https://builds.apache.org/job/beam_PostCommit_Java_ValidatesRunner_Flink/ws/src/runners/core-construction-java/src/main/java/org/apache/beam/runners/core/construction/graph/Networks.java>:182:18:
Name 'N' must match pattern '^(((T|K|V|W|X)[0-9]*)|([A-Z][a-z][a-zA-Z]*T))$'. [MethodTypeParameterName]
[ERROR] <https://builds.apache.org/job/beam_PostCommit_Java_ValidatesRunner_Flink/ws/src/runners/core-construction-java/src/main/java/org/apache/beam/runners/core/construction/graph/Networks.java>:182:21:
Name 'E' must match pattern '^(((T|K|V|W|X)[0-9]*)|([A-Z][a-z][a-zA-Z]*T))$'. [MethodTypeParameterName]
[ERROR] <https://builds.apache.org/job/beam_PostCommit_Java_ValidatesRunner_Flink/ws/src/runners/core-construction-java/src/main/java/org/apache/beam/runners/core/construction/graph/Networks.java>:219:18:
Name 'N' must match pattern '^(((T|K|V|W|X)[0-9]*)|([A-Z][a-z][a-zA-Z]*T))$'. [MethodTypeParameterName]
[ERROR] <https://builds.apache.org/job/beam_PostCommit_Java_ValidatesRunner_Flink/ws/src/runners/core-construction-java/src/main/java/org/apache/beam/runners/core/construction/graph/Networks.java>:219:21:
Name 'E' must match pattern '^(((T|K|V|W|X)[0-9]*)|([A-Z][a-z][a-zA-Z]*T))$'. [MethodTypeParameterName]
Audit done.
2018-03-18T12:09:33.096 [INFO] There are 10 errors reported by Checkstyle 8.7 with beam/checkstyle.xml
ruleset.
2018-03-18T12:09:33.098 [ERROR] src/main/java/org/apache/beam/runners/core/construction/graph/Networks.java:[77,18]
(naming) MethodTypeParameterName: Name 'N' must match pattern '^(((T|K|V|W|X)[0-9]*)|([A-Z][a-z][a-zA-Z]*T))$'.
2018-03-18T12:09:33.098 [ERROR] src/main/java/org/apache/beam/runners/core/construction/graph/Networks.java:[77,21]
(naming) MethodTypeParameterName: Name 'E' must match pattern '^(((T|K|V|W|X)[0-9]*)|([A-Z][a-z][a-zA-Z]*T))$'.
2018-03-18T12:09:33.098 [ERROR] src/main/java/org/apache/beam/runners/core/construction/graph/Networks.java:[128,18]
(naming) MethodTypeParameterName: Name 'N' must match pattern '^(((T|K|V|W|X)[0-9]*)|([A-Z][a-z][a-zA-Z]*T))$'.
2018-03-18T12:09:33.098 [ERROR] src/main/java/org/apache/beam/runners/core/construction/graph/Networks.java:[128,21]
(naming) MethodTypeParameterName: Name 'E' must match pattern '^(((T|K|V|W|X)[0-9]*)|([A-Z][a-z][a-zA-Z]*T))$'.
2018-03-18T12:09:33.098 [ERROR] src/main/java/org/apache/beam/runners/core/construction/graph/Networks.java:[147,18]
(naming) MethodTypeParameterName: Name 'N' must match pattern '^(((T|K|V|W|X)[0-9]*)|([A-Z][a-z][a-zA-Z]*T))$'.
2018-03-18T12:09:33.098 [ERROR] src/main/java/org/apache/beam/runners/core/construction/graph/Networks.java:[147,21]
(naming) MethodTypeParameterName: Name 'E' must match pattern '^(((T|K|V|W|X)[0-9]*)|([A-Z][a-z][a-zA-Z]*T))$'.
2018-03-18T12:09:33.098 [ERROR] src/main/java/org/apache/beam/runners/core/construction/graph/Networks.java:[182,18]
(naming) MethodTypeParameterName: Name 'N' must match pattern '^(((T|K|V|W|X)[0-9]*)|([A-Z][a-z][a-zA-Z]*T))$'.
2018-03-18T12:09:33.098 [ERROR] src/main/java/org/apache/beam/runners/core/construction/graph/Networks.java:[182,21]
(naming) MethodTypeParameterName: Name 'E' must match pattern '^(((T|K|V|W|X)[0-9]*)|([A-Z][a-z][a-zA-Z]*T))$'.
2018-03-18T12:09:33.098 [ERROR] src/main/java/org/apache/beam/runners/core/construction/graph/Networks.java:[219,18]
(naming) MethodTypeParameterName: Name 'N' must match pattern '^(((T|K|V|W|X)[0-9]*)|([A-Z][a-z][a-zA-Z]*T))$'.
2018-03-18T12:09:33.098 [ERROR] src/main/java/org/apache/beam/runners/core/construction/graph/Networks.java:[219,21]
(naming) MethodTypeParameterName: Name 'E' must match pattern '^(((T|K|V|W|X)[0-9]*)|([A-Z][a-z][a-zA-Z]*T))$'.
[JENKINS] Archiving disabled
[JENKINS] Archiving disabled
[JENKINS] Archiving disabled
[JENKINS] Archiving disabled
[JENKINS] Archiving disabled
[JENKINS] Archiving disabled
[JENKINS] Archiving disabled
[JENKINS] Archiving disabled
[JENKINS] Archiving disabled
[JENKINS] Archiving disabled
[JENKINS] Archiving disabled
[JENKINS] Archiving disabled
[JENKINS] Archiving disabled
[JENKINS] Archiving disabled
[JENKINS] Archiving disabled
[JENKINS] Archiving disabled
[JENKINS] Archiving disabled
[JENKINS] Archiving disabled
[JENKINS] Archiving disabled
[JENKINS] Archiving disabled
[JENKINS] Archiving disabled
2018-03-18T12:09:43.681 [INFO] ------------------------------------------------------------------------
2018-03-18T12:09:43.681 [INFO] Reactor Summary:
2018-03-18T12:09:43.681 [INFO] 
2018-03-18T12:09:43.681 [INFO] Apache Beam :: Parent .............................. SUCCESS
[  9.274 s]
2018-03-18T12:09:43.681 [INFO] Apache Beam :: SDKs :: Java :: Build Tools ......... SUCCESS
[  6.542 s]
2018-03-18T12:09:43.681 [INFO] Apache Beam :: Model ............................... SUCCESS
[  1.858 s]
2018-03-18T12:09:43.682 [INFO] Apache Beam :: Model :: Pipeline ................... SUCCESS
[  8.646 s]
2018-03-18T12:09:43.682 [INFO] Apache Beam :: Model :: Job Management ............. SUCCESS
[  7.168 s]
2018-03-18T12:09:43.682 [INFO] Apache Beam :: Model :: Fn Execution ............... SUCCESS
[  7.724 s]
2018-03-18T12:09:43.682 [INFO] Apache Beam :: SDKs ................................ SUCCESS
[  2.232 s]
2018-03-18T12:09:43.682 [INFO] Apache Beam :: SDKs :: Java ........................ SUCCESS
[  2.046 s]
2018-03-18T12:09:43.682 [INFO] Apache Beam :: SDKs :: Java :: Core ................ SUCCESS
[02:21 min]
2018-03-18T12:09:43.682 [INFO] Apache Beam :: SDKs :: Java :: Extensions .......... SUCCESS
[  2.209 s]
2018-03-18T12:09:43.682 [INFO] Apache Beam :: SDKs :: Java :: Extensions :: Google Cloud Platform
Core SUCCESS [ 14.698 s]
2018-03-18T12:09:43.682 [INFO] Apache Beam :: Runners ............................. SUCCESS
[  2.090 s]
2018-03-18T12:09:43.682 [INFO] Apache Beam :: Runners :: Core Construction Java ... FAILURE
[  6.863 s]
2018-03-18T12:09:43.682 [INFO] Apache Beam :: Runners :: Core Java ................ SKIPPED
2018-03-18T12:09:43.682 [INFO] Apache Beam :: SDKs :: Java :: IO .................. SKIPPED
2018-03-18T12:09:43.682 [INFO] Apache Beam :: Runners :: Local Java Core .......... SKIPPED
2018-03-18T12:09:43.682 [INFO] Apache Beam :: Runners :: Direct Java .............. SKIPPED
2018-03-18T12:09:43.682 [INFO] Apache Beam :: SDKs :: Java :: Extensions :: Protobuf SKIPPED
2018-03-18T12:09:43.682 [INFO] Apache Beam :: SDKs :: Java :: IO :: Google Cloud Platform
SKIPPED
2018-03-18T12:09:43.682 [INFO] Apache Beam :: Runners :: Flink .................... SKIPPED
2018-03-18T12:09:43.682 [INFO] ------------------------------------------------------------------------
2018-03-18T12:09:43.682 [INFO] BUILD FAILURE
2018-03-18T12:09:43.682 [INFO] ------------------------------------------------------------------------
2018-03-18T12:09:43.682 [INFO] Total time: 04:49 min
2018-03-18T12:09:43.682 [INFO] Finished at: 2018-03-18T12:09:43Z
2018-03-18T12:09:44.168 [INFO] Final Memory: 122M/1494M
2018-03-18T12:09:44.168 [INFO] ------------------------------------------------------------------------
Waiting for Jenkins to finish collecting data
2018-03-18T12:09:44.514 [ERROR] Failed to execute goal org.apache.maven.plugins:maven-checkstyle-plugin:3.0.0:check
(default) on project beam-runners-core-construction-java: You have 10 Checkstyle violations.
-> [Help 1]
org.apache.maven.lifecycle.LifecycleExecutionException: Failed to execute goal org.apache.maven.plugins:maven-checkstyle-plugin:3.0.0:check
(default) on project beam-runners-core-construction-java: You have 10 Checkstyle violations.
    at org.apache.maven.lifecycle.internal.MojoExecutor.execute (MojoExecutor.java:213)
    at org.apache.maven.lifecycle.internal.MojoExecutor.execute (MojoExecutor.java:154)
    at org.apache.maven.lifecycle.internal.MojoExecutor.execute (MojoExecutor.java:146)
    at org.apache.maven.lifecycle.internal.LifecycleModuleBuilder.buildProject (LifecycleModuleBuilder.java:117)
    at org.apache.maven.lifecycle.internal.LifecycleModuleBuilder.buildProject (LifecycleModuleBuilder.java:81)
    at org.apache.maven.lifecycle.internal.builder.singlethreaded.SingleThreadedBuilder.build
(SingleThreadedBuilder.java:51)
    at org.apache.maven.lifecycle.internal.LifecycleStarter.execute (LifecycleStarter.java:128)
    at org.apache.maven.DefaultMaven.doExecute (DefaultMaven.java:309)
    at org.apache.maven.DefaultMaven.doExecute (DefaultMaven.java:194)
    at org.apache.maven.DefaultMaven.execute (DefaultMaven.java:107)
    at org.jvnet.hudson.maven3.launcher.Maven35Launcher.main (Maven35Launcher.java:130)
    at sun.reflect.NativeMethodAccessorImpl.invoke0 (Native Method)
    at sun.reflect.NativeMethodAccessorImpl.invoke (NativeMethodAccessorImpl.java:62)
    at sun.reflect.DelegatingMethodAccessorImpl.invoke (DelegatingMethodAccessorImpl.java:43)
    at java.lang.reflect.Method.invoke (Method.java:498)
    at org.codehaus.plexus.classworlds.launcher.Launcher.launchEnhanced (Launcher.java:289)
    at org.codehaus.plexus.classworlds.launcher.Launcher.launch (Launcher.java:229)
    at jenkins.maven3.agent.Maven35Main.launch (Maven35Main.java:176)
    at sun.reflect.NativeMethodAccessorImpl.invoke0 (Native Method)
    at sun.reflect.NativeMethodAccessorImpl.invoke (NativeMethodAccessorImpl.java:62)
    at sun.reflect.DelegatingMethodAccessorImpl.invoke (DelegatingMethodAccessorImpl.java:43)
    at java.lang.reflect.Method.invoke (Method.java:498)
    at hudson.maven.Maven3Builder.call (Maven3Builder.java:139)
    at hudson.maven.Maven3Builder.call (Maven3Builder.java:70)
    at hudson.remoting.UserRequest.perform (UserRequest.java:207)
    at hudson.remoting.UserRequest.perform (UserRequest.java:53)
    at hudson.remoting.Request$2.run (Request.java:358)
    at hudson.remoting.InterceptingExecutorService$1.call (InterceptingExecutorService.java:72)
    at java.util.concurrent.FutureTask.run (FutureTask.java:266)
    at java.util.concurrent.ThreadPoolExecutor.runWorker (ThreadPoolExecutor.java:1149)
    at java.util.concurrent.ThreadPoolExecutor$Worker.run (ThreadPoolExecutor.java:624)
    at java.lang.Thread.run (Thread.java:748)
Caused by: org.apache.maven.plugin.MojoFailureException: You have 10 Checkstyle violations.
    at org.apache.maven.plugins.checkstyle.CheckstyleViolationCheckMojo.execute (CheckstyleViolationCheckMojo.java:576)
    at org.apache.maven.plugin.DefaultBuildPluginManager.executeMojo (DefaultBuildPluginManager.java:134)
    at org.apache.maven.lifecycle.internal.MojoExecutor.execute (MojoExecutor.java:208)
    at org.apache.maven.lifecycle.internal.MojoExecutor.execute (MojoExecutor.java:154)
    at org.apache.maven.lifecycle.internal.MojoExecutor.execute (MojoExecutor.java:146)
    at org.apache.maven.lifecycle.internal.LifecycleModuleBuilder.buildProject (LifecycleModuleBuilder.java:117)
    at org.apache.maven.lifecycle.internal.LifecycleModuleBuilder.buildProject (LifecycleModuleBuilder.java:81)
    at org.apache.maven.lifecycle.internal.builder.singlethreaded.SingleThreadedBuilder.build
(SingleThreadedBuilder.java:51)
    at org.apache.maven.lifecycle.internal.LifecycleStarter.execute (LifecycleStarter.java:128)
    at org.apache.maven.DefaultMaven.doExecute (DefaultMaven.java:309)
    at org.apache.maven.DefaultMaven.doExecute (DefaultMaven.java:194)
    at org.apache.maven.DefaultMaven.execute (DefaultMaven.java:107)
    at org.jvnet.hudson.maven3.launcher.Maven35Launcher.main (Maven35Launcher.java:130)
    at sun.reflect.NativeMethodAccessorImpl.invoke0 (Native Method)
    at sun.reflect.NativeMethodAccessorImpl.invoke (NativeMethodAccessorImpl.java:62)
    at sun.reflect.DelegatingMethodAccessorImpl.invoke (DelegatingMethodAccessorImpl.java:43)
    at java.lang.reflect.Method.invoke (Method.java:498)
    at org.codehaus.plexus.classworlds.launcher.Launcher.launchEnhanced (Launcher.java:289)
    at org.codehaus.plexus.classworlds.launcher.Launcher.launch (Launcher.java:229)
    at jenkins.maven3.agent.Maven35Main.launch (Maven35Main.java:176)
    at sun.reflect.NativeMethodAccessorImpl.invoke0 (Native Method)
    at sun.reflect.NativeMethodAccessorImpl.invoke (NativeMethodAccessorImpl.java:62)
    at sun.reflect.DelegatingMethodAccessorImpl.invoke (DelegatingMethodAccessorImpl.java:43)
    at java.lang.reflect.Method.invoke (Method.java:498)
    at hudson.maven.Maven3Builder.call (Maven3Builder.java:139)
    at hudson.maven.Maven3Builder.call (Maven3Builder.java:70)
    at hudson.remoting.UserRequest.perform (UserRequest.java:207)
    at hudson.remoting.UserRequest.perform (UserRequest.java:53)
    at hudson.remoting.Request$2.run (Request.java:358)
    at hudson.remoting.InterceptingExecutorService$1.call (InterceptingExecutorService.java:72)
    at java.util.concurrent.FutureTask.run (FutureTask.java:266)
    at java.util.concurrent.ThreadPoolExecutor.runWorker (ThreadPoolExecutor.java:1149)
    at java.util.concurrent.ThreadPoolExecutor$Worker.run (ThreadPoolExecutor.java:624)
    at java.lang.Thread.run (Thread.java:748)
2018-03-18T12:09:44.516 [ERROR] 
2018-03-18T12:09:44.516 [ERROR] Re-run Maven using the -X switch to enable full debug logging.
2018-03-18T12:09:44.516 [ERROR] 
2018-03-18T12:09:44.516 [ERROR] For more information about the errors and possible solutions,
please read the following articles:
2018-03-18T12:09:44.516 [ERROR] [Help 1] http://cwiki.apache.org/confluence/display/MAVEN/MojoFailureException
2018-03-18T12:09:44.516 [ERROR] 
2018-03-18T12:09:44.516 [ERROR] After correcting the problems, you can resume the build with
the command
2018-03-18T12:09:44.516 [ERROR]   mvn <goals> -rf :beam-runners-core-construction-java
channel stopped
Not sending mail to unregistered user herohde@google.com

Mime
View raw message