beam-commits mailing list archives

Site index · List index
Message view « Date » · « Thread »
Top « Date » · « Thread »
From Apache Jenkins Server <jenk...@builds.apache.org>
Subject Build failed in Jenkins: beam_PostCommit_Java_ValidatesRunner_Dataflow #5169
Date Sat, 17 Mar 2018 12:08:32 GMT
See <https://builds.apache.org/job/beam_PostCommit_Java_ValidatesRunner_Dataflow/5169/display/redirect>

------------------------------------------
[...truncated 1.61 MB...]
2018-03-17T12:07:46.463 [INFO] Dependency-reduced POM written at: <https://builds.apache.org/job/beam_PostCommit_Java_ValidatesRunner_Dataflow/ws/src/sdks/java/extensions/google-cloud-platform-core/dependency-reduced-pom.xml>
2018-03-17T12:07:46.693 [INFO] 
2018-03-17T12:07:46.694 [INFO] --- maven-dependency-plugin:3.0.2:analyze-only (default) @
beam-sdks-java-extensions-google-cloud-platform-core ---
2018-03-17T12:07:46.747 [INFO] No dependency problems found
[JENKINS] Archiving disabled
2018-03-17T12:07:48.797 [INFO] 
2018-03-17T12:07:48.797 [INFO] ------------------------------------------------------------------------
2018-03-17T12:07:48.797 [INFO] Building Apache Beam :: Runners 2.5.0-SNAPSHOT
2018-03-17T12:07:48.797 [INFO] ------------------------------------------------------------------------
2018-03-17T12:07:48.800 [INFO] 
2018-03-17T12:07:48.800 [INFO] --- maven-clean-plugin:3.0.0:clean (default-clean) @ beam-runners-parent
---
2018-03-17T12:07:48.802 [INFO] Deleting <https://builds.apache.org/job/beam_PostCommit_Java_ValidatesRunner_Dataflow/ws/src/runners>
(includes = [**/*.pyc, **/*.egg-info/, **/sdks/python/LICENSE, **/sdks/python/NOTICE, **/sdks/python/README.md,
**/sdks/python/apache_beam/portability/api/*pb2*.*, **/sdks/python/apache_beam/portability/common_urns.py,
**/sdks/python/**/*.c, **/sdks/python/**/*.so, **/sdks/python/**/*.egg], excludes = [])
2018-03-17T12:07:48.939 [INFO] 
2018-03-17T12:07:48.939 [INFO] --- maven-enforcer-plugin:3.0.0-M1:enforce (enforce-maven-version)
@ beam-runners-parent ---
2018-03-17T12:07:49.047 [INFO] 
2018-03-17T12:07:49.047 [INFO] --- maven-enforcer-plugin:3.0.0-M1:enforce (enforce) @ beam-runners-parent
---
2018-03-17T12:07:49.049 [INFO] Adding ignore: module-info
2018-03-17T12:07:49.156 [INFO] 
2018-03-17T12:07:49.156 [INFO] --- maven-enforcer-plugin:3.0.0-M1:enforce (enforce-banned-dependencies)
@ beam-runners-parent ---
2018-03-17T12:07:49.265 [INFO] 
2018-03-17T12:07:49.266 [INFO] --- maven-remote-resources-plugin:1.5:process (process-resource-bundles)
@ beam-runners-parent ---
2018-03-17T12:07:49.382 [INFO] 
2018-03-17T12:07:49.382 [INFO] --- maven-checkstyle-plugin:3.0.0:check (default) @ beam-runners-parent
---
2018-03-17T12:07:49.487 [INFO] Starting audit...
Audit done.
2018-03-17T12:07:49.595 [INFO] 
2018-03-17T12:07:49.595 [INFO] --- build-helper-maven-plugin:3.0.0:regex-properties (render-artifact-id)
@ beam-runners-parent ---
2018-03-17T12:07:49.703 [INFO] 
2018-03-17T12:07:49.703 [INFO] --- maven-site-plugin:3.7:attach-descriptor (attach-descriptor)
@ beam-runners-parent ---
2018-03-17T12:07:49.705 [INFO] No site descriptor found: nothing to attach.
2018-03-17T12:07:49.918 [INFO] 
2018-03-17T12:07:49.918 [INFO] --- maven-jar-plugin:3.0.2:jar (default-jar) @ beam-runners-parent
---
2018-03-17T12:07:49.920 [INFO] Skipping packaging of the jar
2018-03-17T12:07:50.134 [INFO] 
2018-03-17T12:07:50.134 [INFO] --- maven-jar-plugin:3.0.2:test-jar (default-test-jar) @ beam-runners-parent
---
2018-03-17T12:07:50.135 [INFO] Skipping packaging of the test-jar
2018-03-17T12:07:50.242 [INFO] 
2018-03-17T12:07:50.242 [INFO] --- maven-shade-plugin:3.1.0:shade (bundle-and-repackage) @
beam-runners-parent ---
2018-03-17T12:07:50.245 [INFO] Replacing original artifact with shaded artifact.
2018-03-17T12:07:50.352 [INFO] 
2018-03-17T12:07:50.352 [INFO] --- maven-dependency-plugin:3.0.2:analyze-only (default) @
beam-runners-parent ---
2018-03-17T12:07:50.355 [INFO] Skipping pom project
[JENKINS] Archiving disabled
2018-03-17T12:07:51.548 [INFO] 
2018-03-17T12:07:51.548 [INFO] ------------------------------------------------------------------------
2018-03-17T12:07:51.548 [INFO] Building Apache Beam :: Runners :: Core Construction Java 2.5.0-SNAPSHOT
2018-03-17T12:07:51.548 [INFO] ------------------------------------------------------------------------
2018-03-17T12:07:51.556 [INFO] 
2018-03-17T12:07:51.556 [INFO] --- maven-clean-plugin:3.0.0:clean (default-clean) @ beam-runners-core-construction-java
---
2018-03-17T12:07:51.558 [INFO] Deleting <https://builds.apache.org/job/beam_PostCommit_Java_ValidatesRunner_Dataflow/ws/src/runners/core-construction-java>
(includes = [**/*.pyc, **/*.egg-info/, **/sdks/python/LICENSE, **/sdks/python/NOTICE, **/sdks/python/README.md,
**/sdks/python/apache_beam/portability/api/*pb2*.*, **/sdks/python/apache_beam/portability/common_urns.py,
**/sdks/python/**/*.c, **/sdks/python/**/*.so, **/sdks/python/**/*.egg], excludes = [])
2018-03-17T12:07:51.667 [INFO] 
2018-03-17T12:07:51.667 [INFO] --- maven-enforcer-plugin:3.0.0-M1:enforce (enforce-maven-version)
@ beam-runners-core-construction-java ---
2018-03-17T12:07:51.906 [INFO] 
2018-03-17T12:07:51.907 [INFO] --- maven-enforcer-plugin:3.0.0-M1:enforce (enforce) @ beam-runners-core-construction-java
---
2018-03-17T12:07:51.943 [INFO] Adding ignore: module-info
2018-03-17T12:07:52.316 [INFO] 
2018-03-17T12:07:52.316 [INFO] --- maven-enforcer-plugin:3.0.0-M1:enforce (enforce-banned-dependencies)
@ beam-runners-core-construction-java ---
2018-03-17T12:07:52.430 [INFO] 
2018-03-17T12:07:52.430 [INFO] --- maven-remote-resources-plugin:1.5:process (process-resource-bundles)
@ beam-runners-core-construction-java ---
2018-03-17T12:07:52.726 [INFO] 
2018-03-17T12:07:52.726 [INFO] --- maven-resources-plugin:3.0.2:resources (default-resources)
@ beam-runners-core-construction-java ---
2018-03-17T12:07:52.727 [INFO] Using 'UTF-8' encoding to copy filtered resources.
2018-03-17T12:07:52.727 [INFO] skip non existing resourceDirectory <https://builds.apache.org/job/beam_PostCommit_Java_ValidatesRunner_Dataflow/ws/src/runners/core-construction-java/src/main/resources>
2018-03-17T12:07:52.727 [INFO] Copying 3 resources
2018-03-17T12:07:52.834 [INFO] 
2018-03-17T12:07:52.835 [INFO] --- maven-compiler-plugin:3.7.0:compile (default-compile) @
beam-runners-core-construction-java ---
2018-03-17T12:07:52.847 [INFO] Changes detected - recompiling the module!
2018-03-17T12:07:52.848 [INFO] Compiling 60 source files to <https://builds.apache.org/job/beam_PostCommit_Java_ValidatesRunner_Dataflow/ws/src/runners/core-construction-java/target/classes>
2018-03-17T12:07:54.142 [INFO] <https://builds.apache.org/job/beam_PostCommit_Java_ValidatesRunner_Dataflow/ws/src/runners/core-construction-java/src/main/java/org/apache/beam/runners/core/construction/TriggerTranslation.java>:
Some input files use or override a deprecated API.
2018-03-17T12:07:54.142 [INFO] <https://builds.apache.org/job/beam_PostCommit_Java_ValidatesRunner_Dataflow/ws/src/runners/core-construction-java/src/main/java/org/apache/beam/runners/core/construction/TriggerTranslation.java>:
Recompile with -Xlint:deprecation for details.
2018-03-17T12:07:54.142 [INFO] <https://builds.apache.org/job/beam_PostCommit_Java_ValidatesRunner_Dataflow/ws/src/runners/core-construction-java/src/main/java/org/apache/beam/runners/core/construction/PTransformTranslation.java>:
Some input files use unchecked or unsafe operations.
2018-03-17T12:07:54.142 [INFO] <https://builds.apache.org/job/beam_PostCommit_Java_ValidatesRunner_Dataflow/ws/src/runners/core-construction-java/src/main/java/org/apache/beam/runners/core/construction/PTransformTranslation.java>:
Recompile with -Xlint:unchecked for details.
2018-03-17T12:07:54.249 [INFO] 
2018-03-17T12:07:54.249 [INFO] --- maven-resources-plugin:3.0.2:testResources (default-testResources)
@ beam-runners-core-construction-java ---
2018-03-17T12:07:54.251 [INFO] Using 'UTF-8' encoding to copy filtered resources.
2018-03-17T12:07:54.251 [INFO] skip non existing resourceDirectory <https://builds.apache.org/job/beam_PostCommit_Java_ValidatesRunner_Dataflow/ws/src/runners/core-construction-java/src/test/resources>
2018-03-17T12:07:54.251 [INFO] Copying 3 resources
2018-03-17T12:07:54.359 [INFO] 
2018-03-17T12:07:54.359 [INFO] --- maven-compiler-plugin:3.7.0:testCompile (default-testCompile)
@ beam-runners-core-construction-java ---
2018-03-17T12:07:54.373 [INFO] Changes detected - recompiling the module!
2018-03-17T12:07:54.373 [INFO] Compiling 44 source files to <https://builds.apache.org/job/beam_PostCommit_Java_ValidatesRunner_Dataflow/ws/src/runners/core-construction-java/target/test-classes>
2018-03-17T12:07:56.123 [INFO] <https://builds.apache.org/job/beam_PostCommit_Java_ValidatesRunner_Dataflow/ws/src/runners/core-construction-java/src/test/java/org/apache/beam/runners/core/construction/PTransformTranslationTest.java>:
Some input files use or override a deprecated API.
2018-03-17T12:07:56.124 [INFO] <https://builds.apache.org/job/beam_PostCommit_Java_ValidatesRunner_Dataflow/ws/src/runners/core-construction-java/src/test/java/org/apache/beam/runners/core/construction/PTransformTranslationTest.java>:
Recompile with -Xlint:deprecation for details.
2018-03-17T12:07:56.124 [INFO] <https://builds.apache.org/job/beam_PostCommit_Java_ValidatesRunner_Dataflow/ws/src/runners/core-construction-java/src/test/java/org/apache/beam/runners/core/construction/ParDoTranslationTest.java>:
Some input files use unchecked or unsafe operations.
2018-03-17T12:07:56.124 [INFO] <https://builds.apache.org/job/beam_PostCommit_Java_ValidatesRunner_Dataflow/ws/src/runners/core-construction-java/src/test/java/org/apache/beam/runners/core/construction/ParDoTranslationTest.java>:
Recompile with -Xlint:unchecked for details.
2018-03-17T12:07:56.230 [INFO] 
2018-03-17T12:07:56.230 [INFO] --- maven-checkstyle-plugin:3.0.0:check (default) @ beam-runners-core-construction-java
---
2018-03-17T12:07:57.603 [INFO] Starting audit...
[ERROR] <https://builds.apache.org/job/beam_PostCommit_Java_ValidatesRunner_Dataflow/ws/src/runners/core-construction-java/src/main/java/org/apache/beam/runners/core/construction/graph/Networks.java>:77:18:
Name 'N' must match pattern '^(((T|K|V|W|X)[0-9]*)|([A-Z][a-z][a-zA-Z]*T))$'. [MethodTypeParameterName]
[ERROR] <https://builds.apache.org/job/beam_PostCommit_Java_ValidatesRunner_Dataflow/ws/src/runners/core-construction-java/src/main/java/org/apache/beam/runners/core/construction/graph/Networks.java>:77:21:
Name 'E' must match pattern '^(((T|K|V|W|X)[0-9]*)|([A-Z][a-z][a-zA-Z]*T))$'. [MethodTypeParameterName]
[ERROR] <https://builds.apache.org/job/beam_PostCommit_Java_ValidatesRunner_Dataflow/ws/src/runners/core-construction-java/src/main/java/org/apache/beam/runners/core/construction/graph/Networks.java>:128:18:
Name 'N' must match pattern '^(((T|K|V|W|X)[0-9]*)|([A-Z][a-z][a-zA-Z]*T))$'. [MethodTypeParameterName]
[ERROR] <https://builds.apache.org/job/beam_PostCommit_Java_ValidatesRunner_Dataflow/ws/src/runners/core-construction-java/src/main/java/org/apache/beam/runners/core/construction/graph/Networks.java>:128:21:
Name 'E' must match pattern '^(((T|K|V|W|X)[0-9]*)|([A-Z][a-z][a-zA-Z]*T))$'. [MethodTypeParameterName]
[ERROR] <https://builds.apache.org/job/beam_PostCommit_Java_ValidatesRunner_Dataflow/ws/src/runners/core-construction-java/src/main/java/org/apache/beam/runners/core/construction/graph/Networks.java>:147:18:
Name 'N' must match pattern '^(((T|K|V|W|X)[0-9]*)|([A-Z][a-z][a-zA-Z]*T))$'. [MethodTypeParameterName]
[ERROR] <https://builds.apache.org/job/beam_PostCommit_Java_ValidatesRunner_Dataflow/ws/src/runners/core-construction-java/src/main/java/org/apache/beam/runners/core/construction/graph/Networks.java>:147:21:
Name 'E' must match pattern '^(((T|K|V|W|X)[0-9]*)|([A-Z][a-z][a-zA-Z]*T))$'. [MethodTypeParameterName]
[ERROR] <https://builds.apache.org/job/beam_PostCommit_Java_ValidatesRunner_Dataflow/ws/src/runners/core-construction-java/src/main/java/org/apache/beam/runners/core/construction/graph/Networks.java>:182:18:
Name 'N' must match pattern '^(((T|K|V|W|X)[0-9]*)|([A-Z][a-z][a-zA-Z]*T))$'. [MethodTypeParameterName]
[ERROR] <https://builds.apache.org/job/beam_PostCommit_Java_ValidatesRunner_Dataflow/ws/src/runners/core-construction-java/src/main/java/org/apache/beam/runners/core/construction/graph/Networks.java>:182:21:
Name 'E' must match pattern '^(((T|K|V|W|X)[0-9]*)|([A-Z][a-z][a-zA-Z]*T))$'. [MethodTypeParameterName]
[ERROR] <https://builds.apache.org/job/beam_PostCommit_Java_ValidatesRunner_Dataflow/ws/src/runners/core-construction-java/src/main/java/org/apache/beam/runners/core/construction/graph/Networks.java>:219:18:
Name 'N' must match pattern '^(((T|K|V|W|X)[0-9]*)|([A-Z][a-z][a-zA-Z]*T))$'. [MethodTypeParameterName]
[ERROR] <https://builds.apache.org/job/beam_PostCommit_Java_ValidatesRunner_Dataflow/ws/src/runners/core-construction-java/src/main/java/org/apache/beam/runners/core/construction/graph/Networks.java>:219:21:
Name 'E' must match pattern '^(((T|K|V|W|X)[0-9]*)|([A-Z][a-z][a-zA-Z]*T))$'. [MethodTypeParameterName]
Audit done.
2018-03-17T12:07:57.603 [INFO] There are 10 errors reported by Checkstyle 8.7 with beam/checkstyle.xml
ruleset.
2018-03-17T12:07:57.605 [ERROR] src/main/java/org/apache/beam/runners/core/construction/graph/Networks.java:[77,18]
(naming) MethodTypeParameterName: Name 'N' must match pattern '^(((T|K|V|W|X)[0-9]*)|([A-Z][a-z][a-zA-Z]*T))$'.
2018-03-17T12:07:57.605 [ERROR] src/main/java/org/apache/beam/runners/core/construction/graph/Networks.java:[77,21]
(naming) MethodTypeParameterName: Name 'E' must match pattern '^(((T|K|V|W|X)[0-9]*)|([A-Z][a-z][a-zA-Z]*T))$'.
2018-03-17T12:07:57.605 [ERROR] src/main/java/org/apache/beam/runners/core/construction/graph/Networks.java:[128,18]
(naming) MethodTypeParameterName: Name 'N' must match pattern '^(((T|K|V|W|X)[0-9]*)|([A-Z][a-z][a-zA-Z]*T))$'.
2018-03-17T12:07:57.605 [ERROR] src/main/java/org/apache/beam/runners/core/construction/graph/Networks.java:[128,21]
(naming) MethodTypeParameterName: Name 'E' must match pattern '^(((T|K|V|W|X)[0-9]*)|([A-Z][a-z][a-zA-Z]*T))$'.
2018-03-17T12:07:57.605 [ERROR] src/main/java/org/apache/beam/runners/core/construction/graph/Networks.java:[147,18]
(naming) MethodTypeParameterName: Name 'N' must match pattern '^(((T|K|V|W|X)[0-9]*)|([A-Z][a-z][a-zA-Z]*T))$'.
2018-03-17T12:07:57.605 [ERROR] src/main/java/org/apache/beam/runners/core/construction/graph/Networks.java:[147,21]
(naming) MethodTypeParameterName: Name 'E' must match pattern '^(((T|K|V|W|X)[0-9]*)|([A-Z][a-z][a-zA-Z]*T))$'.
2018-03-17T12:07:57.605 [ERROR] src/main/java/org/apache/beam/runners/core/construction/graph/Networks.java:[182,18]
(naming) MethodTypeParameterName: Name 'N' must match pattern '^(((T|K|V|W|X)[0-9]*)|([A-Z][a-z][a-zA-Z]*T))$'.
2018-03-17T12:07:57.605 [ERROR] src/main/java/org/apache/beam/runners/core/construction/graph/Networks.java:[182,21]
(naming) MethodTypeParameterName: Name 'E' must match pattern '^(((T|K|V|W|X)[0-9]*)|([A-Z][a-z][a-zA-Z]*T))$'.
2018-03-17T12:07:57.605 [ERROR] src/main/java/org/apache/beam/runners/core/construction/graph/Networks.java:[219,18]
(naming) MethodTypeParameterName: Name 'N' must match pattern '^(((T|K|V|W|X)[0-9]*)|([A-Z][a-z][a-zA-Z]*T))$'.
2018-03-17T12:07:57.605 [ERROR] src/main/java/org/apache/beam/runners/core/construction/graph/Networks.java:[219,21]
(naming) MethodTypeParameterName: Name 'E' must match pattern '^(((T|K|V|W|X)[0-9]*)|([A-Z][a-z][a-zA-Z]*T))$'.
[JENKINS] Archiving disabled
[JENKINS] Archiving disabled
[JENKINS] Archiving disabled
[JENKINS] Archiving disabled
[JENKINS] Archiving disabled
[JENKINS] Archiving disabled
[JENKINS] Archiving disabled
[JENKINS] Archiving disabled
[JENKINS] Archiving disabled
[JENKINS] Archiving disabled
[JENKINS] Archiving disabled
[JENKINS] Archiving disabled
[JENKINS] Archiving disabled
[JENKINS] Archiving disabled
[JENKINS] Archiving disabled
[JENKINS] Archiving disabled
[JENKINS] Archiving disabled
[JENKINS] Archiving disabled
[JENKINS] Archiving disabled
[JENKINS] Archiving disabled
[JENKINS] Archiving disabled
2018-03-17T12:08:09.038 [INFO] ------------------------------------------------------------------------
2018-03-17T12:08:09.038 [INFO] Reactor Summary:
2018-03-17T12:08:09.038 [INFO] 
2018-03-17T12:08:09.038 [INFO] Apache Beam :: Parent .............................. SUCCESS
[  9.644 s]
2018-03-17T12:08:09.039 [INFO] Apache Beam :: SDKs :: Java :: Build Tools ......... SUCCESS
[  7.309 s]
2018-03-17T12:08:09.039 [INFO] Apache Beam :: Model ............................... SUCCESS
[  1.752 s]
2018-03-17T12:08:09.039 [INFO] Apache Beam :: Model :: Pipeline ................... SUCCESS
[ 22.433 s]
2018-03-17T12:08:09.039 [INFO] Apache Beam :: Model :: Job Management ............. SUCCESS
[  7.369 s]
2018-03-17T12:08:09.039 [INFO] Apache Beam :: Model :: Fn Execution ............... SUCCESS
[ 13.869 s]
2018-03-17T12:08:09.039 [INFO] Apache Beam :: SDKs ................................ SUCCESS
[  2.105 s]
2018-03-17T12:08:09.039 [INFO] Apache Beam :: SDKs :: Java ........................ SUCCESS
[  2.481 s]
2018-03-17T12:08:09.039 [INFO] Apache Beam :: SDKs :: Java :: Core ................ SUCCESS
[02:29 min]
2018-03-17T12:08:09.039 [INFO] Apache Beam :: SDKs :: Java :: Extensions .......... SUCCESS
[  2.674 s]
2018-03-17T12:08:09.039 [INFO] Apache Beam :: SDKs :: Java :: Extensions :: Google Cloud Platform
Core SUCCESS [ 12.007 s]
2018-03-17T12:08:09.039 [INFO] Apache Beam :: Runners ............................. SUCCESS
[  2.066 s]
2018-03-17T12:08:09.039 [INFO] Apache Beam :: Runners :: Core Construction Java ... FAILURE
[  6.560 s]
2018-03-17T12:08:09.039 [INFO] Apache Beam :: Runners :: Core Java ................ SKIPPED
2018-03-17T12:08:09.039 [INFO] Apache Beam :: SDKs :: Java :: IO .................. SKIPPED
2018-03-17T12:08:09.039 [INFO] Apache Beam :: Runners :: Local Java Core .......... SKIPPED
2018-03-17T12:08:09.039 [INFO] Apache Beam :: Runners :: Direct Java .............. SKIPPED
2018-03-17T12:08:09.039 [INFO] Apache Beam :: SDKs :: Java :: Extensions :: Protobuf SKIPPED
2018-03-17T12:08:09.039 [INFO] Apache Beam :: SDKs :: Java :: IO :: Google Cloud Platform
SKIPPED
2018-03-17T12:08:09.039 [INFO] Apache Beam :: Runners :: Google Cloud Dataflow .... SKIPPED
2018-03-17T12:08:09.039 [INFO] ------------------------------------------------------------------------
2018-03-17T12:08:09.039 [INFO] BUILD FAILURE
2018-03-17T12:08:09.039 [INFO] ------------------------------------------------------------------------
2018-03-17T12:08:09.039 [INFO] Total time: 05:21 min
2018-03-17T12:08:09.039 [INFO] Finished at: 2018-03-17T12:08:09Z
2018-03-17T12:08:09.717 [INFO] Final Memory: 140M/1396M
2018-03-17T12:08:09.718 [INFO] ------------------------------------------------------------------------
Waiting for Jenkins to finish collecting data2018-03-17T12:08:10.126 [ERROR] Failed to execute
goal org.apache.maven.plugins:maven-checkstyle-plugin:3.0.0:check (default) on project beam-runners-core-construction-java:
You have 10 Checkstyle violations. -> [Help 1]
org.apache.maven.lifecycle.LifecycleExecutionException: Failed to execute goal org.apache.maven.plugins:maven-checkstyle-plugin:3.0.0:check
(default) on project beam-runners-core-construction-java: You have 10 Checkstyle violations.
    at org.apache.maven.lifecycle.internal.MojoExecutor.execute (MojoExecutor.java:213)
    at org.apache.maven.lifecycle.internal.MojoExecutor.execute (MojoExecutor.java:154)
    at org.apache.maven.lifecycle.internal.MojoExecutor.execute (MojoExecutor.java:146)
    at org.apache.maven.lifecycle.internal.LifecycleModuleBuilder.buildProject (LifecycleModuleBuilder.java:117)
    at org.apache.maven.lifecycle.internal.LifecycleModuleBuilder.buildProject (LifecycleModuleBuilder.java:81)
    at org.apache.maven.lifecycle.internal.builder.singlethreaded.SingleThreadedBuilder.build
(SingleThreadedBuilder.java:51)
    at org.apache.maven.lifecycle.internal.LifecycleStarter.execute (LifecycleStarter.java:128)
    at org.apache.maven.DefaultMaven.doExecute (DefaultMaven.java:309)
    at org.apache.maven.DefaultMaven.doExecute (DefaultMaven.java:194)
    at org.apache.maven.DefaultMaven.execute (DefaultMaven.java:107)
    at org.jvnet.hudson.maven3.launcher.Maven35Launcher.main (Maven35Launcher.java:130)
    at sun.reflect.NativeMethodAccessorImpl.invoke0 (Native Method)
    at sun.reflect.NativeMethodAccessorImpl.invoke (NativeMethodAccessorImpl.java:62)
    at sun.reflect.DelegatingMethodAccessorImpl.invoke (DelegatingMethodAccessorImpl.java:43)
    at java.lang.reflect.Method.invoke (Method.java:498)
    at org.codehaus.plexus.classworlds.launcher.Launcher.launchEnhanced (Launcher.java:289)
    at org.codehaus.plexus.classworlds.launcher.Launcher.launch (Launcher.java:229)
    at jenkins.maven3.agent.Maven35Main.launch (Maven35Main.java:176)
    at sun.reflect.NativeMethodAccessorImpl.invoke0 (Native Method)
    at sun.reflect.NativeMethodAccessorImpl.invoke (NativeMethodAccessorImpl.java:62)
    at sun.reflect.DelegatingMethodAccessorImpl.invoke (DelegatingMethodAccessorImpl.java:43)
    at java.lang.reflect.Method.invoke (Method.java:498)
    at hudson.maven.Maven3Builder.call (Maven3Builder.java:139)
    at hudson.maven.Maven3Builder.call (Maven3Builder.java:70)
    at hudson.remoting.UserRequest.perform (UserRequest.java:207)
    at hudson.remoting.UserRequest.perform (UserRequest.java:53)
    at hudson.remoting.Request$2.run (Request.java:358)
    at hudson.remoting.InterceptingExecutorService$1.call (InterceptingExecutorService.java:72)
    at java.util.concurrent.FutureTask.run (FutureTask.java:266)
    at java.util.concurrent.ThreadPoolExecutor.runWorker (ThreadPoolExecutor.java:1149)
    at java.util.concurrent.ThreadPoolExecutor$Worker.run (ThreadPoolExecutor.java:624)
    at java.lang.Thread.run (Thread.java:748)
Caused by: org.apache.maven.plugin.MojoFailureException: You have 10 Checkstyle violations.
    at org.apache.maven.plugins.checkstyle.CheckstyleViolationCheckMojo.execute (CheckstyleViolationCheckMojo.java:576)
    at org.apache.maven.plugin.DefaultBuildPluginManager.executeMojo (DefaultBuildPluginManager.java:134)
    at org.apache.maven.lifecycle.internal.MojoExecutor.execute (MojoExecutor.java:208)
    at org.apache.maven.lifecycle.internal.MojoExecutor.execute (MojoExecutor.java:154)
    at org.apache.maven.lifecycle.internal.MojoExecutor.execute (MojoExecutor.java:146)
    at org.apache.maven.lifecycle.internal.LifecycleModuleBuilder.buildProject (LifecycleModuleBuilder.java:117)
    at org.apache.maven.lifecycle.internal.LifecycleModuleBuilder.buildProject (LifecycleModuleBuilder.java:81)
    at org.apache.maven.lifecycle.internal.builder.singlethreaded.SingleThreadedBuilder.build
(SingleThreadedBuilder.java:51)
    at org.apache.maven.lifecycle.internal.LifecycleStarter.execute (LifecycleStarter.java:128)
    at org.apache.maven.DefaultMaven.doExecute (DefaultMaven.java:309)
    at org.apache.maven.DefaultMaven.doExecute (DefaultMaven.java:194)
    at org.apache.maven.DefaultMaven.execute (DefaultMaven.java:107)
    at org.jvnet.hudson.maven3.launcher.Maven35Launcher.main (Maven35Launcher.java:130)
    at sun.reflect.NativeMethodAccessorImpl.invoke0 (Native Method)
    at sun.reflect.NativeMethodAccessorImpl.invoke (NativeMethodAccessorImpl.java:62)
    at sun.reflect.DelegatingMethodAccessorImpl.invoke (DelegatingMethodAccessorImpl.java:43)
    at java.lang.reflect.Method.invoke (Method.java:498)
    at org.codehaus.plexus.classworlds.launcher.Launcher.launchEnhanced (Launcher.java:289)
    at org.codehaus.plexus.classworlds.launcher.Launcher.launch (Launcher.java:229)
    at jenkins.maven3.agent.Maven35Main.launch (Maven35Main.java:176)
    at sun.reflect.NativeMethodAccessorImpl.invoke0 (Native Method)
    at sun.reflect.NativeMethodAccessorImpl.invoke (NativeMethodAccessorImpl.java:62)
    at sun.reflect.DelegatingMethodAccessorImpl.invoke (DelegatingMethodAccessorImpl.java:43)
    at java.lang.reflect.Method.invoke (Method.java:498)
    at hudson.maven.Maven3Builder.call (Maven3Builder.java:139)
    at hudson.maven.Maven3Builder.call (Maven3Builder.java:70)
    at hudson.remoting.UserRequest.perform (UserRequest.java:207)
    at hudson.remoting.UserRequest.perform (UserRequest.java:53)
    at hudson.remoting.Request$2.run (Request.java:358)
    at hudson.remoting.InterceptingExecutorService$1.call (InterceptingExecutorService.java:72)
    at java.util.concurrent.FutureTask.run (FutureTask.java:266)
    at java.util.concurrent.ThreadPoolExecutor.runWorker (ThreadPoolExecutor.java:1149)
    at java.util.concurrent.ThreadPoolExecutor$Worker.run (ThreadPoolExecutor.java:624)
    at java.lang.Thread.run (Thread.java:748)
2018-03-17T12:08:10.128 [ERROR] 
2018-03-17T12:08:10.128 [ERROR] Re-run Maven using the -X switch to enable full debug logging.
2018-03-17T12:08:10.128 [ERROR] 
2018-03-17T12:08:10.128 [ERROR] For more information about the errors and possible solutions,
please read the following articles:
2018-03-17T12:08:10.128 [ERROR] [Help 1] http://cwiki.apache.org/confluence/display/MAVEN/MojoFailureException
2018-03-17T12:08:10.128 [ERROR] 
2018-03-17T12:08:10.128 [ERROR] After correcting the problems, you can resume the build with
the command
2018-03-17T12:08:10.128 [ERROR]   mvn <goals> -rf :beam-runners-core-construction-java

channel stopped
Not sending mail to unregistered user aaltay@gmail.com
Not sending mail to unregistered user ekirpichov@gmail.com
Not sending mail to unregistered user lukasz.gajowy@polidea.com
Not sending mail to unregistered user ankurgoenka@gmail.com
Not sending mail to unregistered user markliu@google.com
Not sending mail to unregistered user herohde@google.com
Not sending mail to unregistered user XuMingmin@users.noreply.github.com
Not sending mail to unregistered user sidhom@google.com
Not sending mail to unregistered user rober@frantil.com

Mime
View raw message