beam-commits mailing list archives

Site index · List index
Message view « Date » · « Thread »
Top « Date » · « Thread »
From Apache Jenkins Server <jenk...@builds.apache.org>
Subject Build failed in Jenkins: beam_PerformanceTests_TFRecordIOIT #303
Date Wed, 28 Mar 2018 06:21:09 GMT
See <https://builds.apache.org/job/beam_PerformanceTests_TFRecordIOIT/303/display/redirect?page=changes>

Changes:

[herohde] Migrate container instructions and builds to Gradle

[rober] Go SDK usercounters

[herohde] CR: added comments to container helper function

[herohde] CR: make containerImageName take named parameters

[ccy] Revert #4781 which broke Python postsubmits

------------------------------------------
[...truncated 17.07 KB...]
Requirement already satisfied: google-auth-httplib2 in /home/jenkins/.local/lib/python2.7/site-packages
(from google-cloud-core<0.26dev,>=0.25.0->google-cloud-pubsub==0.26.0->apache-beam==2.5.0.dev0)
Requirement already satisfied: google-gax<0.16dev,>=0.15.7 in /home/jenkins/.local/lib/python2.7/site-packages
(from gapic-google-cloud-pubsub-v1<0.16dev,>=0.15.0->google-cloud-pubsub==0.26.0->apache-beam==2.5.0.dev0)
Requirement already satisfied: grpc-google-iam-v1<0.12dev,>=0.11.1 in /home/jenkins/.local/lib/python2.7/site-packages
(from gapic-google-cloud-pubsub-v1<0.16dev,>=0.15.0->google-cloud-pubsub==0.26.0->apache-beam==2.5.0.dev0)
Requirement already satisfied: cachetools>=2.0.0 in /home/jenkins/.local/lib/python2.7/site-packages
(from google-auth<2.0.0dev,>=0.4.0->google-cloud-core<0.26dev,>=0.25.0->google-cloud-pubsub==0.26.0->apache-beam==2.5.0.dev0)
Requirement already satisfied: future<0.17dev,>=0.16.0 in /home/jenkins/.local/lib/python2.7/site-packages
(from google-gax<0.16dev,>=0.15.7->gapic-google-cloud-pubsub-v1<0.16dev,>=0.15.0->google-cloud-pubsub==0.26.0->apache-beam==2.5.0.dev0)
Requirement already satisfied: ply==3.8 in /home/jenkins/.local/lib/python2.7/site-packages
(from google-gax<0.16dev,>=0.15.7->gapic-google-cloud-pubsub-v1<0.16dev,>=0.15.0->google-cloud-pubsub==0.26.0->apache-beam==2.5.0.dev0)
Installing collected packages: grpcio, hdfs, pytz, nose, apache-beam
  Found existing installation: grpcio 1.3.5
    Not uninstalling grpcio at /home/jenkins/.local/lib/python2.7/site-packages, outside environment
<https://builds.apache.org/job/beam_PerformanceTests_TFRecordIOIT/ws/.env>
  Running setup.py develop for apache-beam
Successfully installed apache-beam grpcio-1.10.0 hdfs-2.1.0 nose-1.3.7 pytz-2018.3
[beam_PerformanceTests_TFRecordIOIT] $ /bin/bash -xe /tmp/jenkins7650524260516101758.sh
+ .env/bin/python PerfKitBenchmarker/pkb.py --project=apache-beam-testing --dpb_log_level=INFO
--maven_binary=/home/jenkins/tools/maven/latest/bin/mvn --bigquery_table=beam_performance.tfrecordioit_pkb_results
--temp_dir=<https://builds.apache.org/job/beam_PerformanceTests_TFRecordIOIT/ws/> --official=true
--benchmarks=beam_integration_benchmark --beam_it_timeout=1200 --beam_it_profile=io-it --beam_prebuilt=true
--beam_sdk=java --beam_it_module=sdks/java/io/file-based-io-tests --beam_it_class=org.apache.beam.sdk.io.tfrecord.TFRecordIOIT
'--beam_it_options=[--project=apache-beam-testing,--tempRoot=gs://temp-storage-for-perf-tests,--filenamePrefix=gs://temp-storage-for-perf-tests/beam_PerformanceTests_TFRecordIOIT/303/,--numberOfRecords=1000000]'
'--beam_extra_mvn_properties=[filesystem=gcs]'
2018-03-28 06:00:59,234 115cb049 MainThread INFO     Verbose logging to: <https://builds.apache.org/job/beam_PerformanceTests_TFRecordIOIT/ws/runs/115cb049/pkb.log>
2018-03-28 06:00:59,234 115cb049 MainThread INFO     PerfKitBenchmarker version: v1.12.0-446-gfa9cdd1
2018-03-28 06:00:59,235 115cb049 MainThread INFO     Flag values:
--beam_extra_mvn_properties=[filesystem=gcs]
--beam_it_class=org.apache.beam.sdk.io.tfrecord.TFRecordIOIT
--beam_it_timeout=1200
--beam_sdk=java
--temp_dir=<https://builds.apache.org/job/beam_PerformanceTests_TFRecordIOIT/ws/>
--maven_binary=/home/jenkins/tools/maven/latest/bin/mvn
--beam_it_options=[--project=apache-beam-testing,--tempRoot=gs://temp-storage-for-perf-tests,--filenamePrefix=gs://temp-storage-for-perf-tests/beam_PerformanceTests_TFRecordIOIT/303/,--numberOfRecords=1000000]
--beam_prebuilt
--project=apache-beam-testing
--bigquery_table=beam_performance.tfrecordioit_pkb_results
--official
--beam_it_module=sdks/java/io/file-based-io-tests
--dpb_log_level=INFO
--beam_it_profile=io-it
--benchmarks=beam_integration_benchmark
2018-03-28 06:00:59,503 115cb049 MainThread WARNING  The key "flags" was not in the default
config, but was in user overrides. This may indicate a typo.
2018-03-28 06:00:59,503 115cb049 MainThread INFO     Initializing the edw service decoder
2018-03-28 06:00:59,623 115cb049 MainThread beam_integration_benchmark(1/1) INFO     Provisioning
resources for benchmark beam_integration_benchmark
2018-03-28 06:00:59,626 115cb049 MainThread beam_integration_benchmark(1/1) INFO     Preparing
benchmark beam_integration_benchmark
2018-03-28 06:00:59,626 115cb049 MainThread beam_integration_benchmark(1/1) INFO     Running:
git clone https://github.com/apache/beam.git
2018-03-28 06:01:08,599 115cb049 MainThread beam_integration_benchmark(1/1) INFO     Running
benchmark beam_integration_benchmark
2018-03-28 06:01:08,608 115cb049 MainThread beam_integration_benchmark(1/1) INFO     Running:
/home/jenkins/tools/maven/latest/bin/mvn -e verify -Dit.test=org.apache.beam.sdk.io.tfrecord.TFRecordIOIT
-DskipITs=false -pl sdks/java/io/file-based-io-tests -Pio-it -Pdataflow-runner -Dfilesystem=gcs
-DintegrationTestPipelineOptions=["--project=apache-beam-testing","--tempRoot=gs://temp-storage-for-perf-tests","--filenamePrefix=gs://temp-storage-for-perf-tests/beam_PerformanceTests_TFRecordIOIT/303/","--numberOfRecords=1000000","--runner=TestDataflowRunner"]
2018-03-28 06:21:08,617 115cb049 Thread-2 ERROR    IssueCommand timed out after 1200 seconds.
Killing command "/home/jenkins/tools/maven/latest/bin/mvn -e verify -Dit.test=org.apache.beam.sdk.io.tfrecord.TFRecordIOIT
-DskipITs=false -pl sdks/java/io/file-based-io-tests -Pio-it -Pdataflow-runner -Dfilesystem=gcs
-DintegrationTestPipelineOptions=["--project=apache-beam-testing","--tempRoot=gs://temp-storage-for-perf-tests","--filenamePrefix=gs://temp-storage-for-perf-tests/beam_PerformanceTests_TFRecordIOIT/303/","--numberOfRecords=1000000","--runner=TestDataflowRunner"]".
2018-03-28 06:21:08,654 115cb049 MainThread beam_integration_benchmark(1/1) INFO     Ran:
{/home/jenkins/tools/maven/latest/bin/mvn -e verify -Dit.test=org.apache.beam.sdk.io.tfrecord.TFRecordIOIT
-DskipITs=false -pl sdks/java/io/file-based-io-tests -Pio-it -Pdataflow-runner -Dfilesystem=gcs
-DintegrationTestPipelineOptions=["--project=apache-beam-testing","--tempRoot=gs://temp-storage-for-perf-tests","--filenamePrefix=gs://temp-storage-for-perf-tests/beam_PerformanceTests_TFRecordIOIT/303/","--numberOfRecords=1000000","--runner=TestDataflowRunner"]}
 ReturnCode:-9
STDOUT: [INFO] Error stacktraces are turned on.
[INFO] Scanning for projects...
[INFO] ------------------------------------------------------------------------
[INFO] Detecting the operating system and CPU architecture
[INFO] ------------------------------------------------------------------------
[INFO] os.detected.name: linux
[INFO] os.detected.arch: x86_64
[INFO] os.detected.version: 4.4
[INFO] os.detected.version.major: 4
[INFO] os.detected.version.minor: 4
[INFO] os.detected.release: ubuntu
[INFO] os.detected.release.version: 14.04
[INFO] os.detected.release.like.ubuntu: true
[INFO] os.detected.release.like.debian: true
[INFO] os.detected.classifier: linux-x86_64
[INFO] 
[INFO] ------------------------------------------------------------------------
[INFO] Building Apache Beam :: SDKs :: Java :: IO :: File-based-io-tests 2.5.0-SNAPSHOT
[INFO] ------------------------------------------------------------------------
[INFO] 
[INFO] --- maven-enforcer-plugin:3.0.0-M1:enforce (enforce-maven-version) @ beam-sdks-java-io-file-based-io-tests
---
[INFO] 
[INFO] --- maven-enforcer-plugin:3.0.0-M1:enforce (enforce) @ beam-sdks-java-io-file-based-io-tests
---
[INFO] Adding ignore: module-info
[INFO] 
[INFO] --- maven-enforcer-plugin:3.0.0-M1:enforce (enforce-banned-dependencies) @ beam-sdks-java-io-file-based-io-tests
---
[INFO] 
[INFO] --- maven-remote-resources-plugin:1.5:process (process-resource-bundles) @ beam-sdks-java-io-file-based-io-tests
---
[INFO] 
[INFO] --- maven-resources-plugin:3.0.2:resources (default-resources) @ beam-sdks-java-io-file-based-io-tests
---
[INFO] Using 'UTF-8' encoding to copy filtered resources.
[INFO] skip non existing resourceDirectory <https://builds.apache.org/job/beam_PerformanceTests_TFRecordIOIT/ws/runs/115cb049/beam/sdks/java/io/file-based-io-tests/src/main/resources>
[INFO] Copying 3 resources
[INFO] 
[INFO] --- maven-compiler-plugin:3.7.0:compile (default-compile) @ beam-sdks-java-io-file-based-io-tests
---
[INFO] No sources to compile
[INFO] 
[INFO] --- maven-resources-plugin:3.0.2:testResources (default-testResources) @ beam-sdks-java-io-file-based-io-tests
---
[INFO] Using 'UTF-8' encoding to copy filtered resources.
[INFO] skip non existing resourceDirectory <https://builds.apache.org/job/beam_PerformanceTests_TFRecordIOIT/ws/runs/115cb049/beam/sdks/java/io/file-based-io-tests/src/test/resources>
[INFO] Copying 3 resources
[INFO] 
[INFO] --- maven-compiler-plugin:3.7.0:testCompile (default-testCompile) @ beam-sdks-java-io-file-based-io-tests
---
[INFO] Changes detected - recompiling the module!
[INFO] Compiling 5 source files to <https://builds.apache.org/job/beam_PerformanceTests_TFRecordIOIT/ws/runs/115cb049/beam/sdks/java/io/file-based-io-tests/target/test-classes>
[INFO] <https://builds.apache.org/job/beam_PerformanceTests_TFRecordIOIT/ws/runs/115cb049/beam/sdks/java/io/file-based-io-tests/src/test/java/org/apache/beam/sdk/io/text/TextIOIT.java>:
Some input files use or override a deprecated API.
[INFO] <https://builds.apache.org/job/beam_PerformanceTests_TFRecordIOIT/ws/runs/115cb049/beam/sdks/java/io/file-based-io-tests/src/test/java/org/apache/beam/sdk/io/text/TextIOIT.java>:
Recompile with -Xlint:deprecation for details.
[INFO] 
[INFO] --- maven-checkstyle-plugin:3.0.0:check (default) @ beam-sdks-java-io-file-based-io-tests
---
[INFO] Starting audit...
Audit done.
[INFO] 
[INFO] --- maven-surefire-plugin:2.21.0:test (default-test) @ beam-sdks-java-io-file-based-io-tests
---
[INFO] Tests are skipped.
[INFO] 
[INFO] --- build-helper-maven-plugin:3.0.0:regex-properties (render-artifact-id) @ beam-sdks-java-io-file-based-io-tests
---
[INFO] 
[INFO] --- maven-jar-plugin:3.0.2:jar (default-jar) @ beam-sdks-java-io-file-based-io-tests
---
[INFO] Building jar: <https://builds.apache.org/job/beam_PerformanceTests_TFRecordIOIT/ws/runs/115cb049/beam/sdks/java/io/file-based-io-tests/target/beam-sdks-java-io-file-based-io-tests-2.5.0-SNAPSHOT.jar>
[INFO] 
[INFO] --- maven-site-plugin:3.7:attach-descriptor (attach-descriptor) @ beam-sdks-java-io-file-based-io-tests
---
[INFO] Skipping because packaging 'jar' is not pom.
[INFO] 
[INFO] --- maven-jar-plugin:3.0.2:test-jar (default-test-jar) @ beam-sdks-java-io-file-based-io-tests
---
[INFO] Building jar: <https://builds.apache.org/job/beam_PerformanceTests_TFRecordIOIT/ws/runs/115cb049/beam/sdks/java/io/file-based-io-tests/target/beam-sdks-java-io-file-based-io-tests-2.5.0-SNAPSHOT-tests.jar>
[INFO] 
[INFO] --- maven-shade-plugin:3.1.0:shade (bundle-and-repackage) @ beam-sdks-java-io-file-based-io-tests
---
[INFO] Excluding com.google.code.findbugs:jsr305:jar:3.0.1 from the shaded jar.
[INFO] Excluding com.fasterxml.jackson.core:jackson-core:jar:2.8.9 from the shaded jar.
[INFO] Excluding com.fasterxml.jackson.core:jackson-annotations:jar:2.8.9 from the shaded
jar.
[INFO] Excluding com.fasterxml.jackson.core:jackson-databind:jar:2.8.9 from the shaded jar.
[INFO] Excluding org.slf4j:slf4j-api:jar:1.7.25 from the shaded jar.
[INFO] Excluding joda-time:joda-time:jar:2.4 from the shaded jar.
[INFO] Excluding org.apache.beam:beam-runners-google-cloud-dataflow-java:jar:2.5.0-SNAPSHOT
from the shaded jar.
[INFO] Excluding org.apache.beam:beam-sdks-java-extensions-google-cloud-platform-core:jar:2.5.0-SNAPSHOT
from the shaded jar.
[INFO] Excluding com.google.cloud.bigdataoss:gcsio:jar:1.4.5 from the shaded jar.
[INFO] Excluding com.google.apis:google-api-services-cloudresourcemanager:jar:v1-rev6-1.22.0
from the shaded jar.
[INFO] Excluding com.google.api-client:google-api-client:jar:1.22.0 from the shaded jar.
[INFO] Excluding com.google.oauth-client:google-oauth-client:jar:1.22.0 from the shaded jar.
[INFO] Excluding com.google.http-client:google-http-client:jar:1.22.0 from the shaded jar.
[INFO] Excluding org.apache.httpcomponents:httpclient:jar:4.0.1 from the shaded jar.
[INFO] Excluding org.apache.httpcomponents:httpcore:jar:4.0.1 from the shaded jar.
[INFO] Excluding commons-codec:commons-codec:jar:1.3 from the shaded jar.
[INFO] Excluding com.google.http-client:google-http-client-jackson2:jar:1.22.0 from the shaded
jar.
[INFO] Excluding com.google.apis:google-api-services-dataflow:jar:v1b3-rev221-1.22.0 from
the shaded jar.
[INFO] Excluding com.google.apis:google-api-services-clouddebugger:jar:v2-rev8-1.22.0 from
the shaded jar.
[INFO] Excluding com.google.apis:google-api-services-storage:jar:v1-rev71-1.22.0 from the
shaded jar.
[INFO] Excluding com.google.auth:google-auth-library-credentials:jar:0.7.1 from the shaded
jar.
[INFO] Excluding com.google.auth:google-auth-library-oauth2-http:jar:0.7.1 from the shaded
jar.
[INFO] Excluding com.google.cloud.bigdataoss:util:jar:1.4.5 from the shaded jar.
[INFO] Excluding com.google.api-client:google-api-client-java6:jar:1.22.0 from the shaded
jar.
[INFO] Excluding com.google.api-client:google-api-client-jackson2:jar:1.22.0 from the shaded
jar.
[INFO] Excluding com.google.oauth-client:google-oauth-client-java6:jar:1.22.0 from the shaded
jar.
[INFO] Excluding org.apache.beam:beam-sdks-java-io-google-cloud-platform:jar:2.5.0-SNAPSHOT
from the shaded jar.
[INFO] Excluding org.apache.beam:beam-sdks-java-extensions-protobuf:jar:2.5.0-SNAPSHOT from
the shaded jar.
[INFO] Excluding io.grpc:grpc-core:jar:1.2.0 from the shaded jar.
[INFO] Excluding com.google.errorprone:error_prone_annotations:jar:2.0.15 from the shaded
jar.
[INFO] Excluding io.grpc:grpc-context:jar:1.2.0 from the shaded jar.
[INFO] Excluding com.google.instrumentation:instrumentation-api:jar:0.3.0 from the shaded
jar.
[INFO] Excluding com.google.apis:google-api-services-bigquery:jar:v2-rev374-1.22.0 from the
shaded jar.
[INFO] Excluding com.google.api:gax-grpc:jar:0.20.0 from the shaded jar.
[INFO] Excluding io.grpc:grpc-protobuf:jar:1.2.0 from the shaded jar.
[INFO] Excluding com.google.api:api-common:jar:1.0.0-rc2 from the shaded jar.
[INFO] Excluding com.google.auto.value:auto-value:jar:1.5.3 from the shaded jar.
[INFO] Excluding com.google.api:gax:jar:1.3.1 from the shaded jar.
[INFO] Excluding org.threeten:threetenbp:jar:1.3.3 from the shaded jar.
[INFO] Excluding com.google.cloud:google-cloud-core-grpc:jar:1.2.0 from the shaded jar.
[INFO] Excluding com.google.protobuf:protobuf-java-util:jar:3.2.0 from the shaded jar.
[INFO] Excluding com.google.code.gson:gson:jar:2.7 from the shaded jar.
[INFO] Excluding com.google.apis:google-api-services-pubsub:jar:v1-rev10-1.22.0 from the shaded
jar.
[INFO] Excluding com.google.api.grpc:grpc-google-cloud-pubsub-v1:jar:0.1.18 from the shaded
jar.
[INFO] Excluding com.google.api.grpc:proto-google-cloud-pubsub-v1:jar:0.1.18 from the shaded
jar.
[INFO] Excluding com.google.api.grpc:proto-google-iam-v1:jar:0.1.18 from the shaded jar.
[INFO] Excluding com.google.cloud.datastore:datastore-v1-proto-client:jar:1.4.0 from the shaded
jar.
[INFO] Excluding com.google.http-client:google-http-client-protobuf:jar:1.22.0 from the shaded
jar.
[INFO] Excluding com.google.http-client:google-http-client-jackson:jar:1.22.0 from the shaded
jar.
[INFO] Excluding com.google.cloud.datastore:datastore-v1-protos:jar:1.3.0 from the shaded
jar.
[INFO] Excluding com.google.api.grpc:grpc-google-common-protos:jar:0.1.9 from the shaded jar.
[INFO] Excluding io.grpc:grpc-auth:jar:1.2.0 from the shaded jar.
[INFO] Excluding io.grpc:grpc-netty:jar:1.2.0 from the shaded jar.
[INFO] Excluding io.netty:netty-codec-http2:jar:4.1.8.Final from the shaded jar.
[INFO] Excluding io.netty:netty-codec-http:jar:4.1.8.Final from the shaded jar.
[INFO] Excluding io.netty:netty-handler-proxy:jar:4.1.8.Final from the shaded jar.
[INFO] Excluding io.netty:netty-codec-socks:jar:4.1.8.Final from the shaded jar.
[INFO] Excluding io.netty:netty-handler:jar:4.1.8.Final from the shaded jar.
[INFO] Excluding io.netty:netty-buffer:jar:4.1.8.Final from the shaded jar.
[INFO] Excluding io.netty:netty-common:jar:4.1.8.Final from the shaded jar.
[INFO] Excluding io.netty:netty-transport:jar:4.1.8.Final from the shaded jar.
[INFO] Excluding io.netty:netty-resolver:jar:4.1.8.Final from the shaded jar.
[INFO] Excluding io.netty:netty-codec:jar:4.1.8.Final from the shaded jar.
[INFO] Excluding io.grpc:grpc-stub:jar:1.2.0 from the shaded jar.
[INFO] Excluding io.grpc:grpc-all:jar:1.2.0 from the shaded jar.
[INFO] Excluding io.grpc:grpc-okhttp:jar:1.2.0 from the shaded jar.
[INFO] Excluding com.squareup.okhttp:okhttp:jar:2.5.0 from the shaded jar.
[INFO] Excluding com.squareup.okio:okio:jar:1.6.0 from the shaded jar.
[INFO] Excluding io.grpc:grpc-protobuf-lite:jar:1.2.0 from the shaded jar.
[INFO] Excluding io.grpc:grpc-protobuf-nano:jar:1.2.0 from the shaded jar.
[INFO] Excluding com.google.protobuf.nano:protobuf-javanano:jar:3.0.0-alpha-5 from the shaded
jar.
[INFO] Excluding com.google.cloud:google-cloud-core:jar:1.0.2 from the shaded jar.
[INFO] Excluding org.json:json:jar:20160810 from the shaded jar.
[INFO] Excluding com.google.cloud:google-cloud-spanner:jar:0.20.0b-beta from the shaded jar.
[INFO] Excluding com.google.api.grpc:proto-google-cloud-spanner-v1:jar:0.1.11b from the shaded
jar.
[INFO] Excluding com.google.api.grpc:proto-google-cloud-spanner-admin-instance-v1:jar:0.1.11
from the shaded jar.
[INFO] Excluding com.google.api.grpc:grpc-google-cloud-spanner-v1:jar:0.1.11b from the shaded
jar.
[INFO] Excluding com.google.api.grpc:grpc-google-cloud-spanner-admin-database-v1:jar:0.1.11
from the shaded jar.
[INFO] Excluding com.google.api.grpc:grpc-google-cloud-spanner-admin-instance-v1:jar:0.1.11
from the shaded jar.
[INFO] Excluding com.google.api.grpc:grpc-google-longrunning-v1:jar:0.1.11 from the shaded
jar.
[INFO] Excluding com.google.api.grpc:proto-google-longrunning-v1:jar:0.1.11 from the shaded
jar.
[INFO] Excluding com.google.cloud.bigtable:bigtable-protos:jar:1.0.0-pre3 from the shaded
jar.
[INFO] Excluding com.google.cloud.bigtable:bigtable-client-core:jar:1.0.0 from the shaded
jar.
[INFO] Excluding commons-logging:commons-logging:jar:1.2 from the shaded jar.
[INFO] Excluding com.google.auth:google-auth-library-appengine:jar:0.7.0 from the shaded jar.
[INFO] Excluding io.opencensus:opencensus-contrib-grpc-util:jar:0.7.0 from the shaded jar.
[INFO] Excluding io.opencensus:opencensus-api:jar:0.7.0 from the shaded jar.
[INFO] Excluding io.dropwizard.metrics:metrics-core:jar:3.1.2 from the shaded jar.
[INFO] Excluding com.google.protobuf:protobuf-java:jar:3.2.0 from the shaded jar.
[INFO] Excluding io.netty:netty-tcnative-boringssl-static:jar:1.1.33.Fork26 from the shaded
jar.
[INFO] Excluding com.google.api.grpc:proto-google-cloud-spanner-admin-database-v1:jar:0.1.9
from the shaded jar.
[INFO] Excluding com.google.api.grpc:proto-google-common-protos:jar:0.1.9 from the shaded
jar.
[INFO] Replacing original artifact with shaded artifact.
[INFO] Replacing <https://builds.apache.org/job/beam_PerformanceTests_TFRecordIOIT/ws/runs/115cb049/beam/sdks/java/io/file-based-io-tests/target/beam-sdks-java-io-file-based-io-tests-2.5.0-SNAPSHOT.jar>
with <https://builds.apache.org/job/beam_PerformanceTests_TFRecordIOIT/ws/runs/115cb049/beam/sdks/java/io/file-based-io-tests/target/beam-sdks-java-io-file-based-io-tests-2.5.0-SNAPSHOT-shaded.jar>
[INFO] Replacing original test artifact with shaded test artifact.
[INFO] Replacing <https://builds.apache.org/job/beam_PerformanceTests_TFRecordIOIT/ws/runs/115cb049/beam/sdks/java/io/file-based-io-tests/target/beam-sdks-java-io-file-based-io-tests-2.5.0-SNAPSHOT-tests.jar>
with <https://builds.apache.org/job/beam_PerformanceTests_TFRecordIOIT/ws/runs/115cb049/beam/sdks/java/io/file-based-io-tests/target/beam-sdks-java-io-file-based-io-tests-2.5.0-SNAPSHOT-shaded-tests.jar>
[INFO] 
[INFO] --- maven-failsafe-plugin:2.21.0:integration-test (default) @ beam-sdks-java-io-file-based-io-tests
---
[INFO] Failsafe report directory: <https://builds.apache.org/job/beam_PerformanceTests_TFRecordIOIT/ws/runs/115cb049/beam/sdks/java/io/file-based-io-tests/target/failsafe-reports>
[INFO] parallel='all', perCoreThreadCount=true, threadCount=4, useUnlimitedThreads=false,
threadCountSuites=0, threadCountClasses=0, threadCountMethods=0, parallelOptimized=true
[INFO] 
[INFO] -------------------------------------------------------
[INFO]  T E S T S
[INFO] -------------------------------------------------------

STDERR: 
2018-03-28 06:21:08,656 115cb049 MainThread beam_integration_benchmark(1/1) ERROR    Error
during benchmark beam_integration_benchmark
Traceback (most recent call last):
  File "<https://builds.apache.org/job/beam_PerformanceTests_TFRecordIOIT/ws/PerfKitBenchmarker/perfkitbenchmarker/pkb.py",>
line 624, in RunBenchmark
    DoRunPhase(spec, collector, detailed_timer)
  File "<https://builds.apache.org/job/beam_PerformanceTests_TFRecordIOIT/ws/PerfKitBenchmarker/perfkitbenchmarker/pkb.py",>
line 527, in DoRunPhase
    samples = spec.BenchmarkRun(spec)
  File "<https://builds.apache.org/job/beam_PerformanceTests_TFRecordIOIT/ws/PerfKitBenchmarker/perfkitbenchmarker/linux_benchmarks/beam_integration_benchmark.py",>
line 159, in Run
    job_type=job_type)
  File "<https://builds.apache.org/job/beam_PerformanceTests_TFRecordIOIT/ws/PerfKitBenchmarker/perfkitbenchmarker/providers/gcp/gcp_dpb_dataflow.py",>
line 90, in SubmitJob
    assert retcode == 0, "Integration Test Failed."
AssertionError: Integration Test Failed.
2018-03-28 06:21:08,657 115cb049 MainThread beam_integration_benchmark(1/1) INFO     Cleaning
up benchmark beam_integration_benchmark
2018-03-28 06:21:08,660 115cb049 MainThread beam_integration_benchmark(1/1) ERROR    Exception
running benchmark
Traceback (most recent call last):
  File "<https://builds.apache.org/job/beam_PerformanceTests_TFRecordIOIT/ws/PerfKitBenchmarker/perfkitbenchmarker/pkb.py",>
line 758, in RunBenchmarkTask
    RunBenchmark(spec, collector)
  File "<https://builds.apache.org/job/beam_PerformanceTests_TFRecordIOIT/ws/PerfKitBenchmarker/perfkitbenchmarker/pkb.py",>
line 624, in RunBenchmark
    DoRunPhase(spec, collector, detailed_timer)
  File "<https://builds.apache.org/job/beam_PerformanceTests_TFRecordIOIT/ws/PerfKitBenchmarker/perfkitbenchmarker/pkb.py",>
line 527, in DoRunPhase
    samples = spec.BenchmarkRun(spec)
  File "<https://builds.apache.org/job/beam_PerformanceTests_TFRecordIOIT/ws/PerfKitBenchmarker/perfkitbenchmarker/linux_benchmarks/beam_integration_benchmark.py",>
line 159, in Run
    job_type=job_type)
  File "<https://builds.apache.org/job/beam_PerformanceTests_TFRecordIOIT/ws/PerfKitBenchmarker/perfkitbenchmarker/providers/gcp/gcp_dpb_dataflow.py",>
line 90, in SubmitJob
    assert retcode == 0, "Integration Test Failed."
AssertionError: Integration Test Failed.
2018-03-28 06:21:08,661 115cb049 MainThread beam_integration_benchmark(1/1) ERROR    Benchmark
1/1 beam_integration_benchmark (UID: beam_integration_benchmark0) failed. Execution will continue.
2018-03-28 06:21:08,661 115cb049 MainThread beam_integration_benchmark(1/1) INFO     Benchmark
run statuses:
---------------------------------------------------------------------------------
Name                        UID                          Status  Failed Substatus
---------------------------------------------------------------------------------
beam_integration_benchmark  beam_integration_benchmark0  FAILED                  
---------------------------------------------------------------------------------
Success rate: 0.00% (0/1)
2018-03-28 06:21:08,661 115cb049 MainThread beam_integration_benchmark(1/1) INFO     Complete
logs can be found at: <https://builds.apache.org/job/beam_PerformanceTests_TFRecordIOIT/ws/runs/115cb049/pkb.log>
2018-03-28 06:21:08,661 115cb049 MainThread beam_integration_benchmark(1/1) INFO     Completion
statuses can be found at: <https://builds.apache.org/job/beam_PerformanceTests_TFRecordIOIT/ws/runs/115cb049/completion_statuses.json>
Build step 'Execute shell' marked build as failure

Mime
View raw message