beam-commits mailing list archives

Site index · List index
Message view « Date » · « Thread »
Top « Date » · « Thread »
From Apache Jenkins Server <jenk...@builds.apache.org>
Subject Build failed in Jenkins: beam_PostCommit_Java_ValidatesRunner_Spark #4436
Date Sat, 17 Mar 2018 18:08:32 GMT
See <https://builds.apache.org/job/beam_PostCommit_Java_ValidatesRunner_Spark/4436/display/redirect>

------------------------------------------
[...truncated 110.67 KB...]
2018-03-17T18:07:44.675 [INFO] Excluding org.codehaus.jackson:jackson-core-asl:jar:1.9.13
from the shaded jar.
2018-03-17T18:07:44.675 [INFO] Excluding org.codehaus.jackson:jackson-mapper-asl:jar:1.9.13
from the shaded jar.
2018-03-17T18:07:44.675 [INFO] Excluding com.thoughtworks.paranamer:paranamer:jar:2.7 from
the shaded jar.
2018-03-17T18:07:44.675 [INFO] Excluding org.xerial.snappy:snappy-java:jar:1.1.4 from the
shaded jar.
2018-03-17T18:07:44.675 [INFO] Including org.apache.commons:commons-compress:jar:1.14 in the
shaded jar.
2018-03-17T18:07:44.675 [INFO] Including org.apache.commons:commons-lang3:jar:3.6 in the shaded
jar.
2018-03-17T18:07:44.675 [INFO] Excluding joda-time:joda-time:jar:2.4 from the shaded jar.
2018-03-17T18:07:44.675 [INFO] Excluding org.tukaani:xz:jar:1.5 from the shaded jar.
2018-03-17T18:07:44.675 [INFO] Excluding com.google.auto.service:auto-service:jar:1.0-rc2
from the shaded jar.
2018-03-17T18:07:44.676 [INFO] Excluding com.google.auto:auto-common:jar:0.3 from the shaded
jar.
2018-03-17T18:07:49.887 [INFO] Replacing original artifact with shaded artifact.
2018-03-17T18:07:49.887 [INFO] Replacing <https://builds.apache.org/job/beam_PostCommit_Java_ValidatesRunner_Spark/ws/src/sdks/java/core/target/beam-sdks-java-core-2.5.0-SNAPSHOT.jar>
with <https://builds.apache.org/job/beam_PostCommit_Java_ValidatesRunner_Spark/ws/src/sdks/java/core/target/beam-sdks-java-core-2.5.0-SNAPSHOT-shaded.jar>
2018-03-17T18:07:49.887 [INFO] Replacing original test artifact with shaded test artifact.
2018-03-17T18:07:49.887 [INFO] Replacing <https://builds.apache.org/job/beam_PostCommit_Java_ValidatesRunner_Spark/ws/src/sdks/java/core/target/beam-sdks-java-core-2.5.0-SNAPSHOT-tests.jar>
with <https://builds.apache.org/job/beam_PostCommit_Java_ValidatesRunner_Spark/ws/src/sdks/java/core/target/beam-sdks-java-core-2.5.0-SNAPSHOT-shaded-tests.jar>
2018-03-17T18:07:49.887 [INFO] Dependency-reduced POM written at: <https://builds.apache.org/job/beam_PostCommit_Java_ValidatesRunner_Spark/ws/src/sdks/java/core/dependency-reduced-pom.xml>
2018-03-17T18:07:50.095 [INFO] 
2018-03-17T18:07:50.095 [INFO] --- maven-dependency-plugin:3.0.2:analyze-only (default) @
beam-sdks-java-core ---
2018-03-17T18:07:50.466 [INFO] No dependency problems found
[JENKINS] Archiving disabled
2018-03-17T18:07:52.924 [INFO] 
2018-03-17T18:07:52.924 [INFO] ------------------------------------------------------------------------
2018-03-17T18:07:52.924 [INFO] Building Apache Beam :: Runners 2.5.0-SNAPSHOT
2018-03-17T18:07:52.924 [INFO] ------------------------------------------------------------------------
2018-03-17T18:07:52.927 [INFO] 
2018-03-17T18:07:52.927 [INFO] --- maven-clean-plugin:3.0.0:clean (default-clean) @ beam-runners-parent
---
2018-03-17T18:07:52.929 [INFO] Deleting <https://builds.apache.org/job/beam_PostCommit_Java_ValidatesRunner_Spark/ws/src/runners>
(includes = [**/*.pyc, **/*.egg-info/, **/sdks/python/LICENSE, **/sdks/python/NOTICE, **/sdks/python/README.md,
**/sdks/python/apache_beam/portability/api/*pb2*.*, **/sdks/python/apache_beam/portability/common_urns.py,
**/sdks/python/**/*.c, **/sdks/python/**/*.so, **/sdks/python/**/*.egg], excludes = [])
2018-03-17T18:07:53.065 [INFO] 
2018-03-17T18:07:53.066 [INFO] --- maven-enforcer-plugin:3.0.0-M1:enforce (enforce-maven-version)
@ beam-runners-parent ---
2018-03-17T18:07:53.173 [INFO] 
2018-03-17T18:07:53.173 [INFO] --- maven-enforcer-plugin:3.0.0-M1:enforce (enforce) @ beam-runners-parent
---
2018-03-17T18:07:53.175 [INFO] Adding ignore: module-info
2018-03-17T18:07:53.282 [INFO] 
2018-03-17T18:07:53.282 [INFO] --- maven-enforcer-plugin:3.0.0-M1:enforce (enforce-banned-dependencies)
@ beam-runners-parent ---
2018-03-17T18:07:53.392 [INFO] 
2018-03-17T18:07:53.392 [INFO] --- maven-remote-resources-plugin:1.5:process (process-resource-bundles)
@ beam-runners-parent ---
2018-03-17T18:07:53.508 [INFO] 
2018-03-17T18:07:53.508 [INFO] --- maven-checkstyle-plugin:3.0.0:check (default) @ beam-runners-parent
---
2018-03-17T18:07:53.602 [INFO] Starting audit...
Audit done.
2018-03-17T18:07:53.916 [INFO] 
2018-03-17T18:07:53.916 [INFO] --- build-helper-maven-plugin:3.0.0:regex-properties (render-artifact-id)
@ beam-runners-parent ---
2018-03-17T18:07:54.025 [INFO] 
2018-03-17T18:07:54.025 [INFO] --- maven-site-plugin:3.7:attach-descriptor (attach-descriptor)
@ beam-runners-parent ---
2018-03-17T18:07:54.026 [INFO] No site descriptor found: nothing to attach.
2018-03-17T18:07:54.277 [INFO] 
2018-03-17T18:07:54.277 [INFO] --- maven-jar-plugin:3.0.2:jar (default-jar) @ beam-runners-parent
---
2018-03-17T18:07:54.278 [INFO] Skipping packaging of the jar
2018-03-17T18:07:54.494 [INFO] 
2018-03-17T18:07:54.494 [INFO] --- maven-jar-plugin:3.0.2:test-jar (default-test-jar) @ beam-runners-parent
---
2018-03-17T18:07:54.494 [INFO] Skipping packaging of the test-jar
2018-03-17T18:07:54.602 [INFO] 
2018-03-17T18:07:54.602 [INFO] --- maven-shade-plugin:3.1.0:shade (bundle-and-repackage) @
beam-runners-parent ---
2018-03-17T18:07:54.605 [INFO] Replacing original artifact with shaded artifact.
2018-03-17T18:07:54.712 [INFO] 
2018-03-17T18:07:54.713 [INFO] --- maven-dependency-plugin:3.0.2:analyze-only (default) @
beam-runners-parent ---
2018-03-17T18:07:54.714 [INFO] Skipping pom project
[JENKINS] Archiving disabled
2018-03-17T18:07:56.227 [INFO] 
2018-03-17T18:07:56.228 [INFO] ------------------------------------------------------------------------
2018-03-17T18:07:56.228 [INFO] Building Apache Beam :: Runners :: Core Construction Java 2.5.0-SNAPSHOT
2018-03-17T18:07:56.228 [INFO] ------------------------------------------------------------------------
2018-03-17T18:07:56.236 [INFO] 
2018-03-17T18:07:56.236 [INFO] --- maven-clean-plugin:3.0.0:clean (default-clean) @ beam-runners-core-construction-java
---
2018-03-17T18:07:56.238 [INFO] Deleting <https://builds.apache.org/job/beam_PostCommit_Java_ValidatesRunner_Spark/ws/src/runners/core-construction-java>
(includes = [**/*.pyc, **/*.egg-info/, **/sdks/python/LICENSE, **/sdks/python/NOTICE, **/sdks/python/README.md,
**/sdks/python/apache_beam/portability/api/*pb2*.*, **/sdks/python/apache_beam/portability/common_urns.py,
**/sdks/python/**/*.c, **/sdks/python/**/*.so, **/sdks/python/**/*.egg], excludes = [])
2018-03-17T18:07:56.349 [INFO] 
2018-03-17T18:07:56.349 [INFO] --- maven-enforcer-plugin:3.0.0-M1:enforce (enforce-maven-version)
@ beam-runners-core-construction-java ---
2018-03-17T18:07:56.590 [INFO] 
2018-03-17T18:07:56.590 [INFO] --- maven-enforcer-plugin:3.0.0-M1:enforce (enforce) @ beam-runners-core-construction-java
---
2018-03-17T18:07:56.666 [INFO] Adding ignore: module-info
2018-03-17T18:07:57.026 [INFO] 
2018-03-17T18:07:57.026 [INFO] --- maven-enforcer-plugin:3.0.0-M1:enforce (enforce-banned-dependencies)
@ beam-runners-core-construction-java ---
2018-03-17T18:07:57.142 [INFO] 
2018-03-17T18:07:57.142 [INFO] --- maven-remote-resources-plugin:1.5:process (process-resource-bundles)
@ beam-runners-core-construction-java ---
2018-03-17T18:07:57.430 [INFO] 
2018-03-17T18:07:57.430 [INFO] --- maven-resources-plugin:3.0.2:resources (default-resources)
@ beam-runners-core-construction-java ---
2018-03-17T18:07:57.431 [INFO] Using 'UTF-8' encoding to copy filtered resources.
2018-03-17T18:07:57.432 [INFO] skip non existing resourceDirectory <https://builds.apache.org/job/beam_PostCommit_Java_ValidatesRunner_Spark/ws/src/runners/core-construction-java/src/main/resources>
2018-03-17T18:07:57.432 [INFO] Copying 3 resources
2018-03-17T18:07:57.540 [INFO] 
2018-03-17T18:07:57.540 [INFO] --- maven-compiler-plugin:3.7.0:compile (default-compile) @
beam-runners-core-construction-java ---
2018-03-17T18:07:57.552 [INFO] Changes detected - recompiling the module!
2018-03-17T18:07:57.552 [INFO] Compiling 60 source files to <https://builds.apache.org/job/beam_PostCommit_Java_ValidatesRunner_Spark/ws/src/runners/core-construction-java/target/classes>
2018-03-17T18:07:58.934 [INFO] <https://builds.apache.org/job/beam_PostCommit_Java_ValidatesRunner_Spark/ws/src/runners/core-construction-java/src/main/java/org/apache/beam/runners/core/construction/TriggerTranslation.java>:
Some input files use or override a deprecated API.
2018-03-17T18:07:58.934 [INFO] <https://builds.apache.org/job/beam_PostCommit_Java_ValidatesRunner_Spark/ws/src/runners/core-construction-java/src/main/java/org/apache/beam/runners/core/construction/TriggerTranslation.java>:
Recompile with -Xlint:deprecation for details.
2018-03-17T18:07:58.934 [INFO] <https://builds.apache.org/job/beam_PostCommit_Java_ValidatesRunner_Spark/ws/src/runners/core-construction-java/src/main/java/org/apache/beam/runners/core/construction/PTransformTranslation.java>:
Some input files use unchecked or unsafe operations.
2018-03-17T18:07:58.934 [INFO] <https://builds.apache.org/job/beam_PostCommit_Java_ValidatesRunner_Spark/ws/src/runners/core-construction-java/src/main/java/org/apache/beam/runners/core/construction/PTransformTranslation.java>:
Recompile with -Xlint:unchecked for details.
2018-03-17T18:07:59.047 [INFO] 
2018-03-17T18:07:59.047 [INFO] --- maven-resources-plugin:3.0.2:testResources (default-testResources)
@ beam-runners-core-construction-java ---
2018-03-17T18:07:59.049 [INFO] Using 'UTF-8' encoding to copy filtered resources.
2018-03-17T18:07:59.049 [INFO] skip non existing resourceDirectory <https://builds.apache.org/job/beam_PostCommit_Java_ValidatesRunner_Spark/ws/src/runners/core-construction-java/src/test/resources>
2018-03-17T18:07:59.049 [INFO] Copying 3 resources
2018-03-17T18:07:59.161 [INFO] 
2018-03-17T18:07:59.162 [INFO] --- maven-compiler-plugin:3.7.0:testCompile (default-testCompile)
@ beam-runners-core-construction-java ---
2018-03-17T18:07:59.175 [INFO] Changes detected - recompiling the module!
2018-03-17T18:07:59.175 [INFO] Compiling 44 source files to <https://builds.apache.org/job/beam_PostCommit_Java_ValidatesRunner_Spark/ws/src/runners/core-construction-java/target/test-classes>
2018-03-17T18:08:01.064 [INFO] <https://builds.apache.org/job/beam_PostCommit_Java_ValidatesRunner_Spark/ws/src/runners/core-construction-java/src/test/java/org/apache/beam/runners/core/construction/PTransformTranslationTest.java>:
Some input files use or override a deprecated API.
2018-03-17T18:08:01.065 [INFO] <https://builds.apache.org/job/beam_PostCommit_Java_ValidatesRunner_Spark/ws/src/runners/core-construction-java/src/test/java/org/apache/beam/runners/core/construction/PTransformTranslationTest.java>:
Recompile with -Xlint:deprecation for details.
2018-03-17T18:08:01.065 [INFO] <https://builds.apache.org/job/beam_PostCommit_Java_ValidatesRunner_Spark/ws/src/runners/core-construction-java/src/test/java/org/apache/beam/runners/core/construction/ParDoTranslationTest.java>:
Some input files use unchecked or unsafe operations.
2018-03-17T18:08:01.065 [INFO] <https://builds.apache.org/job/beam_PostCommit_Java_ValidatesRunner_Spark/ws/src/runners/core-construction-java/src/test/java/org/apache/beam/runners/core/construction/ParDoTranslationTest.java>:
Recompile with -Xlint:unchecked for details.
2018-03-17T18:08:01.173 [INFO] 
2018-03-17T18:08:01.173 [INFO] --- maven-checkstyle-plugin:3.0.0:check (default) @ beam-runners-core-construction-java
---
2018-03-17T18:08:02.423 [INFO] Starting audit...
[ERROR] <https://builds.apache.org/job/beam_PostCommit_Java_ValidatesRunner_Spark/ws/src/runners/core-construction-java/src/main/java/org/apache/beam/runners/core/construction/graph/Networks.java>:77:18:
Name 'N' must match pattern '^(((T|K|V|W|X)[0-9]*)|([A-Z][a-z][a-zA-Z]*T))$'. [MethodTypeParameterName]
[ERROR] <https://builds.apache.org/job/beam_PostCommit_Java_ValidatesRunner_Spark/ws/src/runners/core-construction-java/src/main/java/org/apache/beam/runners/core/construction/graph/Networks.java>:77:21:
Name 'E' must match pattern '^(((T|K|V|W|X)[0-9]*)|([A-Z][a-z][a-zA-Z]*T))$'. [MethodTypeParameterName]
[ERROR] <https://builds.apache.org/job/beam_PostCommit_Java_ValidatesRunner_Spark/ws/src/runners/core-construction-java/src/main/java/org/apache/beam/runners/core/construction/graph/Networks.java>:128:18:
Name 'N' must match pattern '^(((T|K|V|W|X)[0-9]*)|([A-Z][a-z][a-zA-Z]*T))$'. [MethodTypeParameterName]
[ERROR] <https://builds.apache.org/job/beam_PostCommit_Java_ValidatesRunner_Spark/ws/src/runners/core-construction-java/src/main/java/org/apache/beam/runners/core/construction/graph/Networks.java>:128:21:
Name 'E' must match pattern '^(((T|K|V|W|X)[0-9]*)|([A-Z][a-z][a-zA-Z]*T))$'. [MethodTypeParameterName]
[ERROR] <https://builds.apache.org/job/beam_PostCommit_Java_ValidatesRunner_Spark/ws/src/runners/core-construction-java/src/main/java/org/apache/beam/runners/core/construction/graph/Networks.java>:147:18:
Name 'N' must match pattern '^(((T|K|V|W|X)[0-9]*)|([A-Z][a-z][a-zA-Z]*T))$'. [MethodTypeParameterName]
[ERROR] <https://builds.apache.org/job/beam_PostCommit_Java_ValidatesRunner_Spark/ws/src/runners/core-construction-java/src/main/java/org/apache/beam/runners/core/construction/graph/Networks.java>:147:21:
Name 'E' must match pattern '^(((T|K|V|W|X)[0-9]*)|([A-Z][a-z][a-zA-Z]*T))$'. [MethodTypeParameterName]
[ERROR] <https://builds.apache.org/job/beam_PostCommit_Java_ValidatesRunner_Spark/ws/src/runners/core-construction-java/src/main/java/org/apache/beam/runners/core/construction/graph/Networks.java>:182:18:
Name 'N' must match pattern '^(((T|K|V|W|X)[0-9]*)|([A-Z][a-z][a-zA-Z]*T))$'. [MethodTypeParameterName]
[ERROR] <https://builds.apache.org/job/beam_PostCommit_Java_ValidatesRunner_Spark/ws/src/runners/core-construction-java/src/main/java/org/apache/beam/runners/core/construction/graph/Networks.java>:182:21:
Name 'E' must match pattern '^(((T|K|V|W|X)[0-9]*)|([A-Z][a-z][a-zA-Z]*T))$'. [MethodTypeParameterName]
[ERROR] <https://builds.apache.org/job/beam_PostCommit_Java_ValidatesRunner_Spark/ws/src/runners/core-construction-java/src/main/java/org/apache/beam/runners/core/construction/graph/Networks.java>:219:18:
Name 'N' must match pattern '^(((T|K|V|W|X)[0-9]*)|([A-Z][a-z][a-zA-Z]*T))$'. [MethodTypeParameterName]
[ERROR] <https://builds.apache.org/job/beam_PostCommit_Java_ValidatesRunner_Spark/ws/src/runners/core-construction-java/src/main/java/org/apache/beam/runners/core/construction/graph/Networks.java>:219:21:
Name 'E' must match pattern '^(((T|K|V|W|X)[0-9]*)|([A-Z][a-z][a-zA-Z]*T))$'. [MethodTypeParameterName]
Audit done.
2018-03-17T18:08:02.423 [INFO] There are 10 errors reported by Checkstyle 8.7 with beam/checkstyle.xml
ruleset.
2018-03-17T18:08:02.425 [ERROR] src/main/java/org/apache/beam/runners/core/construction/graph/Networks.java:[77,18]
(naming) MethodTypeParameterName: Name 'N' must match pattern '^(((T|K|V|W|X)[0-9]*)|([A-Z][a-z][a-zA-Z]*T))$'.
2018-03-17T18:08:02.425 [ERROR] src/main/java/org/apache/beam/runners/core/construction/graph/Networks.java:[77,21]
(naming) MethodTypeParameterName: Name 'E' must match pattern '^(((T|K|V|W|X)[0-9]*)|([A-Z][a-z][a-zA-Z]*T))$'.
2018-03-17T18:08:02.425 [ERROR] src/main/java/org/apache/beam/runners/core/construction/graph/Networks.java:[128,18]
(naming) MethodTypeParameterName: Name 'N' must match pattern '^(((T|K|V|W|X)[0-9]*)|([A-Z][a-z][a-zA-Z]*T))$'.
2018-03-17T18:08:02.425 [ERROR] src/main/java/org/apache/beam/runners/core/construction/graph/Networks.java:[128,21]
(naming) MethodTypeParameterName: Name 'E' must match pattern '^(((T|K|V|W|X)[0-9]*)|([A-Z][a-z][a-zA-Z]*T))$'.
2018-03-17T18:08:02.425 [ERROR] src/main/java/org/apache/beam/runners/core/construction/graph/Networks.java:[147,18]
(naming) MethodTypeParameterName: Name 'N' must match pattern '^(((T|K|V|W|X)[0-9]*)|([A-Z][a-z][a-zA-Z]*T))$'.
2018-03-17T18:08:02.425 [ERROR] src/main/java/org/apache/beam/runners/core/construction/graph/Networks.java:[147,21]
(naming) MethodTypeParameterName: Name 'E' must match pattern '^(((T|K|V|W|X)[0-9]*)|([A-Z][a-z][a-zA-Z]*T))$'.
2018-03-17T18:08:02.425 [ERROR] src/main/java/org/apache/beam/runners/core/construction/graph/Networks.java:[182,18]
(naming) MethodTypeParameterName: Name 'N' must match pattern '^(((T|K|V|W|X)[0-9]*)|([A-Z][a-z][a-zA-Z]*T))$'.
2018-03-17T18:08:02.425 [ERROR] src/main/java/org/apache/beam/runners/core/construction/graph/Networks.java:[182,21]
(naming) MethodTypeParameterName: Name 'E' must match pattern '^(((T|K|V|W|X)[0-9]*)|([A-Z][a-z][a-zA-Z]*T))$'.
2018-03-17T18:08:02.425 [ERROR] src/main/java/org/apache/beam/runners/core/construction/graph/Networks.java:[219,18]
(naming) MethodTypeParameterName: Name 'N' must match pattern '^(((T|K|V|W|X)[0-9]*)|([A-Z][a-z][a-zA-Z]*T))$'.
2018-03-17T18:08:02.425 [ERROR] src/main/java/org/apache/beam/runners/core/construction/graph/Networks.java:[219,21]
(naming) MethodTypeParameterName: Name 'E' must match pattern '^(((T|K|V|W|X)[0-9]*)|([A-Z][a-z][a-zA-Z]*T))$'.
[JENKINS] Archiving disabled
[JENKINS] Archiving disabled
[JENKINS] Archiving disabled
[JENKINS] Archiving disabled
[JENKINS] Archiving disabled
[JENKINS] Archiving disabled
[JENKINS] Archiving disabled
[JENKINS] Archiving disabled
[JENKINS] Archiving disabled
[JENKINS] Archiving disabled
[JENKINS] Archiving disabled
[JENKINS] Archiving disabled
[JENKINS] Archiving disabled
[JENKINS] Archiving disabled
[JENKINS] Archiving disabled
[JENKINS] Archiving disabled
[JENKINS] Archiving disabled
[JENKINS] Archiving disabled
2018-03-17T18:08:14.283 [INFO] ------------------------------------------------------------------------
2018-03-17T18:08:14.283 [INFO] Reactor Summary:
2018-03-17T18:08:14.283 [INFO] 
2018-03-17T18:08:14.283 [INFO] Apache Beam :: Parent .............................. SUCCESS
[ 11.258 s]
2018-03-17T18:08:14.283 [INFO] Apache Beam :: SDKs :: Java :: Build Tools ......... SUCCESS
[  8.703 s]
2018-03-17T18:08:14.283 [INFO] Apache Beam :: Model ............................... SUCCESS
[  2.358 s]
2018-03-17T18:08:14.283 [INFO] Apache Beam :: Model :: Pipeline ................... SUCCESS
[ 11.491 s]
2018-03-17T18:08:14.283 [INFO] Apache Beam :: Model :: Job Management ............. SUCCESS
[  7.780 s]
2018-03-17T18:08:14.283 [INFO] Apache Beam :: Model :: Fn Execution ............... SUCCESS
[  8.969 s]
2018-03-17T18:08:14.283 [INFO] Apache Beam :: SDKs ................................ SUCCESS
[  2.925 s]
2018-03-17T18:08:14.283 [INFO] Apache Beam :: SDKs :: Java ........................ SUCCESS
[  2.028 s]
2018-03-17T18:08:14.283 [INFO] Apache Beam :: SDKs :: Java :: Core ................ SUCCESS
[02:22 min]
2018-03-17T18:08:14.283 [INFO] Apache Beam :: Runners ............................. SUCCESS
[  2.677 s]
2018-03-17T18:08:14.283 [INFO] Apache Beam :: Runners :: Core Construction Java ... FAILURE
[  6.732 s]
2018-03-17T18:08:14.284 [INFO] Apache Beam :: Runners :: Core Java ................ SKIPPED
2018-03-17T18:08:14.284 [INFO] Apache Beam :: SDKs :: Java :: IO .................. SKIPPED
2018-03-17T18:08:14.284 [INFO] Apache Beam :: Runners :: Local Java Core .......... SKIPPED
2018-03-17T18:08:14.284 [INFO] Apache Beam :: Runners :: Direct Java .............. SKIPPED
2018-03-17T18:08:14.284 [INFO] Apache Beam :: SDKs :: Java :: IO :: Kafka ......... SKIPPED
2018-03-17T18:08:14.284 [INFO] Apache Beam :: Runners :: Spark .................... SKIPPED
2018-03-17T18:08:14.284 [INFO] ------------------------------------------------------------------------
2018-03-17T18:08:14.284 [INFO] BUILD FAILURE
2018-03-17T18:08:14.284 [INFO] ------------------------------------------------------------------------
2018-03-17T18:08:14.284 [INFO] Total time: 05:25 min
2018-03-17T18:08:14.284 [INFO] Finished at: 2018-03-17T18:08:14Z
2018-03-17T18:08:14.812 [INFO] Final Memory: 121M/1461M
2018-03-17T18:08:14.812 [INFO] ------------------------------------------------------------------------
2018-03-17T18:08:14.816 [ERROR] Failed to execute goal org.apache.maven.plugins:maven-checkstyle-plugin:3.0.0:check
(default) on project beam-runners-core-construction-java: You have 10 Checkstyle violations.
-> [Help 1]
org.apache.maven.lifecycle.LifecycleExecutionException: Failed to execute goal org.apache.maven.plugins:maven-checkstyle-plugin:3.0.0:check
(default) on project beam-runners-core-construction-java: You have 10 Checkstyle violations.
    at org.apache.maven.lifecycle.internal.MojoExecutor.execute (MojoExecutor.java:213)
    at org.apache.maven.lifecycle.internal.MojoExecutor.execute (MojoExecutor.java:154)
    at org.apache.maven.lifecycle.internal.MojoExecutor.execute (MojoExecutor.java:146)
    at org.apache.maven.lifecycle.internal.LifecycleModuleBuilder.buildProject (LifecycleModuleBuilder.java:117)
    at org.apache.maven.lifecycle.internal.LifecycleModuleBuilder.buildProject (LifecycleModuleBuilder.java:81)
    at org.apache.maven.lifecycle.internal.builder.singlethreaded.SingleThreadedBuilder.build
(SingleThreadedBuilder.java:51)
    at org.apache.maven.lifecycle.internal.LifecycleStarter.execute (LifecycleStarter.java:128)
    at org.apache.maven.DefaultMaven.doExecute (DefaultMaven.java:309)
    at org.apache.maven.DefaultMaven.doExecute (DefaultMaven.java:194)
    at org.apache.maven.DefaultMaven.execute (DefaultMaven.java:107)
    at org.jvnet.hudson.maven3.launcher.Maven35Launcher.main (Maven35Launcher.java:130)
    at sun.reflect.NativeMethodAccessorImpl.invoke0 (Native Method)
    at sun.reflect.NativeMethodAccessorImpl.invoke (NativeMethodAccessorImpl.java:62)
    at sun.reflect.DelegatingMethodAccessorImpl.invoke (DelegatingMethodAccessorImpl.java:43)
    at java.lang.reflect.Method.invoke (Method.java:498)
    at org.codehaus.plexus.classworlds.launcher.Launcher.launchEnhanced (Launcher.java:289)
    at org.codehaus.plexus.classworlds.launcher.Launcher.launch (Launcher.java:229)
    at jenkins.maven3.agent.Maven35Main.launch (Maven35Main.java:176)
    at sun.reflect.NativeMethodAccessorImpl.invoke0 (Native Method)
    at sun.reflect.NativeMethodAccessorImpl.invoke (NativeMethodAccessorImpl.java:62)
    at sun.reflect.DelegatingMethodAccessorImpl.invoke (DelegatingMethodAccessorImpl.java:43)
    at java.lang.reflect.Method.invoke (Method.java:498)
    at hudson.maven.Maven3Builder.call (Maven3Builder.java:139)
    at hudson.maven.Maven3Builder.call (Maven3Builder.java:70)
    at hudson.remoting.UserRequest.perform (UserRequest.java:207)
    at hudson.remoting.UserRequest.perform (UserRequest.java:53)
    at hudson.remoting.Request$2.run (Request.java:358)
    at hudson.remoting.InterceptingExecutorService$1.call (InterceptingExecutorService.java:72)
    at java.util.concurrent.FutureTask.run (FutureTask.java:266)
    at java.util.concurrent.ThreadPoolExecutor.runWorker (ThreadPoolExecutor.java:1149)
    at java.util.concurrent.ThreadPoolExecutor$Worker.run (ThreadPoolExecutor.java:624)
    at java.lang.Thread.run (Thread.java:748)
Caused by: org.apache.maven.plugin.MojoFailureException: You have 10 Checkstyle violations.
    at org.apache.maven.plugins.checkstyle.CheckstyleViolationCheckMojo.execute (CheckstyleViolationCheckMojo.java:576)
    at org.apache.maven.plugin.DefaultBuildPluginManager.executeMojo (DefaultBuildPluginManager.java:134)
    at org.apache.maven.lifecycle.internal.MojoExecutor.execute (MojoExecutor.java:208)
    at org.apache.maven.lifecycle.internal.MojoExecutor.execute (MojoExecutor.java:154)
    at org.apache.maven.lifecycle.internal.MojoExecutor.execute (MojoExecutor.java:146)
    at org.apache.maven.lifecycle.internal.LifecycleModuleBuilder.buildProject (LifecycleModuleBuilder.java:117)
    at org.apache.maven.lifecycle.internal.LifecycleModuleBuilder.buildProject (LifecycleModuleBuilder.java:81)
    at org.apache.maven.lifecycle.internal.builder.singlethreaded.SingleThreadedBuilder.build
(SingleThreadedBuilder.java:51)
    at org.apache.maven.lifecycle.internal.LifecycleStarter.execute (LifecycleStarter.java:128)
    at org.apache.maven.DefaultMaven.doExecute (DefaultMaven.java:309)
    at org.apache.maven.DefaultMaven.doExecute (DefaultMaven.java:194)
    at org.apache.maven.DefaultMaven.execute (DefaultMaven.java:107)
    at org.jvnet.hudson.maven3.launcher.Maven35Launcher.main (Maven35Launcher.java:130)
    at sun.reflect.NativeMethodAccessorImpl.invoke0 (Native Method)
    at sun.reflect.NativeMethodAccessorImpl.invoke (NativeMethodAccessorImpl.java:62)
    at sun.reflect.DelegatingMethodAccessorImpl.invoke (DelegatingMethodAccessorImpl.java:43)
    at java.lang.reflect.Method.invoke (Method.java:498)
    at org.codehaus.plexus.classworlds.launcher.Launcher.launchEnhanced (Launcher.java:289)
    at org.codehaus.plexus.classworlds.launcher.Launcher.launch (Launcher.java:229)
    at jenkins.maven3.agent.Maven35Main.launch (Maven35Main.java:176)
    at sun.reflect.NativeMethodAccessorImpl.invoke0 (Native Method)
    at sun.reflect.NativeMethodAccessorImpl.invoke (NativeMethodAccessorImpl.java:62)
    at sun.reflect.DelegatingMethodAccessorImpl.invoke (DelegatingMethodAccessorImpl.java:43)
    at java.lang.reflect.Method.invoke (Method.java:498)
    at hudson.maven.Maven3Builder.call (Maven3Builder.java:139)
    at hudson.maven.Maven3Builder.call (Maven3Builder.java:70)
    at hudson.remoting.UserRequest.perform (UserRequest.java:207)
    at hudson.remoting.UserRequest.perform (UserRequest.java:53)
    at hudson.remoting.Request$2.run (Request.java:358)
    at hudson.remoting.InterceptingExecutorService$1.call (InterceptingExecutorService.java:72)
    at java.util.concurrent.FutureTask.run (FutureTask.java:266)
    at java.util.concurrent.ThreadPoolExecutor.runWorker (ThreadPoolExecutor.java:1149)
    at java.util.concurrent.ThreadPoolExecutor$Worker.run (ThreadPoolExecutor.java:624)
    at java.lang.Thread.run (Thread.java:748)
2018-03-17T18:08:14.818 [ERROR] 
2018-03-17T18:08:14.818 [ERROR] Re-run Maven using the -X switch to enable full debug logging.
2018-03-17T18:08:14.818 [ERROR] 
2018-03-17T18:08:14.818 [ERROR] For more information about the errors and possible solutions,
please read the following articles:
2018-03-17T18:08:14.818 [ERROR] [Help 1] http://cwiki.apache.org/confluence/display/MAVEN/MojoFailureException
2018-03-17T18:08:14.818 [ERROR] 
2018-03-17T18:08:14.818 [ERROR] After correcting the problems, you can resume the build with
the command
2018-03-17T18:08:14.818 [ERROR]   mvn <goals> -rf :beam-runners-core-construction-java
channel stopped
Not sending mail to unregistered user ankurgoenka@gmail.com
Not sending mail to unregistered user herohde@google.com

Mime
View raw message