beam-commits mailing list archives

Site index · List index
Message view « Date » · « Thread »
Top « Date » · « Thread »
From Apache Jenkins Server <jenk...@builds.apache.org>
Subject Build failed in Jenkins: beam_PostCommit_Java_ValidatesRunner_Flink #5259
Date Sat, 17 Mar 2018 18:08:52 GMT
See <https://builds.apache.org/job/beam_PostCommit_Java_ValidatesRunner_Flink/5259/display/redirect>

------------------------------------------
[...truncated 131.44 KB...]
2018-03-17T18:08:06.624 [INFO] Excluding com.fasterxml.jackson.core:jackson-annotations:jar:2.8.9
from the shaded jar.
2018-03-17T18:08:06.624 [INFO] Excluding com.fasterxml.jackson.core:jackson-databind:jar:2.8.9
from the shaded jar.
2018-03-17T18:08:06.624 [INFO] Excluding com.google.auto.service:auto-service:jar:1.0-rc2
from the shaded jar.
2018-03-17T18:08:06.624 [INFO] Excluding com.google.auto:auto-common:jar:0.3 from the shaded
jar.
2018-03-17T18:08:07.684 [INFO] Replacing original artifact with shaded artifact.
2018-03-17T18:08:07.684 [INFO] Replacing <https://builds.apache.org/job/beam_PostCommit_Java_ValidatesRunner_Flink/ws/src/sdks/java/extensions/google-cloud-platform-core/target/beam-sdks-java-extensions-google-cloud-platform-core-2.5.0-SNAPSHOT.jar>
with <https://builds.apache.org/job/beam_PostCommit_Java_ValidatesRunner_Flink/ws/src/sdks/java/extensions/google-cloud-platform-core/target/beam-sdks-java-extensions-google-cloud-platform-core-2.5.0-SNAPSHOT-shaded.jar>
2018-03-17T18:08:07.684 [INFO] Replacing original test artifact with shaded test artifact.
2018-03-17T18:08:07.684 [INFO] Replacing <https://builds.apache.org/job/beam_PostCommit_Java_ValidatesRunner_Flink/ws/src/sdks/java/extensions/google-cloud-platform-core/target/beam-sdks-java-extensions-google-cloud-platform-core-2.5.0-SNAPSHOT-tests.jar>
with <https://builds.apache.org/job/beam_PostCommit_Java_ValidatesRunner_Flink/ws/src/sdks/java/extensions/google-cloud-platform-core/target/beam-sdks-java-extensions-google-cloud-platform-core-2.5.0-SNAPSHOT-shaded-tests.jar>
2018-03-17T18:08:07.684 [INFO] Dependency-reduced POM written at: <https://builds.apache.org/job/beam_PostCommit_Java_ValidatesRunner_Flink/ws/src/sdks/java/extensions/google-cloud-platform-core/dependency-reduced-pom.xml>
2018-03-17T18:08:07.904 [INFO] 
2018-03-17T18:08:07.904 [INFO] --- maven-dependency-plugin:3.0.2:analyze-only (default) @
beam-sdks-java-extensions-google-cloud-platform-core ---
2018-03-17T18:08:07.959 [INFO] No dependency problems found
[JENKINS] Archiving disabled
2018-03-17T18:08:10.051 [INFO] 
2018-03-17T18:08:10.051 [INFO] ------------------------------------------------------------------------
2018-03-17T18:08:10.051 [INFO] Building Apache Beam :: Runners 2.5.0-SNAPSHOT
2018-03-17T18:08:10.051 [INFO] ------------------------------------------------------------------------
2018-03-17T18:08:10.054 [INFO] 
2018-03-17T18:08:10.054 [INFO] --- maven-clean-plugin:3.0.0:clean (default-clean) @ beam-runners-parent
---
2018-03-17T18:08:10.056 [INFO] Deleting <https://builds.apache.org/job/beam_PostCommit_Java_ValidatesRunner_Flink/ws/src/runners>
(includes = [**/*.pyc, **/*.egg-info/, **/sdks/python/LICENSE, **/sdks/python/NOTICE, **/sdks/python/README.md,
**/sdks/python/apache_beam/portability/api/*pb2*.*, **/sdks/python/apache_beam/portability/common_urns.py,
**/sdks/python/**/*.c, **/sdks/python/**/*.so, **/sdks/python/**/*.egg], excludes = [])
2018-03-17T18:08:10.201 [INFO] 
2018-03-17T18:08:10.202 [INFO] --- maven-enforcer-plugin:3.0.0-M1:enforce (enforce-maven-version)
@ beam-runners-parent ---
2018-03-17T18:08:10.308 [INFO] 
2018-03-17T18:08:10.308 [INFO] --- maven-enforcer-plugin:3.0.0-M1:enforce (enforce) @ beam-runners-parent
---
2018-03-17T18:08:10.310 [INFO] Adding ignore: module-info
2018-03-17T18:08:12.272 [INFO] 
2018-03-17T18:08:12.272 [INFO] --- maven-enforcer-plugin:3.0.0-M1:enforce (enforce-banned-dependencies)
@ beam-runners-parent ---
2018-03-17T18:08:12.443 [INFO] 
2018-03-17T18:08:12.443 [INFO] --- maven-remote-resources-plugin:1.5:process (process-resource-bundles)
@ beam-runners-parent ---
2018-03-17T18:08:12.633 [INFO] 
2018-03-17T18:08:12.633 [INFO] --- maven-checkstyle-plugin:3.0.0:check (default) @ beam-runners-parent
---
2018-03-17T18:08:12.731 [INFO] Starting audit...
Audit done.
2018-03-17T18:08:12.838 [INFO] 
2018-03-17T18:08:12.838 [INFO] --- build-helper-maven-plugin:3.0.0:regex-properties (render-artifact-id)
@ beam-runners-parent ---
2018-03-17T18:08:12.946 [INFO] 
2018-03-17T18:08:12.946 [INFO] --- maven-site-plugin:3.7:attach-descriptor (attach-descriptor)
@ beam-runners-parent ---
2018-03-17T18:08:12.946 [INFO] No site descriptor found: nothing to attach.
2018-03-17T18:08:13.160 [INFO] 
2018-03-17T18:08:13.160 [INFO] --- maven-jar-plugin:3.0.2:jar (default-jar) @ beam-runners-parent
---
2018-03-17T18:08:13.161 [INFO] Skipping packaging of the jar
2018-03-17T18:08:13.392 [INFO] 
2018-03-17T18:08:13.392 [INFO] --- maven-jar-plugin:3.0.2:test-jar (default-test-jar) @ beam-runners-parent
---
2018-03-17T18:08:13.393 [INFO] Skipping packaging of the test-jar
2018-03-17T18:08:13.500 [INFO] 
2018-03-17T18:08:13.500 [INFO] --- maven-shade-plugin:3.1.0:shade (bundle-and-repackage) @
beam-runners-parent ---
2018-03-17T18:08:13.503 [INFO] Replacing original artifact with shaded artifact.
2018-03-17T18:08:13.609 [INFO] 
2018-03-17T18:08:13.609 [INFO] --- maven-dependency-plugin:3.0.2:analyze-only (default) @
beam-runners-parent ---
2018-03-17T18:08:13.610 [INFO] Skipping pom project
[JENKINS] Archiving disabled
2018-03-17T18:08:15.313 [INFO] 
2018-03-17T18:08:15.313 [INFO] ------------------------------------------------------------------------
2018-03-17T18:08:15.313 [INFO] Building Apache Beam :: Runners :: Core Construction Java 2.5.0-SNAPSHOT
2018-03-17T18:08:15.313 [INFO] ------------------------------------------------------------------------
2018-03-17T18:08:15.320 [INFO] 
2018-03-17T18:08:15.320 [INFO] --- maven-clean-plugin:3.0.0:clean (default-clean) @ beam-runners-core-construction-java
---
2018-03-17T18:08:15.323 [INFO] Deleting <https://builds.apache.org/job/beam_PostCommit_Java_ValidatesRunner_Flink/ws/src/runners/core-construction-java>
(includes = [**/*.pyc, **/*.egg-info/, **/sdks/python/LICENSE, **/sdks/python/NOTICE, **/sdks/python/README.md,
**/sdks/python/apache_beam/portability/api/*pb2*.*, **/sdks/python/apache_beam/portability/common_urns.py,
**/sdks/python/**/*.c, **/sdks/python/**/*.so, **/sdks/python/**/*.egg], excludes = [])
2018-03-17T18:08:15.432 [INFO] 
2018-03-17T18:08:15.432 [INFO] --- maven-enforcer-plugin:3.0.0-M1:enforce (enforce-maven-version)
@ beam-runners-core-construction-java ---
2018-03-17T18:08:15.670 [INFO] 
2018-03-17T18:08:15.670 [INFO] --- maven-enforcer-plugin:3.0.0-M1:enforce (enforce) @ beam-runners-core-construction-java
---
2018-03-17T18:08:15.711 [INFO] Adding ignore: module-info
2018-03-17T18:08:16.084 [INFO] 
2018-03-17T18:08:16.084 [INFO] --- maven-enforcer-plugin:3.0.0-M1:enforce (enforce-banned-dependencies)
@ beam-runners-core-construction-java ---
2018-03-17T18:08:16.198 [INFO] 
2018-03-17T18:08:16.198 [INFO] --- maven-remote-resources-plugin:1.5:process (process-resource-bundles)
@ beam-runners-core-construction-java ---
2018-03-17T18:08:16.485 [INFO] 
2018-03-17T18:08:16.485 [INFO] --- maven-resources-plugin:3.0.2:resources (default-resources)
@ beam-runners-core-construction-java ---
2018-03-17T18:08:16.486 [INFO] Using 'UTF-8' encoding to copy filtered resources.
2018-03-17T18:08:16.486 [INFO] skip non existing resourceDirectory <https://builds.apache.org/job/beam_PostCommit_Java_ValidatesRunner_Flink/ws/src/runners/core-construction-java/src/main/resources>
2018-03-17T18:08:16.486 [INFO] Copying 3 resources
2018-03-17T18:08:16.598 [INFO] 
2018-03-17T18:08:16.598 [INFO] --- maven-compiler-plugin:3.7.0:compile (default-compile) @
beam-runners-core-construction-java ---
2018-03-17T18:08:16.608 [INFO] Changes detected - recompiling the module!
2018-03-17T18:08:16.609 [INFO] Compiling 60 source files to <https://builds.apache.org/job/beam_PostCommit_Java_ValidatesRunner_Flink/ws/src/runners/core-construction-java/target/classes>
2018-03-17T18:08:18.138 [INFO] <https://builds.apache.org/job/beam_PostCommit_Java_ValidatesRunner_Flink/ws/src/runners/core-construction-java/src/main/java/org/apache/beam/runners/core/construction/JavaReadViaImpulse.java>:
Some input files use or override a deprecated API.
2018-03-17T18:08:18.138 [INFO] <https://builds.apache.org/job/beam_PostCommit_Java_ValidatesRunner_Flink/ws/src/runners/core-construction-java/src/main/java/org/apache/beam/runners/core/construction/JavaReadViaImpulse.java>:
Recompile with -Xlint:deprecation for details.
2018-03-17T18:08:18.138 [INFO] <https://builds.apache.org/job/beam_PostCommit_Java_ValidatesRunner_Flink/ws/src/runners/core-construction-java/src/main/java/org/apache/beam/runners/core/construction/PTransformTranslation.java>:
Some input files use unchecked or unsafe operations.
2018-03-17T18:08:18.138 [INFO] <https://builds.apache.org/job/beam_PostCommit_Java_ValidatesRunner_Flink/ws/src/runners/core-construction-java/src/main/java/org/apache/beam/runners/core/construction/PTransformTranslation.java>:
Recompile with -Xlint:unchecked for details.
2018-03-17T18:08:18.246 [INFO] 
2018-03-17T18:08:18.246 [INFO] --- maven-resources-plugin:3.0.2:testResources (default-testResources)
@ beam-runners-core-construction-java ---
2018-03-17T18:08:18.247 [INFO] Using 'UTF-8' encoding to copy filtered resources.
2018-03-17T18:08:18.248 [INFO] skip non existing resourceDirectory <https://builds.apache.org/job/beam_PostCommit_Java_ValidatesRunner_Flink/ws/src/runners/core-construction-java/src/test/resources>
2018-03-17T18:08:18.248 [INFO] Copying 3 resources
2018-03-17T18:08:18.356 [INFO] 
2018-03-17T18:08:18.356 [INFO] --- maven-compiler-plugin:3.7.0:testCompile (default-testCompile)
@ beam-runners-core-construction-java ---
2018-03-17T18:08:18.370 [INFO] Changes detected - recompiling the module!
2018-03-17T18:08:18.370 [INFO] Compiling 44 source files to <https://builds.apache.org/job/beam_PostCommit_Java_ValidatesRunner_Flink/ws/src/runners/core-construction-java/target/test-classes>
2018-03-17T18:08:20.148 [INFO] <https://builds.apache.org/job/beam_PostCommit_Java_ValidatesRunner_Flink/ws/src/runners/core-construction-java/src/test/java/org/apache/beam/runners/core/construction/WindowIntoTranslationTest.java>:
Some input files use or override a deprecated API.
2018-03-17T18:08:20.148 [INFO] <https://builds.apache.org/job/beam_PostCommit_Java_ValidatesRunner_Flink/ws/src/runners/core-construction-java/src/test/java/org/apache/beam/runners/core/construction/WindowIntoTranslationTest.java>:
Recompile with -Xlint:deprecation for details.
2018-03-17T18:08:20.148 [INFO] <https://builds.apache.org/job/beam_PostCommit_Java_ValidatesRunner_Flink/ws/src/runners/core-construction-java/src/test/java/org/apache/beam/runners/core/construction/UnsupportedOverrideFactoryTest.java>:
Some input files use unchecked or unsafe operations.
2018-03-17T18:08:20.148 [INFO] <https://builds.apache.org/job/beam_PostCommit_Java_ValidatesRunner_Flink/ws/src/runners/core-construction-java/src/test/java/org/apache/beam/runners/core/construction/UnsupportedOverrideFactoryTest.java>:
Recompile with -Xlint:unchecked for details.
2018-03-17T18:08:20.355 [INFO] 
2018-03-17T18:08:20.355 [INFO] --- maven-checkstyle-plugin:3.0.0:check (default) @ beam-runners-core-construction-java
---
2018-03-17T18:08:21.694 [INFO] Starting audit...
[ERROR] <https://builds.apache.org/job/beam_PostCommit_Java_ValidatesRunner_Flink/ws/src/runners/core-construction-java/src/main/java/org/apache/beam/runners/core/construction/graph/Networks.java>:77:18:
Name 'N' must match pattern '^(((T|K|V|W|X)[0-9]*)|([A-Z][a-z][a-zA-Z]*T))$'. [MethodTypeParameterName]
[ERROR] <https://builds.apache.org/job/beam_PostCommit_Java_ValidatesRunner_Flink/ws/src/runners/core-construction-java/src/main/java/org/apache/beam/runners/core/construction/graph/Networks.java>:77:21:
Name 'E' must match pattern '^(((T|K|V|W|X)[0-9]*)|([A-Z][a-z][a-zA-Z]*T))$'. [MethodTypeParameterName]
[ERROR] <https://builds.apache.org/job/beam_PostCommit_Java_ValidatesRunner_Flink/ws/src/runners/core-construction-java/src/main/java/org/apache/beam/runners/core/construction/graph/Networks.java>:128:18:
Name 'N' must match pattern '^(((T|K|V|W|X)[0-9]*)|([A-Z][a-z][a-zA-Z]*T))$'. [MethodTypeParameterName]
[ERROR] <https://builds.apache.org/job/beam_PostCommit_Java_ValidatesRunner_Flink/ws/src/runners/core-construction-java/src/main/java/org/apache/beam/runners/core/construction/graph/Networks.java>:128:21:
Name 'E' must match pattern '^(((T|K|V|W|X)[0-9]*)|([A-Z][a-z][a-zA-Z]*T))$'. [MethodTypeParameterName]
[ERROR] <https://builds.apache.org/job/beam_PostCommit_Java_ValidatesRunner_Flink/ws/src/runners/core-construction-java/src/main/java/org/apache/beam/runners/core/construction/graph/Networks.java>:147:18:
Name 'N' must match pattern '^(((T|K|V|W|X)[0-9]*)|([A-Z][a-z][a-zA-Z]*T))$'. [MethodTypeParameterName]
[ERROR] <https://builds.apache.org/job/beam_PostCommit_Java_ValidatesRunner_Flink/ws/src/runners/core-construction-java/src/main/java/org/apache/beam/runners/core/construction/graph/Networks.java>:147:21:
Name 'E' must match pattern '^(((T|K|V|W|X)[0-9]*)|([A-Z][a-z][a-zA-Z]*T))$'. [MethodTypeParameterName]
[ERROR] <https://builds.apache.org/job/beam_PostCommit_Java_ValidatesRunner_Flink/ws/src/runners/core-construction-java/src/main/java/org/apache/beam/runners/core/construction/graph/Networks.java>:182:18:
Name 'N' must match pattern '^(((T|K|V|W|X)[0-9]*)|([A-Z][a-z][a-zA-Z]*T))$'. [MethodTypeParameterName]
[ERROR] <https://builds.apache.org/job/beam_PostCommit_Java_ValidatesRunner_Flink/ws/src/runners/core-construction-java/src/main/java/org/apache/beam/runners/core/construction/graph/Networks.java>:182:21:
Name 'E' must match pattern '^(((T|K|V|W|X)[0-9]*)|([A-Z][a-z][a-zA-Z]*T))$'. [MethodTypeParameterName]
[ERROR] <https://builds.apache.org/job/beam_PostCommit_Java_ValidatesRunner_Flink/ws/src/runners/core-construction-java/src/main/java/org/apache/beam/runners/core/construction/graph/Networks.java>:219:18:
Name 'N' must match pattern '^(((T|K|V|W|X)[0-9]*)|([A-Z][a-z][a-zA-Z]*T))$'. [MethodTypeParameterName]
[ERROR] <https://builds.apache.org/job/beam_PostCommit_Java_ValidatesRunner_Flink/ws/src/runners/core-construction-java/src/main/java/org/apache/beam/runners/core/construction/graph/Networks.java>:219:21:
Name 'E' must match pattern '^(((T|K|V|W|X)[0-9]*)|([A-Z][a-z][a-zA-Z]*T))$'. [MethodTypeParameterName]
Audit done.
2018-03-17T18:08:21.694 [INFO] There are 10 errors reported by Checkstyle 8.7 with beam/checkstyle.xml
ruleset.
2018-03-17T18:08:21.696 [ERROR] src/main/java/org/apache/beam/runners/core/construction/graph/Networks.java:[77,18]
(naming) MethodTypeParameterName: Name 'N' must match pattern '^(((T|K|V|W|X)[0-9]*)|([A-Z][a-z][a-zA-Z]*T))$'.
2018-03-17T18:08:21.696 [ERROR] src/main/java/org/apache/beam/runners/core/construction/graph/Networks.java:[77,21]
(naming) MethodTypeParameterName: Name 'E' must match pattern '^(((T|K|V|W|X)[0-9]*)|([A-Z][a-z][a-zA-Z]*T))$'.
2018-03-17T18:08:21.696 [ERROR] src/main/java/org/apache/beam/runners/core/construction/graph/Networks.java:[128,18]
(naming) MethodTypeParameterName: Name 'N' must match pattern '^(((T|K|V|W|X)[0-9]*)|([A-Z][a-z][a-zA-Z]*T))$'.
2018-03-17T18:08:21.696 [ERROR] src/main/java/org/apache/beam/runners/core/construction/graph/Networks.java:[128,21]
(naming) MethodTypeParameterName: Name 'E' must match pattern '^(((T|K|V|W|X)[0-9]*)|([A-Z][a-z][a-zA-Z]*T))$'.
2018-03-17T18:08:21.696 [ERROR] src/main/java/org/apache/beam/runners/core/construction/graph/Networks.java:[147,18]
(naming) MethodTypeParameterName: Name 'N' must match pattern '^(((T|K|V|W|X)[0-9]*)|([A-Z][a-z][a-zA-Z]*T))$'.
2018-03-17T18:08:21.696 [ERROR] src/main/java/org/apache/beam/runners/core/construction/graph/Networks.java:[147,21]
(naming) MethodTypeParameterName: Name 'E' must match pattern '^(((T|K|V|W|X)[0-9]*)|([A-Z][a-z][a-zA-Z]*T))$'.
2018-03-17T18:08:21.696 [ERROR] src/main/java/org/apache/beam/runners/core/construction/graph/Networks.java:[182,18]
(naming) MethodTypeParameterName: Name 'N' must match pattern '^(((T|K|V|W|X)[0-9]*)|([A-Z][a-z][a-zA-Z]*T))$'.
2018-03-17T18:08:21.696 [ERROR] src/main/java/org/apache/beam/runners/core/construction/graph/Networks.java:[182,21]
(naming) MethodTypeParameterName: Name 'E' must match pattern '^(((T|K|V|W|X)[0-9]*)|([A-Z][a-z][a-zA-Z]*T))$'.
2018-03-17T18:08:21.696 [ERROR] src/main/java/org/apache/beam/runners/core/construction/graph/Networks.java:[219,18]
(naming) MethodTypeParameterName: Name 'N' must match pattern '^(((T|K|V|W|X)[0-9]*)|([A-Z][a-z][a-zA-Z]*T))$'.
2018-03-17T18:08:21.696 [ERROR] src/main/java/org/apache/beam/runners/core/construction/graph/Networks.java:[219,21]
(naming) MethodTypeParameterName: Name 'E' must match pattern '^(((T|K|V|W|X)[0-9]*)|([A-Z][a-z][a-zA-Z]*T))$'.
[JENKINS] Archiving disabled
[JENKINS] Archiving disabled
[JENKINS] Archiving disabled
[JENKINS] Archiving disabled
[JENKINS] Archiving disabled
[JENKINS] Archiving disabled
[JENKINS] Archiving disabled
[JENKINS] Archiving disabled
[JENKINS] Archiving disabled
[JENKINS] Archiving disabled
[JENKINS] Archiving disabled
[JENKINS] Archiving disabled
[JENKINS] Archiving disabled
[JENKINS] Archiving disabled
[JENKINS] Archiving disabled
[JENKINS] Archiving disabled
[JENKINS] Archiving disabled
[JENKINS] Archiving disabled
[JENKINS] Archiving disabled
[JENKINS] Archiving disabled
[JENKINS] Archiving disabled
2018-03-17T18:08:35.329 [INFO] ------------------------------------------------------------------------
2018-03-17T18:08:35.329 [INFO] Reactor Summary:
2018-03-17T18:08:35.329 [INFO] 
2018-03-17T18:08:35.330 [INFO] Apache Beam :: Parent .............................. SUCCESS
[ 12.817 s]
2018-03-17T18:08:35.330 [INFO] Apache Beam :: SDKs :: Java :: Build Tools ......... SUCCESS
[ 11.690 s]
2018-03-17T18:08:35.330 [INFO] Apache Beam :: Model ............................... SUCCESS
[  2.113 s]
2018-03-17T18:08:35.330 [INFO] Apache Beam :: Model :: Pipeline ................... SUCCESS
[ 11.907 s]
2018-03-17T18:08:35.330 [INFO] Apache Beam :: Model :: Job Management ............. SUCCESS
[  7.851 s]
2018-03-17T18:08:35.330 [INFO] Apache Beam :: Model :: Fn Execution ............... SUCCESS
[  7.879 s]
2018-03-17T18:08:35.330 [INFO] Apache Beam :: SDKs ................................ SUCCESS
[  2.679 s]
2018-03-17T18:08:35.330 [INFO] Apache Beam :: SDKs :: Java ........................ SUCCESS
[  2.073 s]
2018-03-17T18:08:35.330 [INFO] Apache Beam :: SDKs :: Java :: Core ................ SUCCESS
[02:22 min]
2018-03-17T18:08:35.330 [INFO] Apache Beam :: SDKs :: Java :: Extensions .......... SUCCESS
[  2.427 s]
2018-03-17T18:08:35.330 [INFO] Apache Beam :: SDKs :: Java :: Extensions :: Google Cloud Platform
Core SUCCESS [ 14.836 s]
2018-03-17T18:08:35.330 [INFO] Apache Beam :: Runners ............................. SUCCESS
[  4.204 s]
2018-03-17T18:08:35.330 [INFO] Apache Beam :: Runners :: Core Construction Java ... FAILURE
[  7.245 s]
2018-03-17T18:08:35.330 [INFO] Apache Beam :: Runners :: Core Java ................ SKIPPED
2018-03-17T18:08:35.330 [INFO] Apache Beam :: SDKs :: Java :: IO .................. SKIPPED
2018-03-17T18:08:35.330 [INFO] Apache Beam :: Runners :: Local Java Core .......... SKIPPED
2018-03-17T18:08:35.330 [INFO] Apache Beam :: Runners :: Direct Java .............. SKIPPED
2018-03-17T18:08:35.330 [INFO] Apache Beam :: SDKs :: Java :: Extensions :: Protobuf SKIPPED
2018-03-17T18:08:35.330 [INFO] Apache Beam :: SDKs :: Java :: IO :: Google Cloud Platform
SKIPPED
2018-03-17T18:08:35.330 [INFO] Apache Beam :: Runners :: Flink .................... SKIPPED
2018-03-17T18:08:35.330 [INFO] ------------------------------------------------------------------------
2018-03-17T18:08:35.330 [INFO] BUILD FAILURE
2018-03-17T18:08:35.330 [INFO] ------------------------------------------------------------------------
2018-03-17T18:08:35.330 [INFO] Total time: 05:55 min
2018-03-17T18:08:35.330 [INFO] Finished at: 2018-03-17T18:08:35Z
2018-03-17T18:08:35.842 [INFO] Final Memory: 121M/1482M
2018-03-17T18:08:35.842 [INFO] ------------------------------------------------------------------------
Waiting for Jenkins to finish collecting data
2018-03-17T18:08:37.915 [ERROR] Failed to execute goal org.apache.maven.plugins:maven-checkstyle-plugin:3.0.0:check
(default) on project beam-runners-core-construction-java: You have 10 Checkstyle violations.
-> [Help 1]
org.apache.maven.lifecycle.LifecycleExecutionException: Failed to execute goal org.apache.maven.plugins:maven-checkstyle-plugin:3.0.0:check
(default) on project beam-runners-core-construction-java: You have 10 Checkstyle violations.
    at org.apache.maven.lifecycle.internal.MojoExecutor.execute (MojoExecutor.java:213)
    at org.apache.maven.lifecycle.internal.MojoExecutor.execute (MojoExecutor.java:154)
    at org.apache.maven.lifecycle.internal.MojoExecutor.execute (MojoExecutor.java:146)
    at org.apache.maven.lifecycle.internal.LifecycleModuleBuilder.buildProject (LifecycleModuleBuilder.java:117)
    at org.apache.maven.lifecycle.internal.LifecycleModuleBuilder.buildProject (LifecycleModuleBuilder.java:81)
    at org.apache.maven.lifecycle.internal.builder.singlethreaded.SingleThreadedBuilder.build
(SingleThreadedBuilder.java:51)
    at org.apache.maven.lifecycle.internal.LifecycleStarter.execute (LifecycleStarter.java:128)
    at org.apache.maven.DefaultMaven.doExecute (DefaultMaven.java:309)
    at org.apache.maven.DefaultMaven.doExecute (DefaultMaven.java:194)
    at org.apache.maven.DefaultMaven.execute (DefaultMaven.java:107)
    at org.jvnet.hudson.maven3.launcher.Maven35Launcher.main (Maven35Launcher.java:130)
    at sun.reflect.NativeMethodAccessorImpl.invoke0 (Native Method)
    at sun.reflect.NativeMethodAccessorImpl.invoke (NativeMethodAccessorImpl.java:62)
    at sun.reflect.DelegatingMethodAccessorImpl.invoke (DelegatingMethodAccessorImpl.java:43)
    at java.lang.reflect.Method.invoke (Method.java:498)
    at org.codehaus.plexus.classworlds.launcher.Launcher.launchEnhanced (Launcher.java:289)
    at org.codehaus.plexus.classworlds.launcher.Launcher.launch (Launcher.java:229)
    at jenkins.maven3.agent.Maven35Main.launch (Maven35Main.java:176)
    at sun.reflect.NativeMethodAccessorImpl.invoke0 (Native Method)
    at sun.reflect.NativeMethodAccessorImpl.invoke (NativeMethodAccessorImpl.java:62)
    at sun.reflect.DelegatingMethodAccessorImpl.invoke (DelegatingMethodAccessorImpl.java:43)
    at java.lang.reflect.Method.invoke (Method.java:498)
    at hudson.maven.Maven3Builder.call (Maven3Builder.java:139)
    at hudson.maven.Maven3Builder.call (Maven3Builder.java:70)
    at hudson.remoting.UserRequest.perform (UserRequest.java:207)
    at hudson.remoting.UserRequest.perform (UserRequest.java:53)
    at hudson.remoting.Request$2.run (Request.java:358)
    at hudson.remoting.InterceptingExecutorService$1.call (InterceptingExecutorService.java:72)
    at java.util.concurrent.FutureTask.run (FutureTask.java:266)
    at java.util.concurrent.ThreadPoolExecutor.runWorker (ThreadPoolExecutor.java:1149)
    at java.util.concurrent.ThreadPoolExecutor$Worker.run (ThreadPoolExecutor.java:624)
    at java.lang.Thread.run (Thread.java:748)
Caused by: org.apache.maven.plugin.MojoFailureException: You have 10 Checkstyle violations.
    at org.apache.maven.plugins.checkstyle.CheckstyleViolationCheckMojo.execute (CheckstyleViolationCheckMojo.java:576)
    at org.apache.maven.plugin.DefaultBuildPluginManager.executeMojo (DefaultBuildPluginManager.java:134)
    at org.apache.maven.lifecycle.internal.MojoExecutor.execute (MojoExecutor.java:208)
    at org.apache.maven.lifecycle.internal.MojoExecutor.execute (MojoExecutor.java:154)
    at org.apache.maven.lifecycle.internal.MojoExecutor.execute (MojoExecutor.java:146)
    at org.apache.maven.lifecycle.internal.LifecycleModuleBuilder.buildProject (LifecycleModuleBuilder.java:117)
    at org.apache.maven.lifecycle.internal.LifecycleModuleBuilder.buildProject (LifecycleModuleBuilder.java:81)
    at org.apache.maven.lifecycle.internal.builder.singlethreaded.SingleThreadedBuilder.build
(SingleThreadedBuilder.java:51)
    at org.apache.maven.lifecycle.internal.LifecycleStarter.execute (LifecycleStarter.java:128)
    at org.apache.maven.DefaultMaven.doExecute (DefaultMaven.java:309)
    at org.apache.maven.DefaultMaven.doExecute (DefaultMaven.java:194)
    at org.apache.maven.DefaultMaven.execute (DefaultMaven.java:107)
    at org.jvnet.hudson.maven3.launcher.Maven35Launcher.main (Maven35Launcher.java:130)
    at sun.reflect.NativeMethodAccessorImpl.invoke0 (Native Method)
    at sun.reflect.NativeMethodAccessorImpl.invoke (NativeMethodAccessorImpl.java:62)
    at sun.reflect.DelegatingMethodAccessorImpl.invoke (DelegatingMethodAccessorImpl.java:43)
    at java.lang.reflect.Method.invoke (Method.java:498)
    at org.codehaus.plexus.classworlds.launcher.Launcher.launchEnhanced (Launcher.java:289)
    at org.codehaus.plexus.classworlds.launcher.Launcher.launch (Launcher.java:229)
    at jenkins.maven3.agent.Maven35Main.launch (Maven35Main.java:176)
    at sun.reflect.NativeMethodAccessorImpl.invoke0 (Native Method)
    at sun.reflect.NativeMethodAccessorImpl.invoke (NativeMethodAccessorImpl.java:62)
    at sun.reflect.DelegatingMethodAccessorImpl.invoke (DelegatingMethodAccessorImpl.java:43)
    at java.lang.reflect.Method.invoke (Method.java:498)
    at hudson.maven.Maven3Builder.call (Maven3Builder.java:139)
    at hudson.maven.Maven3Builder.call (Maven3Builder.java:70)
    at hudson.remoting.UserRequest.perform (UserRequest.java:207)
    at hudson.remoting.UserRequest.perform (UserRequest.java:53)
    at hudson.remoting.Request$2.run (Request.java:358)
    at hudson.remoting.InterceptingExecutorService$1.call (InterceptingExecutorService.java:72)
    at java.util.concurrent.FutureTask.run (FutureTask.java:266)
    at java.util.concurrent.ThreadPoolExecutor.runWorker (ThreadPoolExecutor.java:1149)
    at java.util.concurrent.ThreadPoolExecutor$Worker.run (ThreadPoolExecutor.java:624)
    at java.lang.Thread.run (Thread.java:748)
2018-03-17T18:08:37.917 [ERROR] 
2018-03-17T18:08:37.917 [ERROR] Re-run Maven using the -X switch to enable full debug logging.
2018-03-17T18:08:37.917 [ERROR] 
2018-03-17T18:08:37.917 [ERROR] For more information about the errors and possible solutions,
please read the following articles:
2018-03-17T18:08:37.918 [ERROR] [Help 1] http://cwiki.apache.org/confluence/display/MAVEN/MojoFailureException
2018-03-17T18:08:37.918 [ERROR] 
2018-03-17T18:08:37.918 [ERROR] After correcting the problems, you can resume the build with
the command
2018-03-17T18:08:37.918 [ERROR]   mvn <goals> -rf :beam-runners-core-construction-java
channel stopped
Not sending mail to unregistered user herohde@google.com

Mime
View raw message