beam-commits mailing list archives

Site index · List index
Message view « Date » · « Thread »
Top « Date » · « Thread »
From Apache Jenkins Server <jenk...@builds.apache.org>
Subject Build failed in Jenkins: beam_PostCommit_Python_Verify #4526
Date Wed, 28 Mar 2018 21:57:10 GMT
See <https://builds.apache.org/job/beam_PostCommit_Python_Verify/4526/display/redirect>

------------------------------------------
[...truncated 260.89 KB...]
Creating file target/docs/source/apache_beam.io.gcp.pubsub.rst.
Creating file target/docs/source/apache_beam.io.gcp.rst.
Creating file target/docs/source/apache_beam.io.gcp.datastore.rst.
Creating file target/docs/source/apache_beam.io.gcp.datastore.v1.adaptive_throttler.rst.
Creating file target/docs/source/apache_beam.io.gcp.datastore.v1.datastoreio.rst.
Creating file target/docs/source/apache_beam.io.gcp.datastore.v1.fake_datastore.rst.
Creating file target/docs/source/apache_beam.io.gcp.datastore.v1.helper.rst.
Creating file target/docs/source/apache_beam.io.gcp.datastore.v1.query_splitter.rst.
Creating file target/docs/source/apache_beam.io.gcp.datastore.v1.util.rst.
Creating file target/docs/source/apache_beam.io.gcp.datastore.v1.rst.
Creating file target/docs/source/apache_beam.metrics.cells.rst.
Creating file target/docs/source/apache_beam.metrics.metric.rst.
Creating file target/docs/source/apache_beam.metrics.metricbase.rst.
Creating file target/docs/source/apache_beam.metrics.rst.
Creating file target/docs/source/apache_beam.options.pipeline_options.rst.
Creating file target/docs/source/apache_beam.options.pipeline_options_validator.rst.
Creating file target/docs/source/apache_beam.options.value_provider.rst.
Creating file target/docs/source/apache_beam.options.rst.
Creating file target/docs/source/apache_beam.portability.common_urns.rst.
Creating file target/docs/source/apache_beam.portability.python_urns.rst.
Creating file target/docs/source/apache_beam.portability.rst.
Creating file target/docs/source/apache_beam.portability.api.beam_artifact_api_pb2_grpc.rst.
Creating file target/docs/source/apache_beam.portability.api.beam_fn_api_pb2_grpc.rst.
Creating file target/docs/source/apache_beam.portability.api.beam_job_api_pb2_grpc.rst.
Creating file target/docs/source/apache_beam.portability.api.beam_provision_api_pb2_grpc.rst.
Creating file target/docs/source/apache_beam.portability.api.beam_runner_api_pb2_grpc.rst.
Creating file target/docs/source/apache_beam.portability.api.endpoints_pb2_grpc.rst.
Creating file target/docs/source/apache_beam.portability.api.standard_window_fns_pb2_grpc.rst.
Creating file target/docs/source/apache_beam.portability.api.rst.
Creating file target/docs/source/apache_beam.runners.pipeline_context.rst.
Creating file target/docs/source/apache_beam.runners.runner.rst.
Creating file target/docs/source/apache_beam.runners.sdf_common.rst.
Creating file target/docs/source/apache_beam.runners.rst.
Creating file target/docs/source/apache_beam.runners.dataflow.dataflow_metrics.rst.
Creating file target/docs/source/apache_beam.runners.dataflow.dataflow_runner.rst.
Creating file target/docs/source/apache_beam.runners.dataflow.ptransform_overrides.rst.
Creating file target/docs/source/apache_beam.runners.dataflow.test_dataflow_runner.rst.
Creating file target/docs/source/apache_beam.runners.dataflow.rst.
Creating file target/docs/source/apache_beam.runners.dataflow.native_io.iobase.rst.
Creating file target/docs/source/apache_beam.runners.dataflow.native_io.streaming_create.rst.
Creating file target/docs/source/apache_beam.runners.dataflow.native_io.rst.
Creating file target/docs/source/apache_beam.runners.direct.bundle_factory.rst.
Creating file target/docs/source/apache_beam.runners.direct.clock.rst.
Creating file target/docs/source/apache_beam.runners.direct.consumer_tracking_pipeline_visitor.rst.
Creating file target/docs/source/apache_beam.runners.direct.direct_metrics.rst.
Creating file target/docs/source/apache_beam.runners.direct.direct_runner.rst.
Creating file target/docs/source/apache_beam.runners.direct.evaluation_context.rst.
Creating file target/docs/source/apache_beam.runners.direct.executor.rst.
Creating file target/docs/source/apache_beam.runners.direct.helper_transforms.rst.
Creating file target/docs/source/apache_beam.runners.direct.sdf_direct_runner.rst.
Creating file target/docs/source/apache_beam.runners.direct.transform_evaluator.rst.
Creating file target/docs/source/apache_beam.runners.direct.util.rst.
Creating file target/docs/source/apache_beam.runners.direct.watermark_manager.rst.
Creating file target/docs/source/apache_beam.runners.direct.rst.
Creating file target/docs/source/apache_beam.runners.experimental.rst.
Creating file target/docs/source/apache_beam.runners.experimental.python_rpc_direct.python_rpc_direct_runner.rst.
Creating file target/docs/source/apache_beam.runners.experimental.python_rpc_direct.server.rst.
Creating file target/docs/source/apache_beam.runners.experimental.python_rpc_direct.rst.
Creating file target/docs/source/apache_beam.runners.job.manager.rst.
Creating file target/docs/source/apache_beam.runners.job.utils.rst.
Creating file target/docs/source/apache_beam.runners.job.rst.
Creating file target/docs/source/apache_beam.testing.pipeline_verifiers.rst.
Creating file target/docs/source/apache_beam.testing.test_pipeline.rst.
Creating file target/docs/source/apache_beam.testing.test_stream.rst.
Creating file target/docs/source/apache_beam.testing.test_utils.rst.
Creating file target/docs/source/apache_beam.testing.util.rst.
Creating file target/docs/source/apache_beam.testing.rst.
Creating file target/docs/source/apache_beam.tools.rst.
Creating file target/docs/source/apache_beam.transforms.combiners.rst.
Creating file target/docs/source/apache_beam.transforms.core.rst.
Creating file target/docs/source/apache_beam.transforms.display.rst.
Creating file target/docs/source/apache_beam.transforms.ptransform.rst.
Creating file target/docs/source/apache_beam.transforms.sideinputs.rst.
Creating file target/docs/source/apache_beam.transforms.timeutil.rst.
Creating file target/docs/source/apache_beam.transforms.trigger.rst.
Creating file target/docs/source/apache_beam.transforms.util.rst.
Creating file target/docs/source/apache_beam.transforms.window.rst.
Creating file target/docs/source/apache_beam.transforms.rst.
Creating file target/docs/source/apache_beam.typehints.decorators.rst.
Creating file target/docs/source/apache_beam.typehints.native_type_compatibility.rst.
Creating file target/docs/source/apache_beam.typehints.opcodes.rst.
Creating file target/docs/source/apache_beam.typehints.trivial_inference.rst.
Creating file target/docs/source/apache_beam.typehints.typecheck.rst.
Creating file target/docs/source/apache_beam.typehints.typehints.rst.
Creating file target/docs/source/apache_beam.typehints.rst.
Creating file target/docs/source/apache_beam.utils.annotations.rst.
Creating file target/docs/source/apache_beam.utils.plugin.rst.
Creating file target/docs/source/apache_beam.utils.processes.rst.
Creating file target/docs/source/apache_beam.utils.profiler.rst.
Creating file target/docs/source/apache_beam.utils.proto_utils.rst.
Creating file target/docs/source/apache_beam.utils.retry.rst.
Creating file target/docs/source/apache_beam.utils.timestamp.rst.
Creating file target/docs/source/apache_beam.utils.urns.rst.
Creating file target/docs/source/apache_beam.utils.rst.
<https://builds.apache.org/job/beam_PostCommit_Python_Verify/ws/src/sdks/python/target/.tox/docs/local/lib/python2.7/site-packages/sphinx/util/requests.py>:64:
UserWarning: Some links may return broken results due to being unable to check the Server
Name Indication (SNI) in the returned SSL cert against the hostname in the url requested.
Recommended to install "requests[security]" as a dependency or upgrade to a python version
with SNI support (Python 3 and Python 2.7.9+).
  'Some links may return broken results due to being unable to '
<https://builds.apache.org/job/beam_PostCommit_Python_Verify/ws/src/sdks/python/target/.tox/docs/local/lib/python2.7/site-packages/urllib3/util/ssl_.py>:339:
SNIMissingWarning: An HTTPS request has been made, but the SNI (Subject Name Indication) extension
to TLS is not available on this platform. This may cause the server to present an incorrect
TLS certificate, which can cause validation failures. You can upgrade to a newer version of
Python to solve this. For more information, see https://urllib3.readthedocs.io/en/latest/advanced-usage.html#ssl-warnings
  SNIMissingWarning
<https://builds.apache.org/job/beam_PostCommit_Python_Verify/ws/src/sdks/python/target/docs/source/apache_beam.io.gcp.gcsfilesystem.rst>:4:
WARNING: autodoc: failed to import module u'apache_beam.io.gcp.gcsfilesystem'; the following
exception was raised:
Traceback (most recent call last):
  File "<https://builds.apache.org/job/beam_PostCommit_Python_Verify/ws/src/sdks/python/target/.tox/docs/local/lib/python2.7/site-packages/sphinx/ext/autodoc.py",>
line 658, in import_object
    __import__(self.modname)
  File "<https://builds.apache.org/job/beam_PostCommit_Python_Verify/ws/src/sdks/python/apache_beam/io/gcp/gcsfilesystem.py",>
line 27, in <module>
    from apache_beam.io.gcp import gcsio
  File "<https://builds.apache.org/job/beam_PostCommit_Python_Verify/ws/src/sdks/python/apache_beam/io/gcp/gcsio.py",>
line 59, in <module>
    'Google Cloud Storage I/O not supported for this execution environment '
ImportError: Google Cloud Storage I/O not supported for this execution environment (could
not import storage API client).
<https://builds.apache.org/job/beam_PostCommit_Python_Verify/ws/src/sdks/python/target/docs/source/apache_beam.io.gcp.gcsio.rst>:4:
WARNING: autodoc: failed to import module u'apache_beam.io.gcp.gcsio'; the following exception
was raised:
Traceback (most recent call last):
  File "<https://builds.apache.org/job/beam_PostCommit_Python_Verify/ws/src/sdks/python/target/.tox/docs/local/lib/python2.7/site-packages/sphinx/ext/autodoc.py",>
line 658, in import_object
    __import__(self.modname)
  File "<https://builds.apache.org/job/beam_PostCommit_Python_Verify/ws/src/sdks/python/apache_beam/io/gcp/gcsio.py",>
line 59, in <module>
    'Google Cloud Storage I/O not supported for this execution environment '
ImportError: Google Cloud Storage I/O not supported for this execution environment (could
not import storage API client).
<https://builds.apache.org/job/beam_PostCommit_Python_Verify/ws/src/sdks/python/target/docs/source/apache_beam.testing.pipeline_verifiers.rst>:4:
WARNING: autodoc: failed to import module u'apache_beam.testing.pipeline_verifiers'; the following
exception was raised:
Traceback (most recent call last):
  File "<https://builds.apache.org/job/beam_PostCommit_Python_Verify/ws/src/sdks/python/target/.tox/docs/local/lib/python2.7/site-packages/sphinx/ext/autodoc.py",>
line 658, in import_object
    __import__(self.modname)
  File "<https://builds.apache.org/job/beam_PostCommit_Python_Verify/ws/src/sdks/python/apache_beam/testing/pipeline_verifiers.py",>
line 28, in <module>
    from hamcrest.core.base_matcher import BaseMatcher
ImportError: No module named hamcrest.core.base_matcher
<https://builds.apache.org/job/beam_PostCommit_Python_Verify/ws/src/sdks/python/target/docs/source/apache_beam.testing.test_pipeline.rst>:4:
WARNING: autodoc: failed to import module u'apache_beam.testing.test_pipeline'; the following
exception was raised:
Traceback (most recent call last):
  File "<https://builds.apache.org/job/beam_PostCommit_Python_Verify/ws/src/sdks/python/target/.tox/docs/local/lib/python2.7/site-packages/sphinx/ext/autodoc.py",>
line 658, in import_object
    __import__(self.modname)
  File "<https://builds.apache.org/job/beam_PostCommit_Python_Verify/ws/src/sdks/python/apache_beam/testing/test_pipeline.py",>
line 23, in <module>
    from nose.plugins.skip import SkipTest
ImportError: No module named nose.plugins.skip
Command exited with non-zero status 1
50.44user 2.17system 0:24.52elapsed 214%CPU (0avgtext+0avgdata 153268maxresident)k
568inputs+40808outputs (3major+506259minor)pagefaults 0swaps
ERROR: InvocationError: '/usr/bin/time <https://builds.apache.org/job/beam_PostCommit_Python_Verify/ws/src/sdks/python/generate_pydoc.sh'>
py27 create: <https://builds.apache.org/job/beam_PostCommit_Python_Verify/ws/src/sdks/python/target/.tox/py27>
py27 inst: <https://builds.apache.org/job/beam_PostCommit_Python_Verify/ws/src/sdks/python/target/.tox/dist/apache-beam-2.5.0.dev0.zip>
py27 installed: apache-beam==2.5.0.dev0,avro==1.8.2,certifi==2018.1.18,chardet==3.0.4,crcmod==1.7,dill==0.2.6,docopt==0.6.2,enum34==1.1.6,funcsigs==1.0.2,futures==3.2.0,grpcio==1.10.0,hdfs==2.1.0,httplib2==0.9.2,idna==2.6,mock==2.0.0,oauth2client==4.1.2,pbr==4.0.0,protobuf==3.5.2.post1,pyasn1==0.4.2,pyasn1-modules==0.2.1,pytz==2018.3,PyVCF==0.6.8,PyYAML==3.12,requests==2.18.4,rsa==3.4.2,six==1.11.0,typing==3.6.4,urllib3==1.22
py27 runtests: PYTHONHASHSEED='2480455699'
py27 runtests: commands[0] | python --version
Python 2.7.6
py27 runtests: commands[1] | pip --version
pip 9.0.3 from <https://builds.apache.org/job/beam_PostCommit_Python_Verify/ws/src/sdks/python/target/.tox/py27/local/lib/python2.7/site-packages>
(python 2.7)
py27 runtests: commands[2] | <https://builds.apache.org/job/beam_PostCommit_Python_Verify/ws/src/sdks/python/run_tox_cleanup.sh>
py27 runtests: commands[3] | python apache_beam/examples/complete/autocomplete_test.py
Traceback (most recent call last):
  File "apache_beam/examples/complete/autocomplete_test.py", line 24, in <module>
    from apache_beam.testing.test_pipeline import TestPipeline
  File "<https://builds.apache.org/job/beam_PostCommit_Python_Verify/ws/src/sdks/python/target/.tox/py27/local/lib/python2.7/site-packages/apache_beam/testing/test_pipeline.py",>
line 23, in <module>
    from nose.plugins.skip import SkipTest
ImportError: No module named nose.plugins.skip
ERROR: InvocationError: '<https://builds.apache.org/job/beam_PostCommit_Python_Verify/ws/src/sdks/python/target/.tox/py27/bin/python>
apache_beam/examples/complete/autocomplete_test.py'
py27-cython2 create: <https://builds.apache.org/job/beam_PostCommit_Python_Verify/ws/src/sdks/python/target/.tox/py27-cython2>
py27-cython2 installdeps: cython==0.26.1
py27-cython2 inst: <https://builds.apache.org/job/beam_PostCommit_Python_Verify/ws/src/sdks/python/target/.tox/dist/apache-beam-2.5.0.dev0.zip>
py27-cython2 installed: apache-beam==2.5.0.dev0,avro==1.8.2,certifi==2018.1.18,chardet==3.0.4,crcmod==1.7,Cython==0.26.1,dill==0.2.6,docopt==0.6.2,enum34==1.1.6,funcsigs==1.0.2,futures==3.2.0,grpcio==1.10.0,hdfs==2.1.0,httplib2==0.9.2,idna==2.6,mock==2.0.0,oauth2client==4.1.2,pbr==4.0.0,protobuf==3.5.2.post1,pyasn1==0.4.2,pyasn1-modules==0.2.1,pytz==2018.3,PyVCF==0.6.8,PyYAML==3.12,requests==2.18.4,rsa==3.4.2,six==1.11.0,typing==3.6.4,urllib3==1.22
py27-cython2 runtests: PYTHONHASHSEED='2480455699'
py27-cython2 runtests: commands[0] | python --version
Python 2.7.6
py27-cython2 runtests: commands[1] | pip --version
pip 9.0.3 from <https://builds.apache.org/job/beam_PostCommit_Python_Verify/ws/src/sdks/python/target/.tox/py27-cython2/local/lib/python2.7/site-packages>
(python 2.7)
py27-cython2 runtests: commands[2] | <https://builds.apache.org/job/beam_PostCommit_Python_Verify/ws/src/sdks/python/run_tox_cleanup.sh>
py27-cython2 runtests: commands[3] | python apache_beam/examples/complete/autocomplete_test.py
Traceback (most recent call last):
  File "apache_beam/examples/complete/autocomplete_test.py", line 24, in <module>
    from apache_beam.testing.test_pipeline import TestPipeline
  File "<https://builds.apache.org/job/beam_PostCommit_Python_Verify/ws/src/sdks/python/target/.tox/py27-cython2/local/lib/python2.7/site-packages/apache_beam/testing/test_pipeline.py",>
line 23, in <module>
    from nose.plugins.skip import SkipTest
ImportError: No module named nose.plugins.skip
ERROR: InvocationError: '<https://builds.apache.org/job/beam_PostCommit_Python_Verify/ws/src/sdks/python/target/.tox/py27-cython2/bin/python>
apache_beam/examples/complete/autocomplete_test.py'
py27-gcp create: <https://builds.apache.org/job/beam_PostCommit_Python_Verify/ws/src/sdks/python/target/.tox/py27-gcp>
py27-gcp inst: <https://builds.apache.org/job/beam_PostCommit_Python_Verify/ws/src/sdks/python/target/.tox/dist/apache-beam-2.5.0.dev0.zip>
py27-gcp installed: apache-beam==2.5.0.dev0,avro==1.8.2,certifi==2018.1.18,chardet==3.0.4,crcmod==1.7,dill==0.2.6,docopt==0.6.2,enum34==1.1.6,funcsigs==1.0.2,futures==3.2.0,grpcio==1.10.0,hdfs==2.1.0,httplib2==0.9.2,idna==2.6,mock==2.0.0,oauth2client==4.1.2,pbr==4.0.0,protobuf==3.5.2.post1,pyasn1==0.4.2,pyasn1-modules==0.2.1,pytz==2018.3,PyVCF==0.6.8,PyYAML==3.12,requests==2.18.4,rsa==3.4.2,six==1.11.0,typing==3.6.4,urllib3==1.22
py27-gcp runtests: PYTHONHASHSEED='2480455699'
py27-gcp runtests: commands[0] | python --version
Python 2.7.6
py27-gcp runtests: commands[1] | pip --version
pip 9.0.3 from <https://builds.apache.org/job/beam_PostCommit_Python_Verify/ws/src/sdks/python/target/.tox/py27-gcp/local/lib/python2.7/site-packages>
(python 2.7)
py27-gcp runtests: commands[2] | <https://builds.apache.org/job/beam_PostCommit_Python_Verify/ws/src/sdks/python/run_tox_cleanup.sh>
py27-gcp runtests: commands[3] | python apache_beam/examples/complete/autocomplete_test.py
Traceback (most recent call last):
  File "apache_beam/examples/complete/autocomplete_test.py", line 24, in <module>
    from apache_beam.testing.test_pipeline import TestPipeline
  File "<https://builds.apache.org/job/beam_PostCommit_Python_Verify/ws/src/sdks/python/target/.tox/py27-gcp/local/lib/python2.7/site-packages/apache_beam/testing/test_pipeline.py",>
line 23, in <module>
    from nose.plugins.skip import SkipTest
ImportError: No module named nose.plugins.skip
ERROR: InvocationError: '<https://builds.apache.org/job/beam_PostCommit_Python_Verify/ws/src/sdks/python/target/.tox/py27-gcp/bin/python>
apache_beam/examples/complete/autocomplete_test.py'
py27-lint create: <https://builds.apache.org/job/beam_PostCommit_Python_Verify/ws/src/sdks/python/target/.tox/py27-lint>
py27-lint installdeps: pycodestyle==2.3.1, pylint==1.7.2, future==0.16.0, isort==4.2.15, flake8==3.5.0
py27-lint inst: <https://builds.apache.org/job/beam_PostCommit_Python_Verify/ws/src/sdks/python/target/.tox/dist/apache-beam-2.5.0.dev0.zip>
py27-lint installed: apache-beam==2.5.0.dev0,astroid==1.6.2,avro==1.8.2,backports.functools-lru-cache==1.5,certifi==2018.1.18,chardet==3.0.4,configparser==3.5.0,crcmod==1.7,dill==0.2.6,docopt==0.6.2,enum34==1.1.6,flake8==3.5.0,funcsigs==1.0.2,future==0.16.0,futures==3.2.0,grpcio==1.10.0,hdfs==2.1.0,httplib2==0.9.2,idna==2.6,isort==4.2.15,lazy-object-proxy==1.3.1,mccabe==0.6.1,mock==2.0.0,oauth2client==4.1.2,pbr==4.0.0,protobuf==3.5.2.post1,pyasn1==0.4.2,pyasn1-modules==0.2.1,pycodestyle==2.3.1,pyflakes==1.6.0,pylint==1.7.2,pytz==2018.3,PyVCF==0.6.8,PyYAML==3.12,requests==2.18.4,rsa==3.4.2,singledispatch==3.4.0.3,six==1.11.0,typing==3.6.4,urllib3==1.22,wrapt==1.10.11
py27-lint runtests: PYTHONHASHSEED='2480455699'
py27-lint runtests: commands[0] | python --version
Python 2.7.6
py27-lint runtests: commands[1] | pip --version
pip 9.0.3 from <https://builds.apache.org/job/beam_PostCommit_Python_Verify/ws/src/sdks/python/target/.tox/py27-lint/local/lib/python2.7/site-packages>
(python 2.7)
py27-lint runtests: commands[2] | time <https://builds.apache.org/job/beam_PostCommit_Python_Verify/ws/src/sdks/python/run_pylint.sh>
Skipping lint for generated files: bigquery_v2_client.py, bigquery_v2_messages.py, dataflow_v1b3_client.py,
dataflow_v1b3_messages.py, storage_v1_client.py, storage_v1_messages.py, proto2_coder_test_messages_pb2.py,
beam_artifact_api_pb2_grpc.py, beam_artifact_api_pb2.py, beam_fn_api_pb2_grpc.py, beam_fn_api_pb2.py,
beam_job_api_pb2_grpc.py, beam_job_api_pb2.py, beam_provision_api_pb2_grpc.py, beam_provision_api_pb2.py,
beam_runner_api_pb2_grpc.py, beam_runner_api_pb2.py, endpoints_pb2_grpc.py, endpoints_pb2.py,
standard_window_fns_pb2_grpc.py, standard_window_fns_pb2.py
Running pylint for module apache_beam:
************* Module apache_beam.typehints.typehints
C:1101, 0: Trailing newlines (trailing-newlines)

--------------------------------------------------------------------
Your code has been rated at 10.00/10 (previous run: 10.00/10, -0.00)

Command exited with non-zero status 16
309.72user 7.20system 1:37.40elapsed 325%CPU (0avgtext+0avgdata 243356maxresident)k
2272inputs+168outputs (0major+544768minor)pagefaults 0swaps
ERROR: InvocationError: '/usr/bin/time <https://builds.apache.org/job/beam_PostCommit_Python_Verify/ws/src/sdks/python/run_pylint.sh'>
py3-lint create: <https://builds.apache.org/job/beam_PostCommit_Python_Verify/ws/src/sdks/python/target/.tox/py3-lint>
py3-lint installdeps: pycodestyle==2.3.1, pylint==1.7.2, future==0.16.0, isort==4.2.15, flake8==3.5.0
py3-lint inst: <https://builds.apache.org/job/beam_PostCommit_Python_Verify/ws/src/sdks/python/target/.tox/dist/apache-beam-2.5.0.dev0.zip>
py3-lint installed: apache-beam==2.5.0.dev0,astroid==1.6.2,avro==1.8.2,backports.functools-lru-cache==1.5,certifi==2018.1.18,chardet==3.0.4,configparser==3.5.0,crcmod==1.7,dill==0.2.6,docopt==0.6.2,enum34==1.1.6,flake8==3.5.0,funcsigs==1.0.2,future==0.16.0,futures==3.2.0,grpcio==1.10.0,hdfs==2.1.0,httplib2==0.9.2,idna==2.6,isort==4.2.15,lazy-object-proxy==1.3.1,mccabe==0.6.1,mock==2.0.0,oauth2client==4.1.2,pbr==4.0.0,protobuf==3.5.2.post1,pyasn1==0.4.2,pyasn1-modules==0.2.1,pycodestyle==2.3.1,pyflakes==1.6.0,pylint==1.7.2,pytz==2018.3,PyVCF==0.6.8,PyYAML==3.12,requests==2.18.4,rsa==3.4.2,singledispatch==3.4.0.3,six==1.11.0,typing==3.6.4,urllib3==1.22,wrapt==1.10.11
py3-lint runtests: PYTHONHASHSEED='2480455699'
py3-lint runtests: commands[0] | python --version
Python 2.7.6
py3-lint runtests: commands[1] | pip --version
pip 9.0.3 from <https://builds.apache.org/job/beam_PostCommit_Python_Verify/ws/src/sdks/python/target/.tox/py3-lint/local/lib/python2.7/site-packages>
(python 2.7)
py3-lint runtests: commands[2] | time <https://builds.apache.org/job/beam_PostCommit_Python_Verify/ws/src/sdks/python/run_mini_py3lint.sh>
Running flake8 for module apache_beam:
0
39.34user 0.36system 0:26.03elapsed 152%CPU (0avgtext+0avgdata 68332maxresident)k
56inputs+0outputs (0major+89405minor)pagefaults 0swaps
___________________________________ summary ____________________________________
  cover: commands succeeded
ERROR:   docs: commands failed
ERROR:   py27: commands failed
ERROR:   py27-cython2: commands failed
ERROR:   py27-gcp: commands failed
ERROR:   py27-lint: commands failed
  py3-lint: commands succeeded
Build step 'Execute shell' marked build as failure
Not sending mail to unregistered user grzegorz.kolakowski@getindata.com
Not sending mail to unregistered user aljoscha.krettek@gmail.com
Not sending mail to unregistered user mairbek@google.com
Not sending mail to unregistered user szewinho@gmail.com
Not sending mail to unregistered user wcn@google.com
Not sending mail to unregistered user aaltay@gmail.com
Not sending mail to unregistered user andreas.ehrencrona@velik.it
Not sending mail to unregistered user ankurgoenka@gmail.com
Not sending mail to unregistered user ccy@google.com
Not sending mail to unregistered user ehudm@google.com
Not sending mail to unregistered user boyuanz@google.com
Not sending mail to unregistered user markliu@google.com
Not sending mail to unregistered user aromanenko.dev@gmail.com
Not sending mail to unregistered user XuMingmin@users.noreply.github.com
Not sending mail to unregistered user dawid@getindata.com
Not sending mail to unregistered user github@alasdairhodge.co.uk
Not sending mail to unregistered user herohde@google.com
Not sending mail to unregistered user jb@nanthrax.net
Not sending mail to unregistered user mariand@google.com
Not sending mail to unregistered user rober@frantil.com

Mime
View raw message