beam-commits mailing list archives

Site index · List index
Message view « Date » · « Thread »
Top « Date » · « Thread »
From Apache Jenkins Server <jenk...@builds.apache.org>
Subject Build failed in Jenkins: beam_PostCommit_Java_MavenInstall #6101
Date Fri, 02 Mar 2018 02:08:27 GMT
See <https://builds.apache.org/job/beam_PostCommit_Java_MavenInstall/6101/display/redirect>

------------------------------------------
[...truncated 1.33 MB...]
2018-03-02T02:06:47.170 [INFO] Excluding asm:asm:jar:3.1 from the shaded jar.
2018-03-02T02:06:47.170 [INFO] Excluding com.sun.jersey.contribs:jersey-guice:jar:1.9 from
the shaded jar.
2018-03-02T02:06:47.170 [INFO] Excluding jline:jline:jar:2.11 from the shaded jar.
2018-03-02T02:06:47.171 [INFO] Excluding org.apache.ant:ant:jar:1.9.2 from the shaded jar.
2018-03-02T02:06:47.171 [INFO] Excluding org.apache.ant:ant-launcher:jar:1.9.2 from the shaded
jar.
2018-03-02T02:06:47.171 [INFO] Excluding net.engio:mbassador:jar:1.1.9 from the shaded jar.
2018-03-02T02:06:47.171 [INFO] Excluding net.lingala.zip4j:zip4j:jar:1.3.2 from the shaded
jar.
2018-03-02T02:06:47.171 [INFO] Excluding commons-codec:commons-codec:jar:1.10 from the shaded
jar.
2018-03-02T02:06:47.171 [INFO] Excluding org.apache.xbean:xbean-asm5-shaded:jar:4.3 from the
shaded jar.
2018-03-02T02:06:47.171 [INFO] Excluding org.jctools:jctools-core:jar:1.1 from the shaded
jar.
2018-03-02T02:06:47.172 [INFO] Excluding org.apache.beam:beam-model-pipeline:jar:2.4.0-SNAPSHOT
from the shaded jar.
2018-03-02T02:06:47.172 [INFO] Excluding com.google.protobuf:protobuf-java:jar:3.2.0 from
the shaded jar.
2018-03-02T02:06:47.172 [INFO] Excluding org.apache.beam:beam-sdks-java-core:jar:2.4.0-SNAPSHOT
from the shaded jar.
2018-03-02T02:06:47.172 [INFO] Including com.google.guava:guava:jar:20.0 in the shaded jar.
2018-03-02T02:06:47.172 [INFO] Excluding com.github.stephenc.findbugs:findbugs-annotations:jar:1.3.9-1
from the shaded jar.
2018-03-02T02:06:47.173 [INFO] Excluding com.fasterxml.jackson.core:jackson-core:jar:2.8.9
from the shaded jar.
2018-03-02T02:06:47.173 [INFO] Excluding com.fasterxml.jackson.core:jackson-annotations:jar:2.8.9
from the shaded jar.
2018-03-02T02:06:47.173 [INFO] Excluding com.fasterxml.jackson.core:jackson-databind:jar:2.8.9
from the shaded jar.
2018-03-02T02:06:47.173 [INFO] Excluding net.bytebuddy:byte-buddy:jar:1.7.10 from the shaded
jar.
2018-03-02T02:06:47.173 [INFO] Excluding org.apache.avro:avro:jar:1.8.2 from the shaded jar.
2018-03-02T02:06:47.173 [INFO] Excluding com.thoughtworks.paranamer:paranamer:jar:2.7 from
the shaded jar.
2018-03-02T02:06:47.174 [INFO] Excluding org.tukaani:xz:jar:1.5 from the shaded jar.
2018-03-02T02:06:47.174 [INFO] Excluding org.xerial.snappy:snappy-java:jar:1.1.4 from the
shaded jar.
2018-03-02T02:06:47.174 [INFO] Excluding org.apache.commons:commons-compress:jar:1.14 from
the shaded jar.
2018-03-02T02:06:47.174 [INFO] Excluding org.apache.beam:beam-runners-core-construction-java:jar:2.4.0-SNAPSHOT
from the shaded jar.
2018-03-02T02:06:47.174 [INFO] Excluding org.apache.beam:beam-model-job-management:jar:2.4.0-SNAPSHOT
from the shaded jar.
2018-03-02T02:06:47.175 [INFO] Excluding com.google.protobuf:protobuf-java-util:jar:3.2.0
from the shaded jar.
2018-03-02T02:06:47.175 [INFO] Excluding com.google.code.gson:gson:jar:2.7 from the shaded
jar.
2018-03-02T02:06:47.175 [INFO] Excluding io.grpc:grpc-core:jar:1.2.0 from the shaded jar.
2018-03-02T02:06:47.175 [INFO] Excluding com.google.errorprone:error_prone_annotations:jar:2.0.15
from the shaded jar.
2018-03-02T02:06:47.175 [INFO] Excluding io.grpc:grpc-context:jar:1.2.0 from the shaded jar.
2018-03-02T02:06:47.175 [INFO] Excluding com.google.instrumentation:instrumentation-api:jar:0.3.0
from the shaded jar.
2018-03-02T02:06:47.176 [INFO] Excluding io.grpc:grpc-stub:jar:1.2.0 from the shaded jar.
2018-03-02T02:06:47.176 [INFO] Excluding org.apache.beam:beam-runners-core-java:jar:2.4.0-SNAPSHOT
from the shaded jar.
2018-03-02T02:06:47.176 [INFO] Excluding org.apache.beam:beam-model-fn-execution:jar:2.4.0-SNAPSHOT
from the shaded jar.
2018-03-02T02:06:47.176 [INFO] Excluding org.apache.commons:commons-lang3:jar:3.6 from the
shaded jar.
2018-03-02T02:06:47.176 [INFO] Excluding com.google.code.findbugs:jsr305:jar:3.0.1 from the
shaded jar.
2018-03-02T02:06:47.176 [INFO] Excluding org.objenesis:objenesis:jar:1.0 from the shaded jar.
2018-03-02T02:06:47.177 [INFO] Excluding com.google.auto.service:auto-service:jar:1.0-rc2
from the shaded jar.
2018-03-02T02:06:47.177 [INFO] Excluding com.google.auto:auto-common:jar:0.3 from the shaded
jar.
2018-03-02T02:06:47.177 [INFO] Excluding io.grpc:grpc-protobuf:jar:1.2.0 from the shaded jar.
2018-03-02T02:06:47.177 [INFO] Excluding io.grpc:grpc-protobuf-lite:jar:1.2.0 from the shaded
jar.
2018-03-02T02:06:50.482 [INFO] Replacing original artifact with shaded artifact.
2018-03-02T02:06:50.482 [INFO] Replacing <https://builds.apache.org/job/beam_PostCommit_Java_MavenInstall/ws/src/runners/apex/target/beam-runners-apex-2.4.0-SNAPSHOT.jar>
with <https://builds.apache.org/job/beam_PostCommit_Java_MavenInstall/ws/src/runners/apex/target/beam-runners-apex-2.4.0-SNAPSHOT-shaded.jar>
2018-03-02T02:06:50.483 [INFO] Replacing original test artifact with shaded test artifact.
2018-03-02T02:06:50.483 [INFO] Replacing <https://builds.apache.org/job/beam_PostCommit_Java_MavenInstall/ws/src/runners/apex/target/beam-runners-apex-2.4.0-SNAPSHOT-tests.jar>
with <https://builds.apache.org/job/beam_PostCommit_Java_MavenInstall/ws/src/runners/apex/target/beam-runners-apex-2.4.0-SNAPSHOT-shaded-tests.jar>
2018-03-02T02:06:50.690 [INFO] 
2018-03-02T02:06:50.690 [INFO] --- maven-assembly-plugin:3.1.0:single (source-release-assembly)
@ beam-runners-apex ---
2018-03-02T02:06:50.694 [INFO] Skipping the assembly in this project because it's not the
Execution Root
2018-03-02T02:06:50.962 [INFO] 
2018-03-02T02:06:50.962 [INFO] --- maven-source-plugin:3.0.1:jar-no-fork (attach-sources)
@ beam-runners-apex ---
2018-03-02T02:06:50.968 [INFO] Building jar: <https://builds.apache.org/job/beam_PostCommit_Java_MavenInstall/ws/src/runners/apex/target/beam-runners-apex-2.4.0-SNAPSHOT-sources.jar>
2018-03-02T02:06:51.163 [INFO] 
2018-03-02T02:06:51.163 [INFO] --- maven-source-plugin:3.0.1:test-jar-no-fork (attach-test-sources)
@ beam-runners-apex ---
2018-03-02T02:06:51.169 [INFO] Building jar: <https://builds.apache.org/job/beam_PostCommit_Java_MavenInstall/ws/src/runners/apex/target/beam-runners-apex-2.4.0-SNAPSHOT-test-sources.jar>
2018-03-02T02:06:51.320 [INFO] 
2018-03-02T02:06:51.320 [INFO] --- maven-javadoc-plugin:3.0.0-M1:jar (attach-javadocs) @ beam-runners-apex
---
2018-03-02T02:06:57.264 [INFO] 
2 warnings
2018-03-02T02:06:57.264 [WARNING] Javadoc Warnings
2018-03-02T02:06:57.264 [WARNING] <https://builds.apache.org/job/beam_PostCommit_Java_MavenInstall/ws/src/runners/apex/src/main/java/org/apache/beam/runners/apex/translation/utils/StateInternalsProxy.java>:33:
warning: no description for @param
2018-03-02T02:06:57.264 [WARNING] * @param <K>
2018-03-02T02:06:57.265 [WARNING] ^
2018-03-02T02:06:57.265 [WARNING] <https://builds.apache.org/job/beam_PostCommit_Java_MavenInstall/ws/src/runners/apex/src/main/java/org/apache/beam/runners/apex/translation/operators/ApexTimerInternals.java>:48:
warning: no description for @param
2018-03-02T02:06:57.265 [WARNING] * @param <K>
2018-03-02T02:06:57.265 [WARNING] ^
2018-03-02T02:06:57.278 [INFO] Building jar: <https://builds.apache.org/job/beam_PostCommit_Java_MavenInstall/ws/src/runners/apex/target/beam-runners-apex-2.4.0-SNAPSHOT-javadoc.jar>
2018-03-02T02:06:58.518 [INFO] 
2018-03-02T02:06:58.518 [INFO] --- reproducible-build-maven-plugin:0.4:strip-jar (default)
@ beam-runners-apex ---
2018-03-02T02:06:58.519 [INFO] Stripping <https://builds.apache.org/job/beam_PostCommit_Java_MavenInstall/ws/src/runners/apex/target/beam-runners-apex-2.4.0-SNAPSHOT-test-sources.jar>
2018-03-02T02:06:58.523 [INFO] Stripping <https://builds.apache.org/job/beam_PostCommit_Java_MavenInstall/ws/src/runners/apex/target/original-beam-runners-apex-2.4.0-SNAPSHOT-tests.jar>
2018-03-02T02:06:58.533 [INFO] Stripping <https://builds.apache.org/job/beam_PostCommit_Java_MavenInstall/ws/src/runners/apex/target/original-beam-runners-apex-2.4.0-SNAPSHOT.jar>
2018-03-02T02:06:58.550 [INFO] Stripping <https://builds.apache.org/job/beam_PostCommit_Java_MavenInstall/ws/src/runners/apex/target/beam-runners-apex-2.4.0-SNAPSHOT-javadoc.jar>
2018-03-02T02:06:58.560 [INFO] Stripping <https://builds.apache.org/job/beam_PostCommit_Java_MavenInstall/ws/src/runners/apex/target/beam-runners-apex-2.4.0-SNAPSHOT-sources.jar>
2018-03-02T02:06:58.577 [INFO] Stripping <https://builds.apache.org/job/beam_PostCommit_Java_MavenInstall/ws/src/runners/apex/target/beam-runners-apex-2.4.0-SNAPSHOT.jar>
2018-03-02T02:06:58.746 [INFO] Stripping <https://builds.apache.org/job/beam_PostCommit_Java_MavenInstall/ws/src/runners/apex/target/beam-runners-apex-2.4.0-SNAPSHOT-tests.jar>
2018-03-02T02:06:58.863 [INFO] 
2018-03-02T02:06:58.863 [INFO] --- maven-surefire-plugin:2.20.1:test (validates-runner-tests)
@ beam-runners-apex ---
2018-03-02T02:06:58.869 [INFO] Tests are skipped.
2018-03-02T02:06:58.978 [INFO] 
2018-03-02T02:06:58.978 [INFO] --- maven-dependency-plugin:3.0.2:analyze-only (default) @
beam-runners-apex ---
2018-03-02T02:06:59.299 [INFO] No dependency problems found
2018-03-02T02:06:59.409 [INFO] 
2018-03-02T02:06:59.409 [INFO] --- maven-install-plugin:2.5.2:install (default-install) @
beam-runners-apex ---
2018-03-02T02:06:59.410 [INFO] Installing <https://builds.apache.org/job/beam_PostCommit_Java_MavenInstall/ws/src/runners/apex/target/beam-runners-apex-2.4.0-SNAPSHOT.jar>
to <https://builds.apache.org/job/beam_PostCommit_Java_MavenInstall/ws/.repository/org/apache/beam/beam-runners-apex/2.4.0-SNAPSHOT/beam-runners-apex-2.4.0-SNAPSHOT.jar>
2018-03-02T02:06:59.439 [INFO] Installing <https://builds.apache.org/job/beam_PostCommit_Java_MavenInstall/ws/src/runners/apex/pom.xml>
to <https://builds.apache.org/job/beam_PostCommit_Java_MavenInstall/ws/.repository/org/apache/beam/beam-runners-apex/2.4.0-SNAPSHOT/beam-runners-apex-2.4.0-SNAPSHOT.pom>
2018-03-02T02:06:59.467 [INFO] Installing <https://builds.apache.org/job/beam_PostCommit_Java_MavenInstall/ws/src/runners/apex/target/beam-runners-apex-2.4.0-SNAPSHOT-tests.jar>
to <https://builds.apache.org/job/beam_PostCommit_Java_MavenInstall/ws/.repository/org/apache/beam/beam-runners-apex/2.4.0-SNAPSHOT/beam-runners-apex-2.4.0-SNAPSHOT-tests.jar>
2018-03-02T02:06:59.469 [INFO] Installing <https://builds.apache.org/job/beam_PostCommit_Java_MavenInstall/ws/src/runners/apex/target/beam-runners-apex-2.4.0-SNAPSHOT-tests.jar>
to <https://builds.apache.org/job/beam_PostCommit_Java_MavenInstall/ws/.repository/org/apache/beam/beam-runners-apex/2.4.0-SNAPSHOT/beam-runners-apex-2.4.0-SNAPSHOT-tests.jar>
2018-03-02T02:06:59.471 [INFO] Installing <https://builds.apache.org/job/beam_PostCommit_Java_MavenInstall/ws/src/runners/apex/target/beam-runners-apex-2.4.0-SNAPSHOT-sources.jar>
to <https://builds.apache.org/job/beam_PostCommit_Java_MavenInstall/ws/.repository/org/apache/beam/beam-runners-apex/2.4.0-SNAPSHOT/beam-runners-apex-2.4.0-SNAPSHOT-sources.jar>
2018-03-02T02:06:59.472 [INFO] Installing <https://builds.apache.org/job/beam_PostCommit_Java_MavenInstall/ws/src/runners/apex/target/beam-runners-apex-2.4.0-SNAPSHOT-test-sources.jar>
to <https://builds.apache.org/job/beam_PostCommit_Java_MavenInstall/ws/.repository/org/apache/beam/beam-runners-apex/2.4.0-SNAPSHOT/beam-runners-apex-2.4.0-SNAPSHOT-test-sources.jar>
2018-03-02T02:06:59.474 [INFO] Installing <https://builds.apache.org/job/beam_PostCommit_Java_MavenInstall/ws/src/runners/apex/target/beam-runners-apex-2.4.0-SNAPSHOT-javadoc.jar>
to <https://builds.apache.org/job/beam_PostCommit_Java_MavenInstall/ws/.repository/org/apache/beam/beam-runners-apex/2.4.0-SNAPSHOT/beam-runners-apex-2.4.0-SNAPSHOT-javadoc.jar>
[JENKINS] Archiving disabled
2018-03-02T02:07:01.256 [INFO] 
2018-03-02T02:07:01.256 [INFO] ------------------------------------------------------------------------
2018-03-02T02:07:01.256 [INFO] Skipping Apache Beam :: SDKs :: Java :: Aggregated Javadoc
2018-03-02T02:07:01.256 [INFO] This project has been banned from the build due to previous
failures.
2018-03-02T02:07:01.256 [INFO] ------------------------------------------------------------------------
[JENKINS] Archiving disabled
[JENKINS] Archiving disabled
[JENKINS] Archiving disabled
[JENKINS] Archiving disabled
[JENKINS] Archiving disabled
[JENKINS] Archiving disabled
[JENKINS] Archiving disabled
[JENKINS] Archiving disabled
[JENKINS] Archiving disabled
[JENKINS] Archiving disabled
[JENKINS] Archiving disabled
[JENKINS] Archiving disabled
[JENKINS] Archiving disabled
[JENKINS] Archiving disabled
[JENKINS] Archiving disabled
[JENKINS] Archiving disabled
[JENKINS] Archiving disabled
[JENKINS] Archiving disabled
[JENKINS] Archiving disabled
[JENKINS] Archiving disabled
[JENKINS] Archiving disabled
[JENKINS] Archiving disabled
[JENKINS] Archiving disabled
[JENKINS] Archiving disabled
[JENKINS] Archiving disabled
[JENKINS] Archiving disabled
[JENKINS] Archiving disabled
[JENKINS] Archiving disabled
[JENKINS] Archiving disabled
[JENKINS] Archiving disabled
[JENKINS] Archiving disabled
[JENKINS] Archiving disabled
[JENKINS] Archiving disabled
[JENKINS] Archiving disabled
[JENKINS] Archiving disabled
[JENKINS] Archiving disabled
[JENKINS] Archiving disabled
[JENKINS] Archiving disabled
[JENKINS] Archiving disabled
[JENKINS] Archiving disabled
[JENKINS] Archiving disabled
[JENKINS] Archiving disabled
[JENKINS] Archiving disabled
[JENKINS] Archiving disabled
[JENKINS] Archiving disabled
[JENKINS] Archiving disabled
[JENKINS] Archiving disabled
[JENKINS] Archiving disabled
[JENKINS] Archiving disabled
[JENKINS] Archiving disabled
[JENKINS] Archiving disabled
[JENKINS] Archiving disabled
[JENKINS] Archiving disabled
[JENKINS] Archiving disabled
[JENKINS] Archiving disabled
[JENKINS] Archiving disabled
[JENKINS] Archiving disabled
[JENKINS] Archiving disabled
[JENKINS] Archiving disabled
[JENKINS] Archiving disabled
[JENKINS] Archiving disabled
[JENKINS] Archiving disabled
[JENKINS] Archiving disabled2018-03-02T02:08:15.392 [INFO] ------------------------------------------------------------------------
2018-03-02T02:08:15.392 [INFO] Reactor Summary:
2018-03-02T02:08:15.392 [INFO] 
2018-03-02T02:08:15.393 [INFO] Apache Beam :: Parent .............................. SUCCESS
[ 18.384 s]
2018-03-02T02:08:15.393 [INFO] Apache Beam :: SDKs :: Java :: Build Tools ......... SUCCESS
[ 10.043 s]
2018-03-02T02:08:15.393 [INFO] Apache Beam :: Model ............................... SUCCESS
[  2.905 s]
2018-03-02T02:08:15.393 [INFO] Apache Beam :: Model :: Pipeline ................... SUCCESS
[ 21.127 s]
2018-03-02T02:08:15.393 [INFO] Apache Beam :: Model :: Job Management ............. SUCCESS
[ 20.199 s]
2018-03-02T02:08:15.393 [INFO] Apache Beam :: Model :: Fn Execution ............... SUCCESS
[ 23.649 s]
2018-03-02T02:08:15.393 [INFO] Apache Beam :: SDKs ................................ SUCCESS
[  3.059 s]
2018-03-02T02:08:15.393 [INFO] Apache Beam :: SDKs :: Java ........................ SUCCESS
[  2.999 s]
2018-03-02T02:08:15.393 [INFO] Apache Beam :: SDKs :: Java :: Core ................ SUCCESS
[03:31 min]
2018-03-02T02:08:15.393 [INFO] Apache Beam :: SDKs :: Java :: Fn Execution ........ SUCCESS
[ 36.266 s]
2018-03-02T02:08:15.393 [INFO] Apache Beam :: SDKs :: Java :: Extensions :: Google Cloud Platform
Core SUCCESS [ 35.584 s]
2018-03-02T02:08:15.393 [INFO] Apache Beam :: Runners ............................. SUCCESS
[  4.199 s]
2018-03-02T02:08:15.393 [INFO] Apache Beam :: Runners :: Core Construction Java ... SUCCESS
[ 42.797 s]
2018-03-02T02:08:15.393 [INFO] Apache Beam :: Runners :: Core Java ................ SUCCESS
[ 49.966 s]
2018-03-02T02:08:15.393 [INFO] Apache Beam :: SDKs :: Java :: Harness ............. SUCCESS
[ 40.812 s]
2018-03-02T02:08:15.393 [INFO] Apache Beam :: SDKs :: Java :: IO :: Amazon Web Services SUCCESS
[ 22.434 s]
2018-03-02T02:08:15.393 [INFO] Apache Beam :: Runners :: Local Java Core .......... SUCCESS
[ 13.105 s]
2018-03-02T02:08:15.393 [INFO] Apache Beam :: Runners :: Direct Java .............. SUCCESS
[05:22 min]
2018-03-02T02:08:15.394 [INFO] Apache Beam :: SDKs :: Java :: IO :: AMQP .......... SUCCESS
[ 45.507 s]
2018-03-02T02:08:15.394 [INFO] Apache Beam :: SDKs :: Java :: IO :: Common ........ SUCCESS
[  7.713 s]
2018-03-02T02:08:15.394 [INFO] Apache Beam :: SDKs :: Java :: IO :: Cassandra ..... SUCCESS
[ 35.301 s]
2018-03-02T02:08:15.394 [INFO] Apache Beam :: SDKs :: Java :: IO :: Elasticsearch . SUCCESS
[ 20.100 s]
2018-03-02T02:08:15.394 [INFO] Apache Beam :: SDKs :: Java :: IO :: Elasticsearch-Tests SUCCESS
[  4.251 s]
2018-03-02T02:08:15.394 [INFO] Apache Beam :: SDKs :: Java :: IO :: Elasticsearch-Tests ::
Common SUCCESS [  5.479 s]
2018-03-02T02:08:15.394 [INFO] Apache Beam :: SDKs :: Java :: IO :: Elasticsearch-Tests ::
2.x SUCCESS [ 27.473 s]
2018-03-02T02:08:15.394 [INFO] Apache Beam :: SDKs :: Java :: IO :: Elasticsearch-Tests ::
5.x SUCCESS [ 34.676 s]
2018-03-02T02:08:15.394 [INFO] Apache Beam :: SDKs :: Java :: Extensions :: Protobuf SUCCESS
[ 19.972 s]
2018-03-02T02:08:15.394 [INFO] Apache Beam :: SDKs :: Java :: IO :: Google Cloud Platform
SUCCESS [02:26 min]
2018-03-02T02:08:15.394 [INFO] Apache Beam :: Runners :: Google Cloud Dataflow .... SUCCESS
[33:07 min]
2018-03-02T02:08:15.394 [INFO] Apache Beam :: SDKs :: Java :: IO :: File-based-io-tests SUCCESS
[  7.498 s]
2018-03-02T02:08:15.394 [INFO] Apache Beam :: SDKs :: Java :: IO :: Hadoop Common . SUCCESS
[ 21.057 s]
2018-03-02T02:08:15.394 [INFO] Apache Beam :: SDKs :: Java :: IO :: Hadoop File System SUCCESS
[ 54.475 s]
2018-03-02T02:08:15.394 [INFO] Apache Beam :: SDKs :: Java :: IO :: JDBC .......... SUCCESS
[01:17 min]
2018-03-02T02:08:15.394 [INFO] Apache Beam :: SDKs :: Java :: IO :: Hadoop Input Format SUCCESS
[01:24 min]
2018-03-02T02:08:15.394 [INFO] Apache Beam :: SDKs :: Java :: IO :: HBase ......... SUCCESS
[01:37 min]
2018-03-02T02:08:15.394 [INFO] Apache Beam :: SDKs :: Java :: IO :: HCatalog ...... SUCCESS
[01:04 min]
2018-03-02T02:08:15.394 [INFO] Apache Beam :: SDKs :: Java :: IO :: JMS ........... SUCCESS
[ 24.561 s]
2018-03-02T02:08:15.394 [INFO] Apache Beam :: SDKs :: Java :: IO :: Kafka ......... SUCCESS
[ 43.532 s]
2018-03-02T02:08:15.394 [INFO] Apache Beam :: SDKs :: Java :: IO :: Kinesis ....... SUCCESS
[ 33.948 s]
2018-03-02T02:08:15.394 [INFO] Apache Beam :: SDKs :: Java :: IO :: MongoDB ....... SUCCESS
[ 49.468 s]
2018-03-02T02:08:15.394 [INFO] Apache Beam :: SDKs :: Java :: IO :: MQTT .......... SUCCESS
[ 33.836 s]
2018-03-02T02:08:15.394 [INFO] Apache Beam :: SDKs :: Java :: IO :: Redis ......... SUCCESS
[ 26.418 s]
2018-03-02T02:08:15.395 [INFO] Apache Beam :: SDKs :: Java :: IO :: Solr .......... SUCCESS
[ 46.108 s]
2018-03-02T02:08:15.395 [INFO] Apache Beam :: SDKs :: Java :: IO :: Tika .......... SUCCESS
[ 28.529 s]
2018-03-02T02:08:15.395 [INFO] Apache Beam :: SDKs :: Java :: IO :: XML ........... SUCCESS
[ 36.226 s]
2018-03-02T02:08:15.395 [INFO] Apache Beam :: SDKs :: Java :: Maven Archetypes :: Starter
SUCCESS [ 16.595 s]
2018-03-02T02:08:15.395 [INFO] Apache Beam :: Examples :: Java .................... SUCCESS
[31:21 min]
2018-03-02T02:08:15.395 [INFO] Apache Beam :: SDKs :: Java :: Maven Archetypes :: Examples
SUCCESS [ 59.926 s]
2018-03-02T02:08:15.395 [INFO] Apache Beam :: SDKs :: Java :: Extensions :: Jackson SUCCESS
[ 28.176 s]
2018-03-02T02:08:15.395 [INFO] Apache Beam :: SDKs :: Java :: Extensions :: Join library SUCCESS
[ 25.731 s]
2018-03-02T02:08:15.395 [INFO] Apache Beam :: SDKs :: Java :: Extensions :: Sketching SUCCESS
[ 35.154 s]
2018-03-02T02:08:15.395 [INFO] Apache Beam :: SDKs :: Java :: Extensions :: Sorter  SUCCESS
[ 42.608 s]
2018-03-02T02:08:15.395 [INFO] Apache Beam :: SDKs :: Java :: Extensions :: SQL ... SUCCESS
[01:57 min]
2018-03-02T02:08:15.395 [INFO] Apache Beam :: SDKs :: Java :: Nexmark ............. SUCCESS
[01:54 min]
2018-03-02T02:08:15.395 [INFO] Apache Beam :: Runners :: Java Fn Execution ........ SUCCESS
[01:00 min]
2018-03-02T02:08:15.395 [INFO] Apache Beam :: Runners :: Java Local Artifact Service SUCCESS
[ 26.708 s]
2018-03-02T02:08:15.395 [INFO] Apache Beam :: Runners :: Reference :: Java ........ SUCCESS
[ 17.565 s]
2018-03-02T02:08:15.395 [INFO] Apache Beam :: Runners :: Reference :: Job Orchestrator SUCCESS
[ 17.459 s]
2018-03-02T02:08:15.395 [INFO] Apache Beam :: Runners :: Flink .................... FAILURE
[  7.722 s]
2018-03-02T02:08:15.395 [INFO] Apache Beam :: Runners :: Gearpump ................. SUCCESS
[ 37.750 s]
2018-03-02T02:08:15.395 [INFO] Apache Beam :: Runners :: Spark .................... SUCCESS
[02:43 min]
2018-03-02T02:08:15.395 [INFO] Apache Beam :: Runners :: Apex ..................... SUCCESS
[01:27 min]
2018-03-02T02:08:15.395 [INFO] Apache Beam :: SDKs :: Java :: Aggregated Javadoc .. SKIPPED
2018-03-02T02:08:15.395 [INFO] ------------------------------------------------------------------------
2018-03-02T02:08:15.395 [INFO] BUILD FAILURE
2018-03-02T02:08:15.395 [INFO] ------------------------------------------------------------------------
2018-03-02T02:08:15.396 [INFO] Total time: 01:54 h
2018-03-02T02:08:15.396 [INFO] Finished at: 2018-03-02T02:08:15Z

2018-03-02T02:08:17.382 [INFO] Final Memory: 395M/1749M
2018-03-02T02:08:17.383 [INFO] ------------------------------------------------------------------------
Waiting for Jenkins to finish collecting data
2018-03-02T02:08:17.714 [ERROR] Failed to execute goal org.apache.maven.plugins:maven-compiler-plugin:3.7.0:compile
(default-compile) on project beam-runners-flink_2.11: Compilation failure
2018-03-02T02:08:17.714 [ERROR] <https://builds.apache.org/job/beam_PostCommit_Java_MavenInstall/ws/src/runners/flink/src/main/java/org/apache/beam/runners/flink/translation/wrappers/streaming/DoFnOperator.java>:[359,11]
cannot infer type arguments for org.apache.beam.runners.core.ProcessFnRunner<>
2018-03-02T02:08:17.714 [ERROR] reason: cannot infer type-variable(s) InputT,OutputT,RestrictionT
2018-03-02T02:08:17.714 [ERROR] (argument mismatch; org.apache.beam.runners.core.DoFnRunner
cannot be converted to org.apache.beam.runners.core.SimpleDoFnRunner<org.apache.beam.runners.core.KeyedWorkItem<java.lang.String,org.apache.beam.sdk.values.KV<InputT,RestrictionT>>,OutputT>)
2018-03-02T02:08:17.714 [ERROR] -> [Help 1]
2018-03-02T02:08:17.714 [ERROR] 
2018-03-02T02:08:17.714 [ERROR] To see the full stack trace of the errors, re-run Maven with
the -e switch.
2018-03-02T02:08:17.714 [ERROR] Re-run Maven using the -X switch to enable full debug logging.
2018-03-02T02:08:17.714 [ERROR] 
2018-03-02T02:08:17.714 [ERROR] For more information about the errors and possible solutions,
please read the following articles:
2018-03-02T02:08:17.715 [ERROR] [Help 1] http://cwiki.apache.org/confluence/display/MAVEN/MojoFailureException
2018-03-02T02:08:17.715 [ERROR] 
2018-03-02T02:08:17.715 [ERROR] After correcting the problems, you can resume the build with
the command
2018-03-02T02:08:17.715 [ERROR]   mvn <goals> -rf :beam-runners-flink_2.11
channel stopped

Mime
View raw message