beam-commits mailing list archives

Site index · List index
Message view « Date » · « Thread »
Top « Date » · « Thread »
From Apache Jenkins Server <jenk...@builds.apache.org>
Subject Build failed in Jenkins: beam_PerformanceTests_XmlIOIT #4
Date Sat, 10 Mar 2018 00:02:08 GMT
See <https://builds.apache.org/job/beam_PerformanceTests_XmlIOIT/4/display/redirect?page=changes>

Changes:

[markliu] [BEAM-3750] Remove TestPipeline.covnertToArgs from integration tests

[apilloud] [Nexmark][SQL] Convert SQL Rows to Java models

[apilloud] [Nexmark][SQL] Output java pojos

[apilloud] [Nexmark][SQL] Add model tests for sql

[herohde] [BEAM-3457] Drop Go Maven PreCommit

[markliu] Fix integration tests that use NumberedSharedFiles

[herohde] [BEAM-3804] Build Go SDK container with gradle

[herohde] [BEAM-3793] Validate provision response and add beamctl support

[cclauss] [BEAM-1251] Fix basestring, file(), reduce(), and xrange() for Python 3

[apilloud] [Nexmark] Use queue for Query 6 model

[apilloud] [Nexmark] Ensure enough data to produce output

[altay] Fix topic URIs.

[apilloud] [BEAM-3802] Remove broken cachedMetricResults

[cclauss] [BEAM-1251] Change unicode --> six.text_type for Python 3 - again

[herohde] Fix package name in Go container gradle build

[apilloud] [Nexmark] Sickbay query 6

[chamikara] [BEAM-3734] Performance tests for XmlIO  (#4747)

------------------------------------------
[...truncated 14.43 KB...]
Requirement already satisfied: googleapis-common-protos<2.0dev,>=1.5.2 in /home/jenkins/.local/lib/python2.7/site-packages
(from proto-google-cloud-datastore-v1<=0.90.4,>=0.90.0->apache-beam==2.5.0.dev0)
Requirement already satisfied: google-cloud-core<0.26dev,>=0.25.0 in /home/jenkins/.local/lib/python2.7/site-packages
(from google-cloud-pubsub==0.26.0->apache-beam==2.5.0.dev0)
Requirement already satisfied: gapic-google-cloud-pubsub-v1<0.16dev,>=0.15.0 in /home/jenkins/.local/lib/python2.7/site-packages
(from google-cloud-pubsub==0.26.0->apache-beam==2.5.0.dev0)
Requirement already satisfied: urllib3<1.23,>=1.21.1 in /usr/local/lib/python2.7/dist-packages
(from requests>=2.7.0->hdfs<3.0.0,>=2.1.0->apache-beam==2.5.0.dev0)
Requirement already satisfied: idna<2.7,>=2.5 in /usr/local/lib/python2.7/dist-packages
(from requests>=2.7.0->hdfs<3.0.0,>=2.1.0->apache-beam==2.5.0.dev0)
Requirement already satisfied: chardet<3.1.0,>=3.0.2 in /usr/local/lib/python2.7/dist-packages
(from requests>=2.7.0->hdfs<3.0.0,>=2.1.0->apache-beam==2.5.0.dev0)
Requirement already satisfied: certifi>=2017.4.17 in /usr/local/lib/python2.7/dist-packages
(from requests>=2.7.0->hdfs<3.0.0,>=2.1.0->apache-beam==2.5.0.dev0)
Requirement already satisfied: monotonic>=0.1 in /home/jenkins/.local/lib/python2.7/site-packages
(from fasteners>=0.14->google-apitools<=0.5.20,>=0.5.18->apache-beam==2.5.0.dev0)
Requirement already satisfied: google-auth<2.0.0dev,>=0.4.0 in /home/jenkins/.local/lib/python2.7/site-packages
(from google-cloud-core<0.26dev,>=0.25.0->google-cloud-pubsub==0.26.0->apache-beam==2.5.0.dev0)
Requirement already satisfied: google-auth-httplib2 in /home/jenkins/.local/lib/python2.7/site-packages
(from google-cloud-core<0.26dev,>=0.25.0->google-cloud-pubsub==0.26.0->apache-beam==2.5.0.dev0)
Requirement already satisfied: google-gax<0.16dev,>=0.15.7 in /home/jenkins/.local/lib/python2.7/site-packages
(from gapic-google-cloud-pubsub-v1<0.16dev,>=0.15.0->google-cloud-pubsub==0.26.0->apache-beam==2.5.0.dev0)
Requirement already satisfied: grpc-google-iam-v1<0.12dev,>=0.11.1 in /home/jenkins/.local/lib/python2.7/site-packages
(from gapic-google-cloud-pubsub-v1<0.16dev,>=0.15.0->google-cloud-pubsub==0.26.0->apache-beam==2.5.0.dev0)
Requirement already satisfied: cachetools>=2.0.0 in /home/jenkins/.local/lib/python2.7/site-packages
(from google-auth<2.0.0dev,>=0.4.0->google-cloud-core<0.26dev,>=0.25.0->google-cloud-pubsub==0.26.0->apache-beam==2.5.0.dev0)
Requirement already satisfied: future<0.17dev,>=0.16.0 in /home/jenkins/.local/lib/python2.7/site-packages
(from google-gax<0.16dev,>=0.15.7->gapic-google-cloud-pubsub-v1<0.16dev,>=0.15.0->google-cloud-pubsub==0.26.0->apache-beam==2.5.0.dev0)
Requirement already satisfied: ply==3.8 in /home/jenkins/.local/lib/python2.7/site-packages
(from google-gax<0.16dev,>=0.15.7->gapic-google-cloud-pubsub-v1<0.16dev,>=0.15.0->google-cloud-pubsub==0.26.0->apache-beam==2.5.0.dev0)
Installing collected packages: hdfs, apache-beam
  Running setup.py develop for apache-beam
Successfully installed apache-beam hdfs-2.1.0
[beam_PerformanceTests_XmlIOIT] $ /bin/bash -xe /tmp/jenkins6570920591093042887.sh
+ .env/bin/python PerfKitBenchmarker/pkb.py --project=apache-beam-testing --dpb_log_level=INFO
--maven_binary=/home/jenkins/tools/maven/latest/bin/mvn --bigquery_table=beam_performance.xmlioit_pkb_results
--temp_dir=<https://builds.apache.org/job/beam_PerformanceTests_XmlIOIT/ws/> --official=true
--benchmarks=beam_integration_benchmark --beam_it_timeout=1200 --beam_it_profile=io-it --beam_prebuilt=true
--beam_sdk=java --beam_it_module=sdks/java/io/file-based-io-tests --beam_it_class=org.apache.beam.sdk.io.xml.XmlIOIT
'--beam_it_options=[--project=apache-beam-testing,--tempRoot=gs://temp-storage-for-perf-tests,--filenamePrefix=gs://temp-storage-for-perf-tests/beam_PerformanceTests_XmlIOIT/4/,--numberOfRecords=100000000,--charset=UTF-8]'
'--beam_extra_mvn_properties=[filesystem=gcs]'
2018-03-10 00:01:28,787 2c8e025e MainThread INFO     Verbose logging to: <https://builds.apache.org/job/beam_PerformanceTests_XmlIOIT/ws/runs/2c8e025e/pkb.log>
2018-03-10 00:01:28,788 2c8e025e MainThread INFO     PerfKitBenchmarker version: v1.12.0-401-g56206b8
2018-03-10 00:01:28,788 2c8e025e MainThread INFO     Flag values:
--beam_extra_mvn_properties=[filesystem=gcs]
--beam_it_class=org.apache.beam.sdk.io.xml.XmlIOIT
--beam_it_timeout=1200
--beam_it_module=sdks/java/io/file-based-io-tests
--beam_sdk=java
--temp_dir=<https://builds.apache.org/job/beam_PerformanceTests_XmlIOIT/ws/>
--maven_binary=/home/jenkins/tools/maven/latest/bin/mvn
--beam_it_options=[--project=apache-beam-testing,--tempRoot=gs://temp-storage-for-perf-tests,--filenamePrefix=gs://temp-storage-for-perf-tests/beam_PerformanceTests_XmlIOIT/4/,--numberOfRecords=100000000,--charset=UTF-8]
--beam_prebuilt
--project=apache-beam-testing
--bigquery_table=beam_performance.xmlioit_pkb_results
--official
--dpb_log_level=INFO
--beam_it_profile=io-it
--benchmarks=beam_integration_benchmark
2018-03-10 00:01:29,269 2c8e025e MainThread WARNING  The key "flags" was not in the default
config, but was in user overrides. This may indicate a typo.
2018-03-10 00:01:29,269 2c8e025e MainThread INFO     Initializing the edw service decoder
2018-03-10 00:01:29,405 2c8e025e MainThread beam_integration_benchmark(1/1) INFO     Provisioning
resources for benchmark beam_integration_benchmark
2018-03-10 00:01:29,407 2c8e025e MainThread beam_integration_benchmark(1/1) INFO     Preparing
benchmark beam_integration_benchmark
2018-03-10 00:01:29,407 2c8e025e MainThread beam_integration_benchmark(1/1) INFO     Running:
git clone https://github.com/apache/beam.git
2018-03-10 00:01:38,025 2c8e025e MainThread beam_integration_benchmark(1/1) INFO     Running
benchmark beam_integration_benchmark
2018-03-10 00:01:38,032 2c8e025e MainThread beam_integration_benchmark(1/1) INFO     Running:
/home/jenkins/tools/maven/latest/bin/mvn -e verify -Dit.test=org.apache.beam.sdk.io.xml.XmlIOIT
-DskipITs=false -pl sdks/java/io/file-based-io-tests -Pio-it -Pdataflow-runner -Dfilesystem=gcs
-DintegrationTestPipelineOptions=["--project=apache-beam-testing","--tempRoot=gs://temp-storage-for-perf-tests","--filenamePrefix=gs://temp-storage-for-perf-tests/beam_PerformanceTests_XmlIOIT/4/","--numberOfRecords=100000000","--charset=UTF-8","--runner=TestDataflowRunner"]
2018-03-10 00:02:07,383 2c8e025e MainThread beam_integration_benchmark(1/1) INFO     Ran:
{/home/jenkins/tools/maven/latest/bin/mvn -e verify -Dit.test=org.apache.beam.sdk.io.xml.XmlIOIT
-DskipITs=false -pl sdks/java/io/file-based-io-tests -Pio-it -Pdataflow-runner -Dfilesystem=gcs
-DintegrationTestPipelineOptions=["--project=apache-beam-testing","--tempRoot=gs://temp-storage-for-perf-tests","--filenamePrefix=gs://temp-storage-for-perf-tests/beam_PerformanceTests_XmlIOIT/4/","--numberOfRecords=100000000","--charset=UTF-8","--runner=TestDataflowRunner"]}
 ReturnCode:1,  WallTime:0:29.34s,  CPU:46.70s,  MaxMemory:748128kb 
STDOUT: [INFO] Error stacktraces are turned on.
[INFO] Scanning for projects...
[INFO] ------------------------------------------------------------------------
[INFO] Detecting the operating system and CPU architecture
[INFO] ------------------------------------------------------------------------
[INFO] os.detected.name: linux
[INFO] os.detected.arch: x86_64
[INFO] os.detected.version: 3.19
[INFO] os.detected.version.major: 3
[INFO] os.detected.version.minor: 19
[INFO] os.detected.release: ubuntu
[INFO] os.detected.release.version: 14.04
[INFO] os.detected.release.like.ubuntu: true
[INFO] os.detected.release.like.debian: true
[INFO] os.detected.classifier: linux-x86_64
[INFO] 
[INFO] ------------------------------------------------------------------------
[INFO] Building Apache Beam :: SDKs :: Java :: IO :: File-based-io-tests 2.5.0-SNAPSHOT
[INFO] ------------------------------------------------------------------------
Downloading from Nexus: http://repository.apache.org/snapshots/org/apache/beam/beam-sdks-java-core/2.5.0-SNAPSHOT/maven-metadata.xml
Progress (1): 1.6 kB                    Downloaded from Nexus: http://repository.apache.org/snapshots/org/apache/beam/beam-sdks-java-core/2.5.0-SNAPSHOT/maven-metadata.xml
(1.6 kB at 1.9 kB/s)
Downloading from Nexus: http://repository.apache.org/snapshots/org/apache/beam/beam-sdks-java-parent/2.5.0-SNAPSHOT/maven-metadata.xml
Progress (1): 613 B                   Downloaded from Nexus: http://repository.apache.org/snapshots/org/apache/beam/beam-sdks-java-parent/2.5.0-SNAPSHOT/maven-metadata.xml
(613 B at 3.8 kB/s)
Downloading from Nexus: http://repository.apache.org/snapshots/org/apache/beam/beam-sdks-parent/2.5.0-SNAPSHOT/maven-metadata.xml
Progress (1): 608 B                   Downloaded from Nexus: http://repository.apache.org/snapshots/org/apache/beam/beam-sdks-parent/2.5.0-SNAPSHOT/maven-metadata.xml
(608 B at 3.9 kB/s)
Downloading from Nexus: http://repository.apache.org/snapshots/org/apache/beam/beam-parent/2.5.0-SNAPSHOT/maven-metadata.xml
Progress (1): 816 B                   Downloaded from Nexus: http://repository.apache.org/snapshots/org/apache/beam/beam-parent/2.5.0-SNAPSHOT/maven-metadata.xml
(816 B at 5.3 kB/s)
Downloading from Nexus: http://repository.apache.org/snapshots/org/apache/beam/beam-runners-direct-java/2.5.0-SNAPSHOT/maven-metadata.xml
Progress (1): 1.6 kB                    Downloaded from Nexus: http://repository.apache.org/snapshots/org/apache/beam/beam-runners-direct-java/2.5.0-SNAPSHOT/maven-metadata.xml
(1.6 kB at 9.6 kB/s)
Downloading from Nexus: http://repository.apache.org/snapshots/org/apache/beam/beam-runners-parent/2.5.0-SNAPSHOT/maven-metadata.xml
Progress (1): 611 B                   Downloaded from Nexus: http://repository.apache.org/snapshots/org/apache/beam/beam-runners-parent/2.5.0-SNAPSHOT/maven-metadata.xml
(611 B at 3.8 kB/s)
Downloading from Nexus: http://repository.apache.org/snapshots/org/apache/beam/beam-runners-local-java-core/2.5.0-SNAPSHOT/maven-metadata.xml
Progress (1): 1.7 kB                    Downloaded from Nexus: http://repository.apache.org/snapshots/org/apache/beam/beam-runners-local-java-core/2.5.0-SNAPSHOT/maven-metadata.xml
(1.7 kB at 10 kB/s)
Downloading from Nexus: http://repository.apache.org/snapshots/org/apache/beam/beam-sdks-java-io-common/2.5.0-SNAPSHOT/maven-metadata.xml
Progress (1): 1.4 kB                    Downloaded from Nexus: http://repository.apache.org/snapshots/org/apache/beam/beam-sdks-java-io-common/2.5.0-SNAPSHOT/maven-metadata.xml
(1.4 kB at 9.0 kB/s)
Downloading from Nexus: http://repository.apache.org/snapshots/org/apache/beam/beam-sdks-java-io-parent/2.5.0-SNAPSHOT/maven-metadata.xml
Progress (1): 616 B                   Downloaded from Nexus: http://repository.apache.org/snapshots/org/apache/beam/beam-sdks-java-io-parent/2.5.0-SNAPSHOT/maven-metadata.xml
(616 B at 2.1 kB/s)
Downloading from Nexus: http://repository.apache.org/snapshots/org/apache/beam/beam-sdks-java-io-xml/2.5.0-SNAPSHOT/maven-metadata.xml
Progress (1): 1.6 kB                    Downloaded from Nexus: http://repository.apache.org/snapshots/org/apache/beam/beam-sdks-java-io-xml/2.5.0-SNAPSHOT/maven-metadata.xml
(1.6 kB at 10 kB/s)
Downloading from Nexus: http://repository.apache.org/snapshots/org/apache/beam/beam-runners-google-cloud-dataflow-java/2.5.0-SNAPSHOT/maven-metadata.xml
Progress (1): 1.9 kB                    Downloaded from Nexus: http://repository.apache.org/snapshots/org/apache/beam/beam-runners-google-cloud-dataflow-java/2.5.0-SNAPSHOT/maven-metadata.xml
(1.9 kB at 12 kB/s)
Downloading from Nexus: http://repository.apache.org/snapshots/org/apache/beam/beam-sdks-java-extensions-google-cloud-platform-core/2.5.0-SNAPSHOT/maven-metadata.xml
Progress (1): 1.9 kB                    Downloaded from Nexus: http://repository.apache.org/snapshots/org/apache/beam/beam-sdks-java-extensions-google-cloud-platform-core/2.5.0-SNAPSHOT/maven-metadata.xml
(1.9 kB at 12 kB/s)
Downloading from Nexus: http://repository.apache.org/snapshots/org/apache/beam/beam-sdks-java-extensions-parent/2.5.0-SNAPSHOT/maven-metadata.xml
Progress (1): 624 B                   Downloaded from Nexus: http://repository.apache.org/snapshots/org/apache/beam/beam-sdks-java-extensions-parent/2.5.0-SNAPSHOT/maven-metadata.xml
(624 B at 4.1 kB/s)
Downloading from Nexus: http://repository.apache.org/snapshots/org/apache/beam/beam-sdks-java-io-google-cloud-platform/2.5.0-SNAPSHOT/maven-metadata.xml
Progress (1): 1.9 kB                    Downloaded from Nexus: http://repository.apache.org/snapshots/org/apache/beam/beam-sdks-java-io-google-cloud-platform/2.5.0-SNAPSHOT/maven-metadata.xml
(1.9 kB at 11 kB/s)
Downloading from Nexus: http://repository.apache.org/snapshots/org/apache/beam/beam-sdks-java-extensions-protobuf/2.5.0-SNAPSHOT/maven-metadata.xml
Progress (1): 1.7 kB                    Downloaded from Nexus: http://repository.apache.org/snapshots/org/apache/beam/beam-sdks-java-extensions-protobuf/2.5.0-SNAPSHOT/maven-metadata.xml
(1.7 kB at 10 kB/s)
Downloading from Nexus: http://repository.apache.org/snapshots/io/netty/netty-codec-http2/maven-metadata.xml
Downloading from central: https://repo.maven.apache.org/maven2/io/netty/netty-codec-http2/maven-metadata.xml
Progress (1): 1.6 kB                    Downloaded from central: https://repo.maven.apache.org/maven2/io/netty/netty-codec-http2/maven-metadata.xml
(1.6 kB at 7.7 kB/s)
Downloading from Apache Snapshots Repository: https://repository.apache.org/content/repositories/snapshots/io/netty/netty-codec-http2/maven-metadata.xml
Downloading from Sonatype Snapshots Repository: https://oss.sonatype.org/content/repositories/snapshots/io/netty/netty-codec-http2/maven-metadata.xml
Progress (1): 1.0 kB                    Downloaded from Sonatype Snapshots Repository: https://oss.sonatype.org/content/repositories/snapshots/io/netty/netty-codec-http2/maven-metadata.xml
(1.0 kB at 3.3 kB/s)
[INFO] 
[INFO] --- maven-enforcer-plugin:3.0.0-M1:enforce (enforce-maven-version) @ beam-sdks-java-io-file-based-io-tests
---
[INFO] 
[INFO] --- maven-enforcer-plugin:3.0.0-M1:enforce (enforce) @ beam-sdks-java-io-file-based-io-tests
---
[INFO] artifact io.netty:netty-codec-http2: checking for updates from central
[INFO] Adding ignore: module-info
[INFO] 
[INFO] --- maven-enforcer-plugin:3.0.0-M1:enforce (enforce-banned-dependencies) @ beam-sdks-java-io-file-based-io-tests
---
[INFO] 
[INFO] --- maven-remote-resources-plugin:1.5:process (process-resource-bundles) @ beam-sdks-java-io-file-based-io-tests
---
[INFO] 
[INFO] --- maven-resources-plugin:3.0.2:resources (default-resources) @ beam-sdks-java-io-file-based-io-tests
---
[INFO] Using 'UTF-8' encoding to copy filtered resources.
[INFO] skip non existing resourceDirectory <https://builds.apache.org/job/beam_PerformanceTests_XmlIOIT/ws/runs/2c8e025e/beam/sdks/java/io/file-based-io-tests/src/main/resources>
[INFO] Copying 3 resources
[INFO] 
[INFO] --- maven-compiler-plugin:3.7.0:compile (default-compile) @ beam-sdks-java-io-file-based-io-tests
---
[INFO] No sources to compile
[INFO] 
[INFO] --- maven-resources-plugin:3.0.2:testResources (default-testResources) @ beam-sdks-java-io-file-based-io-tests
---
[INFO] Using 'UTF-8' encoding to copy filtered resources.
[INFO] skip non existing resourceDirectory <https://builds.apache.org/job/beam_PerformanceTests_XmlIOIT/ws/runs/2c8e025e/beam/sdks/java/io/file-based-io-tests/src/test/resources>
[INFO] Copying 3 resources
[INFO] 
[INFO] --- maven-compiler-plugin:3.7.0:testCompile (default-testCompile) @ beam-sdks-java-io-file-based-io-tests
---
[INFO] Changes detected - recompiling the module!
[INFO] Compiling 5 source files to <https://builds.apache.org/job/beam_PerformanceTests_XmlIOIT/ws/runs/2c8e025e/beam/sdks/java/io/file-based-io-tests/target/test-classes>
[INFO] <https://builds.apache.org/job/beam_PerformanceTests_XmlIOIT/ws/runs/2c8e025e/beam/sdks/java/io/file-based-io-tests/src/test/java/org/apache/beam/sdk/io/avro/AvroIOIT.java>:
Some input files use or override a deprecated API.
[INFO] <https://builds.apache.org/job/beam_PerformanceTests_XmlIOIT/ws/runs/2c8e025e/beam/sdks/java/io/file-based-io-tests/src/test/java/org/apache/beam/sdk/io/avro/AvroIOIT.java>:
Recompile with -Xlint:deprecation for details.
[INFO] -------------------------------------------------------------
[ERROR] COMPILATION ERROR : 
[INFO] -------------------------------------------------------------
[ERROR] <https://builds.apache.org/job/beam_PerformanceTests_XmlIOIT/ws/runs/2c8e025e/beam/sdks/java/io/file-based-io-tests/src/test/java/org/apache/beam/sdk/io/xml/XmlIOIT.java>:[94,38]
cannot find symbol
  symbol:   method getCharset()
  location: variable options of type org.apache.beam.sdk.io.common.IOTestPipelineOptions
[INFO] 1 error
[INFO] -------------------------------------------------------------
[INFO] ------------------------------------------------------------------------
[INFO] BUILD FAILURE
[INFO] ------------------------------------------------------------------------
[INFO] Total time: 26.568 s
[INFO] Finished at: 2018-03-10T00:02:06Z
[INFO] Final Memory: 71M/763M
[INFO] ------------------------------------------------------------------------
[ERROR] Failed to execute goal org.apache.maven.plugins:maven-compiler-plugin:3.7.0:testCompile
(default-testCompile) on project beam-sdks-java-io-file-based-io-tests: Compilation failure
[ERROR] <https://builds.apache.org/job/beam_PerformanceTests_XmlIOIT/ws/runs/2c8e025e/beam/sdks/java/io/file-based-io-tests/src/test/java/org/apache/beam/sdk/io/xml/XmlIOIT.java>:[94,38]
cannot find symbol
[ERROR]   symbol:   method getCharset()
[ERROR]   location: variable options of type org.apache.beam.sdk.io.common.IOTestPipelineOptions
[ERROR] 
[ERROR] -> [Help 1]
org.apache.maven.lifecycle.LifecycleExecutionException: Failed to execute goal org.apache.maven.plugins:maven-compiler-plugin:3.7.0:testCompile
(default-testCompile) on project beam-sdks-java-io-file-based-io-tests: Compilation failure
<https://builds.apache.org/job/beam_PerformanceTests_XmlIOIT/ws/runs/2c8e025e/beam/sdks/java/io/file-based-io-tests/src/test/java/org/apache/beam/sdk/io/xml/XmlIOIT.java>:[94,38]
cannot find symbol
  symbol:   method getCharset()
  location: variable options of type org.apache.beam.sdk.io.common.IOTestPipelineOptions

    at org.apache.maven.lifecycle.internal.MojoExecutor.execute (MojoExecutor.java:213)
    at org.apache.maven.lifecycle.internal.MojoExecutor.execute (MojoExecutor.java:154)
    at org.apache.maven.lifecycle.internal.MojoExecutor.execute (MojoExecutor.java:146)
    at org.apache.maven.lifecycle.internal.LifecycleModuleBuilder.buildProject (LifecycleModuleBuilder.java:117)
    at org.apache.maven.lifecycle.internal.LifecycleModuleBuilder.buildProject (LifecycleModuleBuilder.java:81)
    at org.apache.maven.lifecycle.internal.builder.singlethreaded.SingleThreadedBuilder.build
(SingleThreadedBuilder.java:51)
    at org.apache.maven.lifecycle.internal.LifecycleStarter.execute (LifecycleStarter.java:128)
    at org.apache.maven.DefaultMaven.doExecute (DefaultMaven.java:309)
    at org.apache.maven.DefaultMaven.doExecute (DefaultMaven.java:194)
    at org.apache.maven.DefaultMaven.execute (DefaultMaven.java:107)
    at org.apache.maven.cli.MavenCli.execute (MavenCli.java:955)
    at org.apache.maven.cli.MavenCli.doMain (MavenCli.java:290)
    at org.apache.maven.cli.MavenCli.main (MavenCli.java:194)
    at sun.reflect.NativeMethodAccessorImpl.invoke0 (Native Method)
    at sun.reflect.NativeMethodAccessorImpl.invoke (NativeMethodAccessorImpl.java:62)
    at sun.reflect.DelegatingMethodAccessorImpl.invoke (DelegatingMethodAccessorImpl.java:43)
    at java.lang.reflect.Method.invoke (Method.java:498)
    at org.codehaus.plexus.classworlds.launcher.Launcher.launchEnhanced (Launcher.java:289)
    at org.codehaus.plexus.classworlds.launcher.Launcher.launch (Launcher.java:229)
    at org.codehaus.plexus.classworlds.launcher.Launcher.mainWithExitCode (Launcher.java:415)
    at org.codehaus.plexus.classworlds.launcher.Launcher.main (Launcher.java:356)
Caused by: org.apache.maven.plugin.compiler.CompilationFailureException: Compilation failure
<https://builds.apache.org/job/beam_PerformanceTests_XmlIOIT/ws/runs/2c8e025e/beam/sdks/java/io/file-based-io-tests/src/test/java/org/apache/beam/sdk/io/xml/XmlIOIT.java>:[94,38]
cannot find symbol
  symbol:   method getCharset()
  location: variable options of type org.apache.beam.sdk.io.common.IOTestPipelineOptions

    at org.apache.maven.plugin.compiler.AbstractCompilerMojo.execute (AbstractCompilerMojo.java:1161)
    at org.apache.maven.plugin.compiler.TestCompilerMojo.execute (TestCompilerMojo.java:176)
    at org.apache.maven.plugin.DefaultBuildPluginManager.executeMojo (DefaultBuildPluginManager.java:134)
    at org.apache.maven.lifecycle.internal.MojoExecutor.execute (MojoExecutor.java:208)
    at org.apache.maven.lifecycle.internal.MojoExecutor.execute (MojoExecutor.java:154)
    at org.apache.maven.lifecycle.internal.MojoExecutor.execute (MojoExecutor.java:146)
    at org.apache.maven.lifecycle.internal.LifecycleModuleBuilder.buildProject (LifecycleModuleBuilder.java:117)
    at org.apache.maven.lifecycle.internal.LifecycleModuleBuilder.buildProject (LifecycleModuleBuilder.java:81)
    at org.apache.maven.lifecycle.internal.builder.singlethreaded.SingleThreadedBuilder.build
(SingleThreadedBuilder.java:51)
    at org.apache.maven.lifecycle.internal.LifecycleStarter.execute (LifecycleStarter.java:128)
    at org.apache.maven.DefaultMaven.doExecute (DefaultMaven.java:309)
    at org.apache.maven.DefaultMaven.doExecute (DefaultMaven.java:194)
    at org.apache.maven.DefaultMaven.execute (DefaultMaven.java:107)
    at org.apache.maven.cli.MavenCli.execute (MavenCli.java:955)
    at org.apache.maven.cli.MavenCli.doMain (MavenCli.java:290)
    at org.apache.maven.cli.MavenCli.main (MavenCli.java:194)
    at sun.reflect.NativeMethodAccessorImpl.invoke0 (Native Method)
    at sun.reflect.NativeMethodAccessorImpl.invoke (NativeMethodAccessorImpl.java:62)
    at sun.reflect.DelegatingMethodAccessorImpl.invoke (DelegatingMethodAccessorImpl.java:43)
    at java.lang.reflect.Method.invoke (Method.java:498)
    at org.codehaus.plexus.classworlds.launcher.Launcher.launchEnhanced (Launcher.java:289)
    at org.codehaus.plexus.classworlds.launcher.Launcher.launch (Launcher.java:229)
    at org.codehaus.plexus.classworlds.launcher.Launcher.mainWithExitCode (Launcher.java:415)
    at org.codehaus.plexus.classworlds.launcher.Launcher.main (Launcher.java:356)
[ERROR] 
[ERROR] Re-run Maven using the -X switch to enable full debug logging.
[ERROR] 
[ERROR] For more information about the errors and possible solutions, please read the following
articles:
[ERROR] [Help 1] http://cwiki.apache.org/confluence/display/MAVEN/MojoFailureException

STDERR: 
2018-03-10 00:02:07,384 2c8e025e MainThread beam_integration_benchmark(1/1) ERROR    Error
during benchmark beam_integration_benchmark
Traceback (most recent call last):
  File "<https://builds.apache.org/job/beam_PerformanceTests_XmlIOIT/ws/PerfKitBenchmarker/perfkitbenchmarker/pkb.py",>
line 622, in RunBenchmark
    DoRunPhase(spec, collector, detailed_timer)
  File "<https://builds.apache.org/job/beam_PerformanceTests_XmlIOIT/ws/PerfKitBenchmarker/perfkitbenchmarker/pkb.py",>
line 525, in DoRunPhase
    samples = spec.BenchmarkRun(spec)
  File "<https://builds.apache.org/job/beam_PerformanceTests_XmlIOIT/ws/PerfKitBenchmarker/perfkitbenchmarker/linux_benchmarks/beam_integration_benchmark.py",>
line 159, in Run
    job_type=job_type)
  File "<https://builds.apache.org/job/beam_PerformanceTests_XmlIOIT/ws/PerfKitBenchmarker/perfkitbenchmarker/providers/gcp/gcp_dpb_dataflow.py",>
line 90, in SubmitJob
    assert retcode == 0, "Integration Test Failed."
AssertionError: Integration Test Failed.
2018-03-10 00:02:07,385 2c8e025e MainThread beam_integration_benchmark(1/1) INFO     Cleaning
up benchmark beam_integration_benchmark
2018-03-10 00:02:07,387 2c8e025e MainThread beam_integration_benchmark(1/1) ERROR    Exception
running benchmark
Traceback (most recent call last):
  File "<https://builds.apache.org/job/beam_PerformanceTests_XmlIOIT/ws/PerfKitBenchmarker/perfkitbenchmarker/pkb.py",>
line 732, in RunBenchmarkTask
    RunBenchmark(spec, collector)
  File "<https://builds.apache.org/job/beam_PerformanceTests_XmlIOIT/ws/PerfKitBenchmarker/perfkitbenchmarker/pkb.py",>
line 622, in RunBenchmark
    DoRunPhase(spec, collector, detailed_timer)
  File "<https://builds.apache.org/job/beam_PerformanceTests_XmlIOIT/ws/PerfKitBenchmarker/perfkitbenchmarker/pkb.py",>
line 525, in DoRunPhase
    samples = spec.BenchmarkRun(spec)
  File "<https://builds.apache.org/job/beam_PerformanceTests_XmlIOIT/ws/PerfKitBenchmarker/perfkitbenchmarker/linux_benchmarks/beam_integration_benchmark.py",>
line 159, in Run
    job_type=job_type)
  File "<https://builds.apache.org/job/beam_PerformanceTests_XmlIOIT/ws/PerfKitBenchmarker/perfkitbenchmarker/providers/gcp/gcp_dpb_dataflow.py",>
line 90, in SubmitJob
    assert retcode == 0, "Integration Test Failed."
AssertionError: Integration Test Failed.
2018-03-10 00:02:07,387 2c8e025e MainThread beam_integration_benchmark(1/1) ERROR    Benchmark
1/1 beam_integration_benchmark (UID: beam_integration_benchmark0) failed. Execution will continue.
2018-03-10 00:02:07,387 2c8e025e MainThread beam_integration_benchmark(1/1) INFO     Benchmark
run statuses:
---------------------------------------------------------------------------------
Name                        UID                          Status  Failed Substatus
---------------------------------------------------------------------------------
beam_integration_benchmark  beam_integration_benchmark0  FAILED                  
---------------------------------------------------------------------------------
Success rate: 0.00% (0/1)
2018-03-10 00:02:07,387 2c8e025e MainThread beam_integration_benchmark(1/1) INFO     Complete
logs can be found at: <https://builds.apache.org/job/beam_PerformanceTests_XmlIOIT/ws/runs/2c8e025e/pkb.log>
2018-03-10 00:02:07,388 2c8e025e MainThread beam_integration_benchmark(1/1) INFO     Completion
statuses can be found at: <https://builds.apache.org/job/beam_PerformanceTests_XmlIOIT/ws/runs/2c8e025e/completion_statuses.json>
Build step 'Execute shell' marked build as failure

Mime
View raw message