beam-commits mailing list archives

Site index · List index
Message view « Date » · « Thread »
Top « Date » · « Thread »
From Apache Jenkins Server <jenk...@builds.apache.org>
Subject Build failed in Jenkins: beam_PostCommit_Python_ValidatesRunner_Dataflow #1042
Date Sun, 04 Mar 2018 15:15:39 GMT
See <https://builds.apache.org/job/beam_PostCommit_Python_ValidatesRunner_Dataflow/1042/display/redirect>

------------------------------------------
[...truncated 117.88 KB...]
  File "<https://builds.apache.org/job/beam_PostCommit_Python_ValidatesRunner_Dataflow/ws/src/sdks/python/apache_beam/runners/pipeline_context.py",>
line 69, in get_by_id
    self._id_to_proto[id], self._pipeline_context)
  File "<https://builds.apache.org/job/beam_PostCommit_Python_ValidatesRunner_Dataflow/ws/src/sdks/python/apache_beam/pipeline.py",>
line 842, in from_runner_api
    part = context.transforms.get_by_id(transform_id)
  File "<https://builds.apache.org/job/beam_PostCommit_Python_ValidatesRunner_Dataflow/ws/src/sdks/python/apache_beam/runners/pipeline_context.py",>
line 69, in get_by_id
    self._id_to_proto[id], self._pipeline_context)
  File "<https://builds.apache.org/job/beam_PostCommit_Python_ValidatesRunner_Dataflow/ws/src/sdks/python/apache_beam/pipeline.py",>
line 842, in from_runner_api
    part = context.transforms.get_by_id(transform_id)
  File "<https://builds.apache.org/job/beam_PostCommit_Python_ValidatesRunner_Dataflow/ws/src/sdks/python/apache_beam/runners/pipeline_context.py",>
line 69, in get_by_id
    self._id_to_proto[id], self._pipeline_context)
  File "<https://builds.apache.org/job/beam_PostCommit_Python_ValidatesRunner_Dataflow/ws/src/sdks/python/apache_beam/pipeline.py",>
line 842, in from_runner_api
    part = context.transforms.get_by_id(transform_id)
  File "<https://builds.apache.org/job/beam_PostCommit_Python_ValidatesRunner_Dataflow/ws/src/sdks/python/apache_beam/runners/pipeline_context.py",>
line 69, in get_by_id
    self._id_to_proto[id], self._pipeline_context)
  File "<https://builds.apache.org/job/beam_PostCommit_Python_ValidatesRunner_Dataflow/ws/src/sdks/python/apache_beam/pipeline.py",>
line 847, in from_runner_api
    for tag, id in proto.outputs.items()}
  File "<https://builds.apache.org/job/beam_PostCommit_Python_ValidatesRunner_Dataflow/ws/src/sdks/python/apache_beam/pipeline.py",>
line 847, in <dictcomp>
    for tag, id in proto.outputs.items()}
  File "<https://builds.apache.org/job/beam_PostCommit_Python_ValidatesRunner_Dataflow/ws/src/sdks/python/apache_beam/runners/pipeline_context.py",>
line 69, in get_by_id
    self._id_to_proto[id], self._pipeline_context)
  File "<https://builds.apache.org/job/beam_PostCommit_Python_ValidatesRunner_Dataflow/ws/src/sdks/python/apache_beam/pvalue.py",>
line 152, in from_runner_api
    element_type=pickler.loads(proto.coder_id),
  File "<https://builds.apache.org/job/beam_PostCommit_Python_ValidatesRunner_Dataflow/ws/src/sdks/python/apache_beam/internal/pickler.py",>
line 221, in loads
    return dill.loads(s)
  File "<https://builds.apache.org/job/beam_PostCommit_Python_ValidatesRunner_Dataflow/ws/src/sdks/python/local/lib/python2.7/site-packages/dill/dill.py",>
line 277, in loads
    return load(file)
  File "<https://builds.apache.org/job/beam_PostCommit_Python_ValidatesRunner_Dataflow/ws/src/sdks/python/local/lib/python2.7/site-packages/dill/dill.py",>
line 266, in load
    obj = pik.load()
  File "/usr/lib/python2.7/pickle.py", line 858, in load
    dispatch[key](self)
  File "/usr/lib/python2.7/pickle.py", line 1090, in load_global
    klass = self.find_class(module, name)
  File "<https://builds.apache.org/job/beam_PostCommit_Python_ValidatesRunner_Dataflow/ws/src/sdks/python/local/lib/python2.7/site-packages/dill/dill.py",>
line 423, in find_class
    return StockUnpickler.find_class(self, module, name)
  File "/usr/lib/python2.7/pickle.py", line 1125, in find_class
    mod = sys.modules[module]
  File "<https://builds.apache.org/job/beam_PostCommit_Python_ValidatesRunner_Dataflow/ws/src/sdks/python/.eggs/nose-1.3.7-py2.7.egg/nose/plugins/multiprocess.py",>
line 276, in signalhandler
    raise TimedOutException()
TimedOutException: 'test_flattened_side_input (apache_beam.transforms.sideinputs_test.SideInputsTest)'

======================================================================
ERROR: test_iterable_side_input (apache_beam.transforms.sideinputs_test.SideInputsTest)
----------------------------------------------------------------------
Traceback (most recent call last):
  File "<https://builds.apache.org/job/beam_PostCommit_Python_ValidatesRunner_Dataflow/ws/src/sdks/python/.eggs/nose-1.3.7-py2.7.egg/nose/plugins/multiprocess.py",>
line 812, in run
    test(orig)
  File "<https://builds.apache.org/job/beam_PostCommit_Python_ValidatesRunner_Dataflow/ws/src/sdks/python/.eggs/nose-1.3.7-py2.7.egg/nose/case.py",>
line 45, in __call__
    return self.run(*arg, **kwarg)
  File "<https://builds.apache.org/job/beam_PostCommit_Python_ValidatesRunner_Dataflow/ws/src/sdks/python/.eggs/nose-1.3.7-py2.7.egg/nose/case.py",>
line 133, in run
    self.runTest(result)
  File "<https://builds.apache.org/job/beam_PostCommit_Python_ValidatesRunner_Dataflow/ws/src/sdks/python/.eggs/nose-1.3.7-py2.7.egg/nose/case.py",>
line 151, in runTest
    test(result)
  File "/usr/lib/python2.7/unittest/case.py", line 395, in __call__
    return self.run(*args, **kwds)
  File "/usr/lib/python2.7/unittest/case.py", line 331, in run
    testMethod()
  File "<https://builds.apache.org/job/beam_PostCommit_Python_ValidatesRunner_Dataflow/ws/src/sdks/python/apache_beam/transforms/sideinputs_test.py",>
line 178, in test_iterable_side_input
    pipeline.run()
  File "<https://builds.apache.org/job/beam_PostCommit_Python_ValidatesRunner_Dataflow/ws/src/sdks/python/apache_beam/testing/test_pipeline.py",>
line 102, in run
    result = super(TestPipeline, self).run()
  File "<https://builds.apache.org/job/beam_PostCommit_Python_ValidatesRunner_Dataflow/ws/src/sdks/python/apache_beam/pipeline.py",>
line 369, in run
    self.to_runner_api(), self.runner, self._options).run(False)
  File "<https://builds.apache.org/job/beam_PostCommit_Python_ValidatesRunner_Dataflow/ws/src/sdks/python/apache_beam/pipeline.py",>
line 382, in run
    return self.runner.run_pipeline(self)
  File "<https://builds.apache.org/job/beam_PostCommit_Python_ValidatesRunner_Dataflow/ws/src/sdks/python/apache_beam/runners/dataflow/dataflow_runner.py",>
line 285, in run_pipeline
    return_context=True)
  File "<https://builds.apache.org/job/beam_PostCommit_Python_ValidatesRunner_Dataflow/ws/src/sdks/python/apache_beam/pipeline.py",>
line 580, in to_runner_api
    root_transform_id = context.transforms.get_id(self._root_transform())
  File "<https://builds.apache.org/job/beam_PostCommit_Python_ValidatesRunner_Dataflow/ws/src/sdks/python/apache_beam/runners/pipeline_context.py",>
line 60, in get_id
    self._id_to_proto[id] = obj.to_runner_api(self._pipeline_context)
  File "<https://builds.apache.org/job/beam_PostCommit_Python_ValidatesRunner_Dataflow/ws/src/sdks/python/apache_beam/pipeline.py",>
line 810, in to_runner_api
    for part in self.parts],
  File "<https://builds.apache.org/job/beam_PostCommit_Python_ValidatesRunner_Dataflow/ws/src/sdks/python/apache_beam/runners/pipeline_context.py",>
line 60, in get_id
    self._id_to_proto[id] = obj.to_runner_api(self._pipeline_context)
  File "<https://builds.apache.org/job/beam_PostCommit_Python_ValidatesRunner_Dataflow/ws/src/sdks/python/apache_beam/pipeline.py",>
line 810, in to_runner_api
    for part in self.parts],
  File "<https://builds.apache.org/job/beam_PostCommit_Python_ValidatesRunner_Dataflow/ws/src/sdks/python/apache_beam/runners/pipeline_context.py",>
line 60, in get_id
    self._id_to_proto[id] = obj.to_runner_api(self._pipeline_context)
  File "<https://builds.apache.org/job/beam_PostCommit_Python_ValidatesRunner_Dataflow/ws/src/sdks/python/apache_beam/pipeline.py",>
line 808, in to_runner_api
    spec=transform_to_runner_api(self.transform, context),
  File "<https://builds.apache.org/job/beam_PostCommit_Python_ValidatesRunner_Dataflow/ws/src/sdks/python/apache_beam/pipeline.py",>
line 805, in transform_to_runner_api
    return transform.to_runner_api(context)
  File "<https://builds.apache.org/job/beam_PostCommit_Python_ValidatesRunner_Dataflow/ws/src/sdks/python/apache_beam/transforms/ptransform.py",>
line 542, in to_runner_api
    urn, typed_param = self.to_runner_api_parameter(context)
  File "<https://builds.apache.org/job/beam_PostCommit_Python_ValidatesRunner_Dataflow/ws/src/sdks/python/apache_beam/io/iobase.py",>
line 839, in to_runner_api_parameter
    source=self.source.to_runner_api(context),
  File "<https://builds.apache.org/job/beam_PostCommit_Python_ValidatesRunner_Dataflow/ws/src/sdks/python/apache_beam/utils/urns.py",>
line 94, in to_runner_api
    urn, typed_param = self.to_runner_api_parameter(context)
  File "<https://builds.apache.org/job/beam_PostCommit_Python_ValidatesRunner_Dataflow/ws/src/sdks/python/apache_beam/utils/urns.py",>
line 82, in <lambda>
    pickle_urn, wrappers_pb2.BytesValue(value=pickler.dumps(self))))
  File "<https://builds.apache.org/job/beam_PostCommit_Python_ValidatesRunner_Dataflow/ws/src/sdks/python/apache_beam/internal/pickler.py",>
line 206, in dumps
    c = zlib.compress(s, 9)
  File "<https://builds.apache.org/job/beam_PostCommit_Python_ValidatesRunner_Dataflow/ws/src/sdks/python/.eggs/nose-1.3.7-py2.7.egg/nose/plugins/multiprocess.py",>
line 276, in signalhandler
    raise TimedOutException()
TimedOutException: 'test_iterable_side_input (apache_beam.transforms.sideinputs_test.SideInputsTest)'

======================================================================
ERROR: test_multi_valued_singleton_side_input (apache_beam.transforms.sideinputs_test.SideInputsTest)
----------------------------------------------------------------------
Traceback (most recent call last):
  File "<https://builds.apache.org/job/beam_PostCommit_Python_ValidatesRunner_Dataflow/ws/src/sdks/python/.eggs/nose-1.3.7-py2.7.egg/nose/plugins/multiprocess.py",>
line 812, in run
    test(orig)
  File "<https://builds.apache.org/job/beam_PostCommit_Python_ValidatesRunner_Dataflow/ws/src/sdks/python/.eggs/nose-1.3.7-py2.7.egg/nose/case.py",>
line 45, in __call__
    return self.run(*arg, **kwarg)
  File "<https://builds.apache.org/job/beam_PostCommit_Python_ValidatesRunner_Dataflow/ws/src/sdks/python/.eggs/nose-1.3.7-py2.7.egg/nose/case.py",>
line 133, in run
    self.runTest(result)
  File "<https://builds.apache.org/job/beam_PostCommit_Python_ValidatesRunner_Dataflow/ws/src/sdks/python/.eggs/nose-1.3.7-py2.7.egg/nose/case.py",>
line 151, in runTest
    test(result)
  File "/usr/lib/python2.7/unittest/case.py", line 395, in __call__
    return self.run(*args, **kwds)
  File "/usr/lib/python2.7/unittest/case.py", line 331, in run
    testMethod()
  File "<https://builds.apache.org/job/beam_PostCommit_Python_ValidatesRunner_Dataflow/ws/src/sdks/python/apache_beam/transforms/sideinputs_test.py",>
line 157, in test_multi_valued_singleton_side_input
    pipeline.run()
  File "<https://builds.apache.org/job/beam_PostCommit_Python_ValidatesRunner_Dataflow/ws/src/sdks/python/apache_beam/testing/test_pipeline.py",>
line 102, in run
    result = super(TestPipeline, self).run()
  File "<https://builds.apache.org/job/beam_PostCommit_Python_ValidatesRunner_Dataflow/ws/src/sdks/python/apache_beam/pipeline.py",>
line 369, in run
    self.to_runner_api(), self.runner, self._options).run(False)
  File "<https://builds.apache.org/job/beam_PostCommit_Python_ValidatesRunner_Dataflow/ws/src/sdks/python/apache_beam/pipeline.py",>
line 382, in run
    return self.runner.run_pipeline(self)
  File "<https://builds.apache.org/job/beam_PostCommit_Python_ValidatesRunner_Dataflow/ws/src/sdks/python/apache_beam/runners/dataflow/dataflow_runner.py",>
line 324, in run_pipeline
    self.dataflow_client.create_job(self.job), self)
  File "<https://builds.apache.org/job/beam_PostCommit_Python_ValidatesRunner_Dataflow/ws/src/sdks/python/apache_beam/utils/retry.py",>
line 180, in wrapper
    return fun(*args, **kwargs)
  File "<https://builds.apache.org/job/beam_PostCommit_Python_ValidatesRunner_Dataflow/ws/src/sdks/python/apache_beam/runners/dataflow/internal/apiclient.py",>
line 461, in create_job
    self.create_job_description(job)
  File "<https://builds.apache.org/job/beam_PostCommit_Python_ValidatesRunner_Dataflow/ws/src/sdks/python/apache_beam/runners/dataflow/internal/apiclient.py",>
line 487, in create_job_description
    StringIO(job.proto_pipeline.SerializeToString()))
  File "<https://builds.apache.org/job/beam_PostCommit_Python_ValidatesRunner_Dataflow/ws/src/sdks/python/apache_beam/runners/dataflow/internal/apiclient.py",>
line 443, in stage_file
    response = self._storage_client.objects.Insert(request, upload=upload)
  File "<https://builds.apache.org/job/beam_PostCommit_Python_ValidatesRunner_Dataflow/ws/src/sdks/python/apache_beam/io/gcp/internal/clients/storage/storage_v1_client.py",>
line 971, in Insert
    download=download)
  File "<https://builds.apache.org/job/beam_PostCommit_Python_ValidatesRunner_Dataflow/ws/src/sdks/python/local/lib/python2.7/site-packages/apitools/base/py/base_api.py",>
line 720, in _RunMethod
    http, http_request, **opts)
  File "<https://builds.apache.org/job/beam_PostCommit_Python_ValidatesRunner_Dataflow/ws/src/sdks/python/local/lib/python2.7/site-packages/apitools/base/py/http_wrapper.py",>
line 346, in MakeRequest
    check_response_func=check_response_func)
  File "<https://builds.apache.org/job/beam_PostCommit_Python_ValidatesRunner_Dataflow/ws/src/sdks/python/local/lib/python2.7/site-packages/apitools/base/py/http_wrapper.py",>
line 396, in _MakeRequestNoRetry
    redirections=redirections, connection_type=connection_type)
  File "<https://builds.apache.org/job/beam_PostCommit_Python_ValidatesRunner_Dataflow/ws/src/sdks/python/local/lib/python2.7/site-packages/oauth2client/transport.py",>
line 175, in new_request
    redirections, connection_type)
  File "<https://builds.apache.org/job/beam_PostCommit_Python_ValidatesRunner_Dataflow/ws/src/sdks/python/local/lib/python2.7/site-packages/oauth2client/transport.py",>
line 282, in request
    connection_type=connection_type)
  File "<https://builds.apache.org/job/beam_PostCommit_Python_ValidatesRunner_Dataflow/ws/src/sdks/python/local/lib/python2.7/site-packages/httplib2/__init__.py",>
line 1609, in request
    (response, content) = self._request(conn, authority, uri, request_uri, method, body, headers,
redirections, cachekey)
  File "<https://builds.apache.org/job/beam_PostCommit_Python_ValidatesRunner_Dataflow/ws/src/sdks/python/local/lib/python2.7/site-packages/httplib2/__init__.py",>
line 1351, in _request
    (response, content) = self._conn_request(conn, request_uri, method, body, headers)
  File "<https://builds.apache.org/job/beam_PostCommit_Python_ValidatesRunner_Dataflow/ws/src/sdks/python/local/lib/python2.7/site-packages/httplib2/__init__.py",>
line 1307, in _conn_request
    response = conn.getresponse()
  File "/usr/lib/python2.7/httplib.py", line 1089, in getresponse
    response.begin()
  File "/usr/lib/python2.7/httplib.py", line 444, in begin
    version, status, reason = self._read_status()
  File "/usr/lib/python2.7/httplib.py", line 400, in _read_status
    line = self.fp.readline(_MAXLINE + 1)
  File "/usr/lib/python2.7/socket.py", line 476, in readline
    data = self._sock.recv(self._rbufsize)
  File "/usr/lib/python2.7/ssl.py", line 341, in recv
    return self.read(buflen)
  File "/usr/lib/python2.7/ssl.py", line 260, in read
    return self._sslobj.read(len)
  File "<https://builds.apache.org/job/beam_PostCommit_Python_ValidatesRunner_Dataflow/ws/src/sdks/python/.eggs/nose-1.3.7-py2.7.egg/nose/plugins/multiprocess.py",>
line 276, in signalhandler
    raise TimedOutException()
TimedOutException: 'test_multi_valued_singleton_side_input (apache_beam.transforms.sideinputs_test.SideInputsTest)'

======================================================================
ERROR: test_multiple_empty_outputs (apache_beam.transforms.ptransform_test.PTransformTest)
----------------------------------------------------------------------
Traceback (most recent call last):
  File "<https://builds.apache.org/job/beam_PostCommit_Python_ValidatesRunner_Dataflow/ws/src/sdks/python/.eggs/nose-1.3.7-py2.7.egg/nose/plugins/multiprocess.py",>
line 812, in run
    test(orig)
  File "<https://builds.apache.org/job/beam_PostCommit_Python_ValidatesRunner_Dataflow/ws/src/sdks/python/.eggs/nose-1.3.7-py2.7.egg/nose/case.py",>
line 45, in __call__
    return self.run(*arg, **kwarg)
  File "<https://builds.apache.org/job/beam_PostCommit_Python_ValidatesRunner_Dataflow/ws/src/sdks/python/.eggs/nose-1.3.7-py2.7.egg/nose/case.py",>
line 133, in run
    self.runTest(result)
  File "<https://builds.apache.org/job/beam_PostCommit_Python_ValidatesRunner_Dataflow/ws/src/sdks/python/.eggs/nose-1.3.7-py2.7.egg/nose/case.py",>
line 151, in runTest
    test(result)
  File "/usr/lib/python2.7/unittest/case.py", line 395, in __call__
    return self.run(*args, **kwds)
  File "/usr/lib/python2.7/unittest/case.py", line 331, in run
    testMethod()
  File "<https://builds.apache.org/job/beam_PostCommit_Python_ValidatesRunner_Dataflow/ws/src/sdks/python/apache_beam/transforms/ptransform_test.py",>
line 271, in test_multiple_empty_outputs
    pipeline.run()
  File "<https://builds.apache.org/job/beam_PostCommit_Python_ValidatesRunner_Dataflow/ws/src/sdks/python/apache_beam/testing/test_pipeline.py",>
line 104, in run
    state = result.wait_until_finish()
  File "<https://builds.apache.org/job/beam_PostCommit_Python_ValidatesRunner_Dataflow/ws/src/sdks/python/apache_beam/runners/dataflow/dataflow_runner.py",>
line 987, in wait_until_finish
    time.sleep(5.0)
  File "<https://builds.apache.org/job/beam_PostCommit_Python_ValidatesRunner_Dataflow/ws/src/sdks/python/.eggs/nose-1.3.7-py2.7.egg/nose/plugins/multiprocess.py",>
line 276, in signalhandler
    raise TimedOutException()
TimedOutException: 'test_multiple_empty_outputs (apache_beam.transforms.ptransform_test.PTransformTest)'

======================================================================
ERROR: test_par_do_with_multiple_outputs_and_using_return (apache_beam.transforms.ptransform_test.PTransformTest)
----------------------------------------------------------------------
Traceback (most recent call last):
  File "<https://builds.apache.org/job/beam_PostCommit_Python_ValidatesRunner_Dataflow/ws/src/sdks/python/.eggs/nose-1.3.7-py2.7.egg/nose/plugins/multiprocess.py",>
line 812, in run
    test(orig)
  File "<https://builds.apache.org/job/beam_PostCommit_Python_ValidatesRunner_Dataflow/ws/src/sdks/python/.eggs/nose-1.3.7-py2.7.egg/nose/case.py",>
line 45, in __call__
    return self.run(*arg, **kwarg)
  File "<https://builds.apache.org/job/beam_PostCommit_Python_ValidatesRunner_Dataflow/ws/src/sdks/python/.eggs/nose-1.3.7-py2.7.egg/nose/case.py",>
line 133, in run
    self.runTest(result)
  File "<https://builds.apache.org/job/beam_PostCommit_Python_ValidatesRunner_Dataflow/ws/src/sdks/python/.eggs/nose-1.3.7-py2.7.egg/nose/case.py",>
line 151, in runTest
    test(result)
  File "/usr/lib/python2.7/unittest/case.py", line 395, in __call__
    return self.run(*args, **kwds)
  File "/usr/lib/python2.7/unittest/case.py", line 331, in run
    testMethod()
  File "<https://builds.apache.org/job/beam_PostCommit_Python_ValidatesRunner_Dataflow/ws/src/sdks/python/apache_beam/transforms/ptransform_test.py",>
line 244, in test_par_do_with_multiple_outputs_and_using_return
    pipeline.run()
  File "<https://builds.apache.org/job/beam_PostCommit_Python_ValidatesRunner_Dataflow/ws/src/sdks/python/apache_beam/testing/test_pipeline.py",>
line 104, in run
    state = result.wait_until_finish()
  File "<https://builds.apache.org/job/beam_PostCommit_Python_ValidatesRunner_Dataflow/ws/src/sdks/python/apache_beam/runners/dataflow/dataflow_runner.py",>
line 987, in wait_until_finish
    time.sleep(5.0)
  File "<https://builds.apache.org/job/beam_PostCommit_Python_ValidatesRunner_Dataflow/ws/src/sdks/python/.eggs/nose-1.3.7-py2.7.egg/nose/plugins/multiprocess.py",>
line 276, in signalhandler
    raise TimedOutException()
TimedOutException: 'test_par_do_with_multiple_outputs_and_using_return (apache_beam.transforms.ptransform_test.PTransformTest)'

======================================================================
ERROR: test_par_do_with_multiple_outputs_and_using_yield (apache_beam.transforms.ptransform_test.PTransformTest)
----------------------------------------------------------------------
Traceback (most recent call last):
  File "<https://builds.apache.org/job/beam_PostCommit_Python_ValidatesRunner_Dataflow/ws/src/sdks/python/.eggs/nose-1.3.7-py2.7.egg/nose/plugins/multiprocess.py",>
line 812, in run
    test(orig)
  File "<https://builds.apache.org/job/beam_PostCommit_Python_ValidatesRunner_Dataflow/ws/src/sdks/python/.eggs/nose-1.3.7-py2.7.egg/nose/case.py",>
line 45, in __call__
    return self.run(*arg, **kwarg)
  File "<https://builds.apache.org/job/beam_PostCommit_Python_ValidatesRunner_Dataflow/ws/src/sdks/python/.eggs/nose-1.3.7-py2.7.egg/nose/case.py",>
line 133, in run
    self.runTest(result)
  File "<https://builds.apache.org/job/beam_PostCommit_Python_ValidatesRunner_Dataflow/ws/src/sdks/python/.eggs/nose-1.3.7-py2.7.egg/nose/case.py",>
line 151, in runTest
    test(result)
  File "/usr/lib/python2.7/unittest/case.py", line 395, in __call__
    return self.run(*args, **kwds)
  File "/usr/lib/python2.7/unittest/case.py", line 331, in run
    testMethod()
  File "<https://builds.apache.org/job/beam_PostCommit_Python_ValidatesRunner_Dataflow/ws/src/sdks/python/apache_beam/transforms/ptransform_test.py",>
line 228, in test_par_do_with_multiple_outputs_and_using_yield
    pipeline.run()
  File "<https://builds.apache.org/job/beam_PostCommit_Python_ValidatesRunner_Dataflow/ws/src/sdks/python/apache_beam/testing/test_pipeline.py",>
line 104, in run
    state = result.wait_until_finish()
  File "<https://builds.apache.org/job/beam_PostCommit_Python_ValidatesRunner_Dataflow/ws/src/sdks/python/apache_beam/runners/dataflow/dataflow_runner.py",>
line 987, in wait_until_finish
    time.sleep(5.0)
  File "<https://builds.apache.org/job/beam_PostCommit_Python_ValidatesRunner_Dataflow/ws/src/sdks/python/.eggs/nose-1.3.7-py2.7.egg/nose/plugins/multiprocess.py",>
line 276, in signalhandler
    raise TimedOutException()
TimedOutException: 'test_par_do_with_multiple_outputs_and_using_yield (apache_beam.transforms.ptransform_test.PTransformTest)'

----------------------------------------------------------------------
Ran 16 tests in 903.370s

FAILED (errors=16)
Build step 'Execute shell' marked build as failure
Not sending mail to unregistered user ehudm@google.com
Not sending mail to unregistered user XuMingmin@users.noreply.github.com

Mime
View raw message