beam-commits mailing list archives

Site index · List index
Message view « Date » · « Thread »
Top « Date » · « Thread »
From Apache Jenkins Server <jenk...@builds.apache.org>
Subject Build failed in Jenkins: beam_PerformanceTests_Python #1058
Date Fri, 23 Mar 2018 18:24:23 GMT
See <https://builds.apache.org/job/beam_PerformanceTests_Python/1058/display/redirect?page=changes>

Changes:

[szewinho] [BEAM-3060] Fixing mvn dependency issue when runnning filebasedIOIT

[szewinho] Jax-api added to dependencyManagement.

[szewinho] Jaxb-api added to beam root pom.xml

[szewinho] Removed empty line

[szewinho] Updated gradle build to use jaxb-api. Jaxb-api version set to 2.2.12

[szewinho] Scope removed from root pom.xml and jaxb-api dependency set to

[tgroh] Move getId to the top-level pipeline node

[tgroh] Add FusedPipeline#toPipeline

[markliu] [BEAM-3861] Complete streaming wordcount test in Python SDK

------------------------------------------
[...truncated 2.97 KB...]
Cloning into 'PerfKitBenchmarker'...
[beam_PerformanceTests_Python] $ /bin/bash -xe /tmp/jenkins4010297507203666870.sh
+ .env/bin/pip install -r PerfKitBenchmarker/requirements.txt
Collecting absl-py (from -r PerfKitBenchmarker/requirements.txt (line 14))
Requirement already satisfied: jinja2>=2.7 in /usr/local/lib/python2.7/dist-packages (from
-r PerfKitBenchmarker/requirements.txt (line 15))
Requirement already satisfied: setuptools in ./.env/lib/python2.7/site-packages (from -r PerfKitBenchmarker/requirements.txt
(line 16))
Collecting colorlog[windows]==2.6.0 (from -r PerfKitBenchmarker/requirements.txt (line 17))
  Using cached colorlog-2.6.0-py2.py3-none-any.whl
Collecting blinker>=1.3 (from -r PerfKitBenchmarker/requirements.txt (line 18))
Collecting futures>=3.0.3 (from -r PerfKitBenchmarker/requirements.txt (line 19))
  Using cached futures-3.2.0-py2-none-any.whl
Requirement already satisfied: PyYAML==3.12 in /usr/local/lib/python2.7/dist-packages (from
-r PerfKitBenchmarker/requirements.txt (line 20))
Collecting pint>=0.7 (from -r PerfKitBenchmarker/requirements.txt (line 21))
Collecting numpy==1.13.3 (from -r PerfKitBenchmarker/requirements.txt (line 22))
  Using cached numpy-1.13.3-cp27-cp27mu-manylinux1_x86_64.whl
Requirement already satisfied: functools32 in /usr/local/lib/python2.7/dist-packages (from
-r PerfKitBenchmarker/requirements.txt (line 23))
Collecting contextlib2>=0.5.1 (from -r PerfKitBenchmarker/requirements.txt (line 24))
  Using cached contextlib2-0.5.5-py2.py3-none-any.whl
Collecting pywinrm (from -r PerfKitBenchmarker/requirements.txt (line 25))
  Using cached pywinrm-0.3.0-py2.py3-none-any.whl
Requirement already satisfied: six in /usr/local/lib/python2.7/dist-packages (from absl-py->-r
PerfKitBenchmarker/requirements.txt (line 14))
Requirement already satisfied: MarkupSafe>=0.23 in /usr/local/lib/python2.7/dist-packages
(from jinja2>=2.7->-r PerfKitBenchmarker/requirements.txt (line 15))
Requirement already satisfied: colorama; extra == "windows" in /usr/lib/python2.7/dist-packages
(from colorlog[windows]==2.6.0->-r PerfKitBenchmarker/requirements.txt (line 17))
Collecting xmltodict (from pywinrm->-r PerfKitBenchmarker/requirements.txt (line 25))
  Using cached xmltodict-0.11.0-py2.py3-none-any.whl
Collecting requests-ntlm>=0.3.0 (from pywinrm->-r PerfKitBenchmarker/requirements.txt
(line 25))
  Using cached requests_ntlm-1.1.0-py2.py3-none-any.whl
Requirement already satisfied: requests>=2.9.1 in /usr/local/lib/python2.7/dist-packages
(from pywinrm->-r PerfKitBenchmarker/requirements.txt (line 25))
Collecting ntlm-auth>=1.0.2 (from requests-ntlm>=0.3.0->pywinrm->-r PerfKitBenchmarker/requirements.txt
(line 25))
  Using cached ntlm_auth-1.1.0-py2.py3-none-any.whl
Collecting cryptography>=1.3 (from requests-ntlm>=0.3.0->pywinrm->-r PerfKitBenchmarker/requirements.txt
(line 25))
  Using cached cryptography-2.2.1-cp27-cp27mu-manylinux1_x86_64.whl
Requirement already satisfied: urllib3<1.23,>=1.21.1 in /usr/local/lib/python2.7/dist-packages
(from requests>=2.9.1->pywinrm->-r PerfKitBenchmarker/requirements.txt (line 25))
Requirement already satisfied: idna<2.7,>=2.5 in /usr/local/lib/python2.7/dist-packages
(from requests>=2.9.1->pywinrm->-r PerfKitBenchmarker/requirements.txt (line 25))
Requirement already satisfied: chardet<3.1.0,>=3.0.2 in /usr/local/lib/python2.7/dist-packages
(from requests>=2.9.1->pywinrm->-r PerfKitBenchmarker/requirements.txt (line 25))
Requirement already satisfied: certifi>=2017.4.17 in /usr/local/lib/python2.7/dist-packages
(from requests>=2.9.1->pywinrm->-r PerfKitBenchmarker/requirements.txt (line 25))
Collecting cffi>=1.7; platform_python_implementation != "PyPy" (from cryptography>=1.3->requests-ntlm>=0.3.0->pywinrm->-r
PerfKitBenchmarker/requirements.txt (line 25))
  Using cached cffi-1.11.5-cp27-cp27mu-manylinux1_x86_64.whl
Requirement already satisfied: enum34; python_version < "3" in /usr/local/lib/python2.7/dist-packages
(from cryptography>=1.3->requests-ntlm>=0.3.0->pywinrm->-r PerfKitBenchmarker/requirements.txt
(line 25))
Collecting asn1crypto>=0.21.0 (from cryptography>=1.3->requests-ntlm>=0.3.0->pywinrm->-r
PerfKitBenchmarker/requirements.txt (line 25))
  Using cached asn1crypto-0.24.0-py2.py3-none-any.whl
Requirement already satisfied: ipaddress; python_version < "3" in /usr/local/lib/python2.7/dist-packages
(from cryptography>=1.3->requests-ntlm>=0.3.0->pywinrm->-r PerfKitBenchmarker/requirements.txt
(line 25))
Collecting pycparser (from cffi>=1.7; platform_python_implementation != "PyPy"->cryptography>=1.3->requests-ntlm>=0.3.0->pywinrm->-r
PerfKitBenchmarker/requirements.txt (line 25))
Installing collected packages: absl-py, colorlog, blinker, futures, pint, numpy, contextlib2,
xmltodict, ntlm-auth, pycparser, cffi, asn1crypto, cryptography, requests-ntlm, pywinrm
Successfully installed absl-py-0.1.12 asn1crypto-0.24.0 blinker-1.4 cffi-1.11.5 colorlog-2.6.0
contextlib2-0.5.5 cryptography-2.2.1 futures-3.2.0 ntlm-auth-1.1.0 numpy-1.13.3 pint-0.8.1
pycparser-2.18 pywinrm-0.3.0 requests-ntlm-1.1.0 xmltodict-0.11.0
[beam_PerformanceTests_Python] $ /bin/bash -xe /tmp/jenkins5532169205608826010.sh
+ .env/bin/pip install -e 'src/sdks/python/[gcp,test]'
Obtaining file://<https://builds.apache.org/job/beam_PerformanceTests_Python/ws/src/sdks/python>
Collecting avro<2.0.0,>=1.8.1 (from apache-beam==2.5.0.dev0)
Requirement already satisfied: crcmod<2.0,>=1.7 in /usr/lib/python2.7/dist-packages
(from apache-beam==2.5.0.dev0)
Collecting dill==0.2.6 (from apache-beam==2.5.0.dev0)
Collecting grpcio<2,>=1.8 (from apache-beam==2.5.0.dev0)
  Using cached grpcio-1.10.0-cp27-cp27mu-manylinux1_x86_64.whl
Collecting hdfs<3.0.0,>=2.1.0 (from apache-beam==2.5.0.dev0)
Collecting httplib2<0.10,>=0.8 (from apache-beam==2.5.0.dev0)
Collecting mock<3.0.0,>=1.0.1 (from apache-beam==2.5.0.dev0)
  Using cached mock-2.0.0-py2.py3-none-any.whl
Collecting oauth2client<5,>=2.0.1 (from apache-beam==2.5.0.dev0)
  Using cached oauth2client-4.1.2-py2.py3-none-any.whl
Collecting protobuf<4,>=3.5.0.post1 (from apache-beam==2.5.0.dev0)
  Using cached protobuf-3.5.2.post1-cp27-cp27mu-manylinux1_x86_64.whl
Requirement already satisfied: pyyaml<4.0.0,>=3.12 in /usr/local/lib/python2.7/dist-packages
(from apache-beam==2.5.0.dev0)
Collecting pyvcf<0.7.0,>=0.6.8 (from apache-beam==2.5.0.dev0)
Requirement already satisfied: six<1.12,>=1.9 in /usr/local/lib/python2.7/dist-packages
(from apache-beam==2.5.0.dev0)
Collecting typing<3.7.0,>=3.6.0 (from apache-beam==2.5.0.dev0)
  Using cached typing-3.6.4-py2-none-any.whl
Requirement already satisfied: futures<4.0.0,>=3.1.1 in ./.env/lib/python2.7/site-packages
(from apache-beam==2.5.0.dev0)
Collecting google-apitools<=0.5.20,>=0.5.18 (from apache-beam==2.5.0.dev0)
  Using cached google_apitools-0.5.20-py2-none-any.whl
Collecting proto-google-cloud-datastore-v1<=0.90.4,>=0.90.0 (from apache-beam==2.5.0.dev0)
Collecting googledatastore==7.0.1 (from apache-beam==2.5.0.dev0)
Collecting google-cloud-pubsub==0.26.0 (from apache-beam==2.5.0.dev0)
  Using cached google_cloud_pubsub-0.26.0-py2.py3-none-any.whl
Collecting proto-google-cloud-pubsub-v1==0.15.4 (from apache-beam==2.5.0.dev0)
Collecting google-cloud-bigquery==0.25.0 (from apache-beam==2.5.0.dev0)
  Using cached google_cloud_bigquery-0.25.0-py2.py3-none-any.whl
Collecting pyhamcrest<2.0,>=1.9 (from apache-beam==2.5.0.dev0)
  Using cached PyHamcrest-1.9.0-py2.py3-none-any.whl
Requirement already satisfied: enum34>=1.0.4 in /usr/local/lib/python2.7/dist-packages
(from grpcio<2,>=1.8->apache-beam==2.5.0.dev0)
Requirement already satisfied: requests>=2.7.0 in /usr/local/lib/python2.7/dist-packages
(from hdfs<3.0.0,>=2.1.0->apache-beam==2.5.0.dev0)
Requirement already satisfied: docopt in /usr/local/lib/python2.7/dist-packages (from hdfs<3.0.0,>=2.1.0->apache-beam==2.5.0.dev0)
Collecting funcsigs>=1; python_version < "3.3" (from mock<3.0.0,>=1.0.1->apache-beam==2.5.0.dev0)
  Using cached funcsigs-1.0.2-py2.py3-none-any.whl
Collecting pbr>=0.11 (from mock<3.0.0,>=1.0.1->apache-beam==2.5.0.dev0)
  Using cached pbr-3.1.1-py2.py3-none-any.whl
Collecting rsa>=3.1.4 (from oauth2client<5,>=2.0.1->apache-beam==2.5.0.dev0)
  Using cached rsa-3.4.2-py2.py3-none-any.whl
Collecting pyasn1-modules>=0.0.5 (from oauth2client<5,>=2.0.1->apache-beam==2.5.0.dev0)
  Using cached pyasn1_modules-0.2.1-py2.py3-none-any.whl
Requirement already satisfied: pyasn1>=0.1.7 in /usr/local/lib/python2.7/dist-packages
(from oauth2client<5,>=2.0.1->apache-beam==2.5.0.dev0)
Requirement already satisfied: setuptools in ./.env/lib/python2.7/site-packages (from protobuf<4,>=3.5.0.post1->apache-beam==2.5.0.dev0)
Collecting fasteners>=0.14 (from google-apitools<=0.5.20,>=0.5.18->apache-beam==2.5.0.dev0)
  Using cached fasteners-0.14.1-py2.py3-none-any.whl
Collecting googleapis-common-protos<2.0dev,>=1.5.2 (from proto-google-cloud-datastore-v1<=0.90.4,>=0.90.0->apache-beam==2.5.0.dev0)
Collecting google-cloud-core<0.26dev,>=0.25.0 (from google-cloud-pubsub==0.26.0->apache-beam==2.5.0.dev0)
  Using cached google_cloud_core-0.25.0-py2.py3-none-any.whl
Collecting gapic-google-cloud-pubsub-v1<0.16dev,>=0.15.0 (from google-cloud-pubsub==0.26.0->apache-beam==2.5.0.dev0)
Requirement already satisfied: urllib3<1.23,>=1.21.1 in /usr/local/lib/python2.7/dist-packages
(from requests>=2.7.0->hdfs<3.0.0,>=2.1.0->apache-beam==2.5.0.dev0)
Requirement already satisfied: idna<2.7,>=2.5 in /usr/local/lib/python2.7/dist-packages
(from requests>=2.7.0->hdfs<3.0.0,>=2.1.0->apache-beam==2.5.0.dev0)
Requirement already satisfied: chardet<3.1.0,>=3.0.2 in /usr/local/lib/python2.7/dist-packages
(from requests>=2.7.0->hdfs<3.0.0,>=2.1.0->apache-beam==2.5.0.dev0)
Requirement already satisfied: certifi>=2017.4.17 in /usr/local/lib/python2.7/dist-packages
(from requests>=2.7.0->hdfs<3.0.0,>=2.1.0->apache-beam==2.5.0.dev0)
Collecting monotonic>=0.1 (from fasteners>=0.14->google-apitools<=0.5.20,>=0.5.18->apache-beam==2.5.0.dev0)
  Using cached monotonic-1.4-py2.py3-none-any.whl
Collecting google-auth<2.0.0dev,>=0.4.0 (from google-cloud-core<0.26dev,>=0.25.0->google-cloud-pubsub==0.26.0->apache-beam==2.5.0.dev0)
  Using cached google_auth-1.4.1-py2.py3-none-any.whl
Collecting google-auth-httplib2 (from google-cloud-core<0.26dev,>=0.25.0->google-cloud-pubsub==0.26.0->apache-beam==2.5.0.dev0)
  Using cached google_auth_httplib2-0.0.3-py2.py3-none-any.whl
Collecting google-gax<0.16dev,>=0.15.7 (from gapic-google-cloud-pubsub-v1<0.16dev,>=0.15.0->google-cloud-pubsub==0.26.0->apache-beam==2.5.0.dev0)
  Using cached google_gax-0.15.16-py2.py3-none-any.whl
Collecting grpc-google-iam-v1<0.12dev,>=0.11.1 (from gapic-google-cloud-pubsub-v1<0.16dev,>=0.15.0->google-cloud-pubsub==0.26.0->apache-beam==2.5.0.dev0)
Collecting cachetools>=2.0.0 (from google-auth<2.0.0dev,>=0.4.0->google-cloud-core<0.26dev,>=0.25.0->google-cloud-pubsub==0.26.0->apache-beam==2.5.0.dev0)
  Using cached cachetools-2.0.1-py2.py3-none-any.whl
Collecting future<0.17dev,>=0.16.0 (from google-gax<0.16dev,>=0.15.7->gapic-google-cloud-pubsub-v1<0.16dev,>=0.15.0->google-cloud-pubsub==0.26.0->apache-beam==2.5.0.dev0)
Collecting ply==3.8 (from google-gax<0.16dev,>=0.15.7->gapic-google-cloud-pubsub-v1<0.16dev,>=0.15.0->google-cloud-pubsub==0.26.0->apache-beam==2.5.0.dev0)
Installing collected packages: avro, dill, protobuf, grpcio, hdfs, httplib2, funcsigs, pbr,
mock, rsa, pyasn1-modules, oauth2client, pyvcf, typing, monotonic, fasteners, google-apitools,
googleapis-common-protos, proto-google-cloud-datastore-v1, googledatastore, cachetools, google-auth,
google-auth-httplib2, google-cloud-core, future, ply, google-gax, grpc-google-iam-v1, proto-google-cloud-pubsub-v1,
gapic-google-cloud-pubsub-v1, google-cloud-pubsub, google-cloud-bigquery, pyhamcrest, apache-beam
  Running setup.py develop for apache-beam
Successfully installed apache-beam avro-1.8.2 cachetools-2.0.1 dill-0.2.6 fasteners-0.14.1
funcsigs-1.0.2 future-0.16.0 gapic-google-cloud-pubsub-v1-0.15.4 google-apitools-0.5.20 google-auth-1.4.1
google-auth-httplib2-0.0.3 google-cloud-bigquery-0.25.0 google-cloud-core-0.25.0 google-cloud-pubsub-0.26.0
google-gax-0.15.16 googleapis-common-protos-1.5.3 googledatastore-7.0.1 grpc-google-iam-v1-0.11.4
grpcio-1.10.0 hdfs-2.1.0 httplib2-0.9.2 mock-2.0.0 monotonic-1.4 oauth2client-4.1.2 pbr-3.1.1
ply-3.8 proto-google-cloud-datastore-v1-0.90.4 proto-google-cloud-pubsub-v1-0.15.4 protobuf-3.5.2.post1
pyasn1-modules-0.2.1 pyhamcrest-1.9.0 pyvcf-0.6.8 rsa-3.4.2 typing-3.6.4
[beam_PerformanceTests_Python] $ /bin/bash -xe /tmp/jenkins1343589978213879825.sh
+ .env/bin/python PerfKitBenchmarker/pkb.py --project=apache-beam-testing --dpb_log_level=INFO
--maven_binary=/home/jenkins/tools/maven/latest/bin/mvn --bigquery_table=beam_performance.pkb_results
--temp_dir=<https://builds.apache.org/job/beam_PerformanceTests_Python/ws/> --official=true
--beam_sdk=python --benchmarks=beam_integration_benchmark --beam_it_args=--project=apache-beam-testing,--staging_location=gs://temp-storage-for-end-to-end-tests/staging-it,--temp_location=gs://temp-storage-for-end-to-end-tests/temp-it,--output=gs://temp-storage-for-end-to-end-tests/py-it-cloud/output
2018-03-23 18:12:58,710 43dc0d26 MainThread INFO     Verbose logging to: <https://builds.apache.org/job/beam_PerformanceTests_Python/ws/runs/43dc0d26/pkb.log>
2018-03-23 18:12:58,710 43dc0d26 MainThread INFO     PerfKitBenchmarker version: v1.12.0-437-g24dd3cb
2018-03-23 18:12:58,711 43dc0d26 MainThread INFO     Flag values:
--beam_sdk=python
--temp_dir=<https://builds.apache.org/job/beam_PerformanceTests_Python/ws/>
--beam_it_args=--project=apache-beam-testing,--staging_location=gs://temp-storage-for-end-to-end-tests/staging-it,--temp_location=gs://temp-storage-for-end-to-end-tests/temp-it,--output=gs://temp-storage-for-end-to-end-tests/py-it-cloud/output
--maven_binary=/home/jenkins/tools/maven/latest/bin/mvn
--project=apache-beam-testing
--bigquery_table=beam_performance.pkb_results
--official
--dpb_log_level=INFO
--benchmarks=beam_integration_benchmark
2018-03-23 18:12:59,246 43dc0d26 MainThread WARNING  The key "flags" was not in the default
config, but was in user overrides. This may indicate a typo.
2018-03-23 18:12:59,247 43dc0d26 MainThread INFO     Initializing the edw service decoder
2018-03-23 18:12:59,481 43dc0d26 MainThread beam_integration_benchmark(1/1) INFO     Provisioning
resources for benchmark beam_integration_benchmark
2018-03-23 18:12:59,484 43dc0d26 MainThread beam_integration_benchmark(1/1) INFO     Preparing
benchmark beam_integration_benchmark
2018-03-23 18:12:59,484 43dc0d26 MainThread beam_integration_benchmark(1/1) INFO     Running:
git clone https://github.com/apache/beam.git
2018-03-23 18:13:12,228 43dc0d26 MainThread beam_integration_benchmark(1/1) INFO     Running:
/home/jenkins/tools/maven/latest/bin/mvn clean install -DskipTests -Dcheckstyle.skip=true
-Pdataflow-runner
2018-03-23 18:23:14,247 43dc0d26 MainThread beam_integration_benchmark(1/1) INFO     Running
benchmark beam_integration_benchmark
2018-03-23 18:23:14,443 43dc0d26 MainThread beam_integration_benchmark(1/1) INFO     Running:
python setup.py nosetests --tests=apache_beam.examples.wordcount_it_test --attr=IT --test-pipeline-options="--project=apache-beam-testing"
"--staging_location=gs://temp-storage-for-end-to-end-tests/staging-it" "--temp_location=gs://temp-storage-for-end-to-end-tests/temp-it"
"--output=gs://temp-storage-for-end-to-end-tests/py-it-cloud/output" --runner=TestDataflowRunner
--sdk_location=<https://builds.apache.org/job/beam_PerformanceTests_Python/ws/runs/43dc0d26/beam/sdks/python/target/apache-beam-2.5.0.dev0.tar.gz>
2018-03-23 18:23:15,382 43dc0d26 MainThread beam_integration_benchmark(1/1) INFO     Ran:
{python setup.py nosetests --tests=apache_beam.examples.wordcount_it_test --attr=IT --test-pipeline-options="--project=apache-beam-testing"
"--staging_location=gs://temp-storage-for-end-to-end-tests/staging-it" "--temp_location=gs://temp-storage-for-end-to-end-tests/temp-it"
"--output=gs://temp-storage-for-end-to-end-tests/py-it-cloud/output" --runner=TestDataflowRunner
--sdk_location=<https://builds.apache.org/job/beam_PerformanceTests_Python/ws/runs/43dc0d26/beam/sdks/python/target/apache-beam-2.5.0.dev0.tar.gz}>
 ReturnCode:1
STDOUT: 
STDERR: /usr/local/lib/python2.7/dist-packages/setuptools/dist.py:397: UserWarning: Normalizing
'2.5.0.dev' to '2.5.0.dev0'
  normalized_version,
<https://builds.apache.org/job/beam_PerformanceTests_Python/ws/runs/43dc0d26/beam/sdks/python/.eggs/nose-1.3.7-py2.7.egg/nose/plugins/manager.py>:395:
RuntimeWarning: Unable to load plugin beam_test_plugin = test_config:BeamTestPlugin: The 'futures<4.0.0,>=3.1.1'
distribution was not found and is required by the application
  RuntimeWarning)
usage: setup.py [global_opts] cmd1 [cmd1_opts] [cmd2 [cmd2_opts] ...]
   or: setup.py --help [cmd1 cmd2 ...]
   or: setup.py --help-commands
   or: setup.py cmd --help

error: option --test-pipeline-options not recognized

2018-03-23 18:23:15,382 43dc0d26 MainThread beam_integration_benchmark(1/1) ERROR    Error
during benchmark beam_integration_benchmark
Traceback (most recent call last):
  File "<https://builds.apache.org/job/beam_PerformanceTests_Python/ws/PerfKitBenchmarker/perfkitbenchmarker/pkb.py",>
line 623, in RunBenchmark
    DoRunPhase(spec, collector, detailed_timer)
  File "<https://builds.apache.org/job/beam_PerformanceTests_Python/ws/PerfKitBenchmarker/perfkitbenchmarker/pkb.py",>
line 526, in DoRunPhase
    samples = spec.BenchmarkRun(spec)
  File "<https://builds.apache.org/job/beam_PerformanceTests_Python/ws/PerfKitBenchmarker/perfkitbenchmarker/linux_benchmarks/beam_integration_benchmark.py",>
line 159, in Run
    job_type=job_type)
  File "<https://builds.apache.org/job/beam_PerformanceTests_Python/ws/PerfKitBenchmarker/perfkitbenchmarker/providers/gcp/gcp_dpb_dataflow.py",>
line 90, in SubmitJob
    assert retcode == 0, "Integration Test Failed."
AssertionError: Integration Test Failed.
2018-03-23 18:23:15,383 43dc0d26 MainThread beam_integration_benchmark(1/1) INFO     Cleaning
up benchmark beam_integration_benchmark
2018-03-23 18:23:15,384 43dc0d26 MainThread beam_integration_benchmark(1/1) ERROR    Exception
running benchmark
Traceback (most recent call last):
  File "<https://builds.apache.org/job/beam_PerformanceTests_Python/ws/PerfKitBenchmarker/perfkitbenchmarker/pkb.py",>
line 754, in RunBenchmarkTask
    RunBenchmark(spec, collector)
  File "<https://builds.apache.org/job/beam_PerformanceTests_Python/ws/PerfKitBenchmarker/perfkitbenchmarker/pkb.py",>
line 623, in RunBenchmark
    DoRunPhase(spec, collector, detailed_timer)
  File "<https://builds.apache.org/job/beam_PerformanceTests_Python/ws/PerfKitBenchmarker/perfkitbenchmarker/pkb.py",>
line 526, in DoRunPhase
    samples = spec.BenchmarkRun(spec)
  File "<https://builds.apache.org/job/beam_PerformanceTests_Python/ws/PerfKitBenchmarker/perfkitbenchmarker/linux_benchmarks/beam_integration_benchmark.py",>
line 159, in Run
    job_type=job_type)
  File "<https://builds.apache.org/job/beam_PerformanceTests_Python/ws/PerfKitBenchmarker/perfkitbenchmarker/providers/gcp/gcp_dpb_dataflow.py",>
line 90, in SubmitJob
    assert retcode == 0, "Integration Test Failed."
AssertionError: Integration Test Failed.
2018-03-23 18:23:15,385 43dc0d26 MainThread beam_integration_benchmark(1/1) ERROR    Benchmark
1/1 beam_integration_benchmark (UID: beam_integration_benchmark0) failed. Execution will continue.
2018-03-23 18:23:15,385 43dc0d26 MainThread beam_integration_benchmark(1/1) INFO     Benchmark
run statuses:
---------------------------------------------------------------------------------
Name                        UID                          Status  Failed Substatus
---------------------------------------------------------------------------------
beam_integration_benchmark  beam_integration_benchmark0  FAILED                  
---------------------------------------------------------------------------------
Success rate: 0.00% (0/1)
2018-03-23 18:23:15,385 43dc0d26 MainThread beam_integration_benchmark(1/1) INFO     Complete
logs can be found at: <https://builds.apache.org/job/beam_PerformanceTests_Python/ws/runs/43dc0d26/pkb.log>
2018-03-23 18:23:15,385 43dc0d26 MainThread beam_integration_benchmark(1/1) INFO     Completion
statuses can be found at: <https://builds.apache.org/job/beam_PerformanceTests_Python/ws/runs/43dc0d26/completion_statuses.json>
Build step 'Execute shell' marked build as failure
Not sending mail to unregistered user samuelw@google.com
Not sending mail to unregistered user grzegorz.kolakowski@getindata.com
Not sending mail to unregistered user aljoscha.krettek@gmail.com
Not sending mail to unregistered user joey.baruch@gmail.com
Not sending mail to unregistered user arnaudfournier921@gmail.com
Not sending mail to unregistered user sduskis@google.com
Not sending mail to unregistered user arostami@google.com
Not sending mail to unregistered user lukasz.gajowy@polidea.com
Not sending mail to unregistered user zhouhai02@meituan.com
Not sending mail to unregistered user wtanaka@yahoo.com
Not sending mail to unregistered user yifanzou@yifanzou-linuxworkstation.sea.corp.google.com
Not sending mail to unregistered user willy@bounceexchange.com
Not sending mail to unregistered user apilloud@google.com
Not sending mail to unregistered user wcn@google.com
Not sending mail to unregistered user klk@google.com
Not sending mail to unregistered user andreas.ehrencrona@velik.it
Not sending mail to unregistered user xumingmingv@gmail.com
Not sending mail to unregistered user cclauss@bluewin.ch
Not sending mail to unregistered user luke_zhu@brown.edu
Not sending mail to unregistered user Mottyg1@gmail.com
Not sending mail to unregistered user kirpichov@google.com
Not sending mail to unregistered user mariagh@mariagh.svl.corp.google.com
Not sending mail to unregistered user zoy@giggles.nyc.corp.google.com
Not sending mail to unregistered user gene@telligent-data.com
Not sending mail to unregistered user boyuanz@google.com
Not sending mail to unregistered user robert@frantil.com
Not sending mail to unregistered user 1028332163@qq.com
Not sending mail to unregistered user batbat@batbat-linuxworkstation.sea.corp.google.com
Not sending mail to unregistered user alan.myrvold@comcast.net
Not sending mail to unregistered user jiangkai@gmail.com
Not sending mail to unregistered user melissapa@google.com
Not sending mail to unregistered user fjetumale@gmail.com
Not sending mail to unregistered user ekirpichov@gmail.com
Not sending mail to unregistered user github@alasdairhodge.co.uk
Not sending mail to unregistered user jb@nanthrax.net
Not sending mail to unregistered user rober@frantil.com
Not sending mail to unregistered user axelmagn@gmail.com
Not sending mail to unregistered user pawel.pk.kaczmarczyk@gmail.com
Not sending mail to unregistered user mairbek@google.com
Not sending mail to unregistered user niemo@google.com
Not sending mail to unregistered user szewinho@gmail.com
Not sending mail to unregistered user abhyankar@gmail.com
Not sending mail to unregistered user sidhom@google.com
Not sending mail to unregistered user aaltay@gmail.com
Not sending mail to unregistered user ankurgoenka@gmail.com
Not sending mail to unregistered user ccy@google.com
Not sending mail to unregistered user dcavazos@google.com
Not sending mail to unregistered user dariusz.aniszewski@polidea.com
Not sending mail to unregistered user samuel.waggoner@healthsparq.com
Not sending mail to unregistered user swegner@google.com
Not sending mail to unregistered user amyrvold@google.com
Not sending mail to unregistered user kedin@google.com
Not sending mail to unregistered user arnaudfournier021@gmail.com
Not sending mail to unregistered user ehudm@google.com
Not sending mail to unregistered user holdenkarau@google.com
Not sending mail to unregistered user markliu@google.com
Not sending mail to unregistered user aromanenko.dev@gmail.com
Not sending mail to unregistered user XuMingmin@users.noreply.github.com
Not sending mail to unregistered user daniel.o.programmer@gmail.com
Not sending mail to unregistered user herohde@google.com
Not sending mail to unregistered user mariand@google.com

Mime
View raw message