beam-commits mailing list archives

Site index · List index
Message view « Date » · « Thread »
Top « Date » · « Thread »
From Apache Jenkins Server <jenk...@builds.apache.org>
Subject Build failed in Jenkins: beam_PostCommit_Python_ValidatesRunner_Dataflow #979
Date Fri, 23 Feb 2018 12:12:33 GMT
See <https://builds.apache.org/job/beam_PostCommit_Python_ValidatesRunner_Dataflow/979/display/redirect?page=changes>

Changes:

[aljoscha.krettek] Make parameter of DoFnRunners.lateDataDroppingRunner() more specific

[aljoscha.krettek] Allow overriding DoFnRunners in subclasses of Flink DoFnOperator

[aljoscha.krettek] Invoke finishBundle() before teardown() in DoFnOperator

[aljoscha.krettek] [BEAM-2140] Ignore event-time timers in SplittableDoFnOperator

[aljoscha.krettek] [BEAM-2140] Block DoFnOperator.close() if we have pending timers

[aljoscha.krettek] [BEAM-2140] Don't use StatefulDoFnRunner when running SDF in FlinkRunner

[aljoscha.krettek] Make ProcessFnRunner constructor public

[aljoscha.krettek] [BEAM-2140] Use ProcessFnRunner in DoFnRunner for executing SDF

[aljoscha.krettek] [BEAM-2140] Enable SDF tests for Flink Streaming Runner

[aljoscha.krettek] [BEAM-2140] Enable SDF tests in gradle for Flink Streaming Runner

[aljoscha.krettek] [BEAM-3727] Never shutdown sources in Flink Streaming execution mode

------------------------------------------
[...truncated 119.98 KB...]
    self._batch_setitems(obj.iteritems())
  File "/usr/lib/python2.7/pickle.py", line 681, in _batch_setitems
    save(v)
  File "/usr/lib/python2.7/pickle.py", line 331, in save
    self.save_reduce(obj=obj, *rv)
  File "/usr/lib/python2.7/pickle.py", line 419, in save_reduce
    save(state)
  File "/usr/lib/python2.7/pickle.py", line 286, in save
    f(self, obj) # Call unbound method with explicit self
  File "<https://builds.apache.org/job/beam_PostCommit_Python_ValidatesRunner_Dataflow/ws/src/sdks/python/apache_beam/internal/pickler.py",>
line 165, in new_save_module_dict
    return old_save_module_dict(pickler, obj)
  File "<https://builds.apache.org/job/beam_PostCommit_Python_ValidatesRunner_Dataflow/ws/src/sdks/python/local/lib/python2.7/site-packages/dill/dill.py",>
line 841, in save_module_dict
    StockPickler.save_dict(pickler, obj)
  File "/usr/lib/python2.7/pickle.py", line 649, in save_dict
    self._batch_setitems(obj.iteritems())
  File "/usr/lib/python2.7/pickle.py", line 681, in _batch_setitems
    save(v)
  File "/usr/lib/python2.7/pickle.py", line 286, in save
    f(self, obj) # Call unbound method with explicit self
  File "<https://builds.apache.org/job/beam_PostCommit_Python_ValidatesRunner_Dataflow/ws/src/sdks/python/local/lib/python2.7/site-packages/dill/dill.py",>
line 1311, in save_function
    obj.__dict__), obj=obj)
  File "/usr/lib/python2.7/pickle.py", line 401, in save_reduce
    save(args)
  File "/usr/lib/python2.7/pickle.py", line 286, in save
    f(self, obj) # Call unbound method with explicit self
  File "/usr/lib/python2.7/pickle.py", line 562, in save_tuple
    save(element)
  File "/usr/lib/python2.7/pickle.py", line 286, in save
    f(self, obj) # Call unbound method with explicit self
  File "/usr/lib/python2.7/pickle.py", line 484, in save_string
    self.write(SHORT_BINSTRING + chr(n) + obj)
  File "<https://builds.apache.org/job/beam_PostCommit_Python_ValidatesRunner_Dataflow/ws/src/sdks/python/.eggs/nose-1.3.7-py2.7.egg/nose/plugins/multiprocess.py",>
line 276, in signalhandler
    raise TimedOutException()
TimedOutException: 'test_flattened_side_input (apache_beam.transforms.sideinputs_test.SideInputsTest)'

======================================================================
ERROR: test_iterable_side_input (apache_beam.transforms.sideinputs_test.SideInputsTest)
----------------------------------------------------------------------
Traceback (most recent call last):
  File "<https://builds.apache.org/job/beam_PostCommit_Python_ValidatesRunner_Dataflow/ws/src/sdks/python/.eggs/nose-1.3.7-py2.7.egg/nose/plugins/multiprocess.py",>
line 812, in run
    test(orig)
  File "<https://builds.apache.org/job/beam_PostCommit_Python_ValidatesRunner_Dataflow/ws/src/sdks/python/.eggs/nose-1.3.7-py2.7.egg/nose/case.py",>
line 45, in __call__
    return self.run(*arg, **kwarg)
  File "<https://builds.apache.org/job/beam_PostCommit_Python_ValidatesRunner_Dataflow/ws/src/sdks/python/.eggs/nose-1.3.7-py2.7.egg/nose/case.py",>
line 133, in run
    self.runTest(result)
  File "<https://builds.apache.org/job/beam_PostCommit_Python_ValidatesRunner_Dataflow/ws/src/sdks/python/.eggs/nose-1.3.7-py2.7.egg/nose/case.py",>
line 151, in runTest
    test(result)
  File "/usr/lib/python2.7/unittest/case.py", line 395, in __call__
    return self.run(*args, **kwds)
  File "/usr/lib/python2.7/unittest/case.py", line 331, in run
    testMethod()
  File "<https://builds.apache.org/job/beam_PostCommit_Python_ValidatesRunner_Dataflow/ws/src/sdks/python/apache_beam/transforms/sideinputs_test.py",>
line 178, in test_iterable_side_input
    pipeline.run()
  File "<https://builds.apache.org/job/beam_PostCommit_Python_ValidatesRunner_Dataflow/ws/src/sdks/python/apache_beam/testing/test_pipeline.py",>
line 102, in run
    result = super(TestPipeline, self).run()
  File "<https://builds.apache.org/job/beam_PostCommit_Python_ValidatesRunner_Dataflow/ws/src/sdks/python/apache_beam/pipeline.py",>
line 369, in run
    self.to_runner_api(), self.runner, self._options).run(False)
  File "<https://builds.apache.org/job/beam_PostCommit_Python_ValidatesRunner_Dataflow/ws/src/sdks/python/apache_beam/pipeline.py",>
line 592, in from_runner_api
    p = Pipeline(runner=runner, options=options)
  File "<https://builds.apache.org/job/beam_PostCommit_Python_ValidatesRunner_Dataflow/ws/src/sdks/python/apache_beam/pipeline.py",>
line 145, in __init__
    errors = PipelineOptionsValidator(self._options, runner).validate()
  File "<https://builds.apache.org/job/beam_PostCommit_Python_ValidatesRunner_Dataflow/ws/src/sdks/python/apache_beam/options/pipeline_options_validator.py",>
line 103, in validate
    errors.extend(self.options.view_as(cls).validate(self))
  File "<https://builds.apache.org/job/beam_PostCommit_Python_ValidatesRunner_Dataflow/ws/src/sdks/python/apache_beam/options/pipeline_options.py",>
line 513, in validate
    if validator.is_service_runner():
  File "<https://builds.apache.org/job/beam_PostCommit_Python_ValidatesRunner_Dataflow/ws/src/sdks/python/apache_beam/options/pipeline_options_validator.py",>
line 114, in is_service_runner
    self.options.view_as(GoogleCloudOptions).dataflow_endpoint)
  File "<https://builds.apache.org/job/beam_PostCommit_Python_ValidatesRunner_Dataflow/ws/src/sdks/python/apache_beam/options/pipeline_options.py",>
line 227, in view_as
    view = cls(self._flags)
  File "<https://builds.apache.org/job/beam_PostCommit_Python_ValidatesRunner_Dataflow/ws/src/sdks/python/apache_beam/options/pipeline_options.py",>
line 150, in __init__
    parser = _BeamArgumentParser()
  File "/usr/lib/python2.7/argparse.py", line 1602, in __init__
    help=_('show this help message and exit'))
  File "/usr/lib/python2.7/gettext.py", line 581, in gettext
    return dgettext(_current_domain, message)
  File "/usr/lib/python2.7/gettext.py", line 545, in dgettext
    codeset=_localecodesets.get(domain))
  File "/usr/lib/python2.7/gettext.py", line 480, in translation
    mofiles = find(domain, localedir, languages, all=1)
  File "/usr/lib/python2.7/gettext.py", line 456, in find
    if os.path.exists(mofile):
  File "<https://builds.apache.org/job/beam_PostCommit_Python_ValidatesRunner_Dataflow/ws/src/sdks/python/lib/python2.7/genericpath.py",>
line 18, in exists
    os.stat(path)
  File "<https://builds.apache.org/job/beam_PostCommit_Python_ValidatesRunner_Dataflow/ws/src/sdks/python/.eggs/nose-1.3.7-py2.7.egg/nose/plugins/multiprocess.py",>
line 276, in signalhandler
    raise TimedOutException()
TimedOutException: 'test_iterable_side_input (apache_beam.transforms.sideinputs_test.SideInputsTest)'

======================================================================
ERROR: test_multi_valued_singleton_side_input (apache_beam.transforms.sideinputs_test.SideInputsTest)
----------------------------------------------------------------------
Traceback (most recent call last):
  File "<https://builds.apache.org/job/beam_PostCommit_Python_ValidatesRunner_Dataflow/ws/src/sdks/python/.eggs/nose-1.3.7-py2.7.egg/nose/plugins/multiprocess.py",>
line 812, in run
    test(orig)
  File "<https://builds.apache.org/job/beam_PostCommit_Python_ValidatesRunner_Dataflow/ws/src/sdks/python/.eggs/nose-1.3.7-py2.7.egg/nose/case.py",>
line 45, in __call__
    return self.run(*arg, **kwarg)
  File "<https://builds.apache.org/job/beam_PostCommit_Python_ValidatesRunner_Dataflow/ws/src/sdks/python/.eggs/nose-1.3.7-py2.7.egg/nose/case.py",>
line 133, in run
    self.runTest(result)
  File "<https://builds.apache.org/job/beam_PostCommit_Python_ValidatesRunner_Dataflow/ws/src/sdks/python/.eggs/nose-1.3.7-py2.7.egg/nose/case.py",>
line 151, in runTest
    test(result)
  File "/usr/lib/python2.7/unittest/case.py", line 395, in __call__
    return self.run(*args, **kwds)
  File "/usr/lib/python2.7/unittest/case.py", line 331, in run
    testMethod()
  File "<https://builds.apache.org/job/beam_PostCommit_Python_ValidatesRunner_Dataflow/ws/src/sdks/python/apache_beam/transforms/sideinputs_test.py",>
line 157, in test_multi_valued_singleton_side_input
    pipeline.run()
  File "<https://builds.apache.org/job/beam_PostCommit_Python_ValidatesRunner_Dataflow/ws/src/sdks/python/apache_beam/testing/test_pipeline.py",>
line 102, in run
    result = super(TestPipeline, self).run()
  File "<https://builds.apache.org/job/beam_PostCommit_Python_ValidatesRunner_Dataflow/ws/src/sdks/python/apache_beam/pipeline.py",>
line 369, in run
    self.to_runner_api(), self.runner, self._options).run(False)
  File "<https://builds.apache.org/job/beam_PostCommit_Python_ValidatesRunner_Dataflow/ws/src/sdks/python/apache_beam/pipeline.py",>
line 382, in run
    return self.runner.run_pipeline(self)
  File "<https://builds.apache.org/job/beam_PostCommit_Python_ValidatesRunner_Dataflow/ws/src/sdks/python/apache_beam/runners/dataflow/dataflow_runner.py",>
line 324, in run_pipeline
    self.dataflow_client.create_job(self.job), self)
  File "<https://builds.apache.org/job/beam_PostCommit_Python_ValidatesRunner_Dataflow/ws/src/sdks/python/apache_beam/utils/retry.py",>
line 179, in wrapper
    return fun(*args, **kwargs)
  File "<https://builds.apache.org/job/beam_PostCommit_Python_ValidatesRunner_Dataflow/ws/src/sdks/python/apache_beam/runners/dataflow/internal/apiclient.py",>
line 461, in create_job
    self.create_job_description(job)
  File "<https://builds.apache.org/job/beam_PostCommit_Python_ValidatesRunner_Dataflow/ws/src/sdks/python/apache_beam/runners/dataflow/internal/apiclient.py",>
line 487, in create_job_description
    StringIO(job.proto_pipeline.SerializeToString()))
  File "<https://builds.apache.org/job/beam_PostCommit_Python_ValidatesRunner_Dataflow/ws/src/sdks/python/apache_beam/runners/dataflow/internal/apiclient.py",>
line 443, in stage_file
    response = self._storage_client.objects.Insert(request, upload=upload)
  File "<https://builds.apache.org/job/beam_PostCommit_Python_ValidatesRunner_Dataflow/ws/src/sdks/python/apache_beam/io/gcp/internal/clients/storage/storage_v1_client.py",>
line 971, in Insert
    download=download)
  File "<https://builds.apache.org/job/beam_PostCommit_Python_ValidatesRunner_Dataflow/ws/src/sdks/python/local/lib/python2.7/site-packages/apitools/base/py/base_api.py",>
line 720, in _RunMethod
    http, http_request, **opts)
  File "<https://builds.apache.org/job/beam_PostCommit_Python_ValidatesRunner_Dataflow/ws/src/sdks/python/local/lib/python2.7/site-packages/apitools/base/py/http_wrapper.py",>
line 346, in MakeRequest
    check_response_func=check_response_func)
  File "<https://builds.apache.org/job/beam_PostCommit_Python_ValidatesRunner_Dataflow/ws/src/sdks/python/local/lib/python2.7/site-packages/apitools/base/py/http_wrapper.py",>
line 396, in _MakeRequestNoRetry
    redirections=redirections, connection_type=connection_type)
  File "<https://builds.apache.org/job/beam_PostCommit_Python_ValidatesRunner_Dataflow/ws/src/sdks/python/local/lib/python2.7/site-packages/oauth2client/transport.py",>
line 159, in new_request
    credentials._refresh(orig_request_method)
  File "<https://builds.apache.org/job/beam_PostCommit_Python_ValidatesRunner_Dataflow/ws/src/sdks/python/local/lib/python2.7/site-packages/oauth2client/contrib/gce.py",>
line 128, in _refresh
    self._retrieve_info(http)
  File "<https://builds.apache.org/job/beam_PostCommit_Python_ValidatesRunner_Dataflow/ws/src/sdks/python/local/lib/python2.7/site-packages/oauth2client/contrib/gce.py",>
line 111, in _retrieve_info
    service_account=self.service_account_email or 'default')
  File "<https://builds.apache.org/job/beam_PostCommit_Python_ValidatesRunner_Dataflow/ws/src/sdks/python/local/lib/python2.7/site-packages/oauth2client/contrib/_metadata.py",>
line 96, in get_service_account_info
    recursive=True)
  File "<https://builds.apache.org/job/beam_PostCommit_Python_ValidatesRunner_Dataflow/ws/src/sdks/python/local/lib/python2.7/site-packages/oauth2client/contrib/_metadata.py",>
line 60, in get
    http, url, headers=METADATA_HEADERS)
  File "<https://builds.apache.org/job/beam_PostCommit_Python_ValidatesRunner_Dataflow/ws/src/sdks/python/local/lib/python2.7/site-packages/oauth2client/transport.py",>
line 282, in request
    connection_type=connection_type)
  File "<https://builds.apache.org/job/beam_PostCommit_Python_ValidatesRunner_Dataflow/ws/src/sdks/python/local/lib/python2.7/site-packages/httplib2/__init__.py",>
line 1609, in request
    (response, content) = self._request(conn, authority, uri, request_uri, method, body, headers,
redirections, cachekey)
  File "<https://builds.apache.org/job/beam_PostCommit_Python_ValidatesRunner_Dataflow/ws/src/sdks/python/local/lib/python2.7/site-packages/httplib2/__init__.py",>
line 1351, in _request
    (response, content) = self._conn_request(conn, request_uri, method, body, headers)
  File "<https://builds.apache.org/job/beam_PostCommit_Python_ValidatesRunner_Dataflow/ws/src/sdks/python/local/lib/python2.7/site-packages/httplib2/__init__.py",>
line 1307, in _conn_request
    response = conn.getresponse()
  File "/usr/lib/python2.7/httplib.py", line 1089, in getresponse
    response.begin()
  File "/usr/lib/python2.7/httplib.py", line 476, in begin
    self.msg = HTTPMessage(self.fp, 0)
  File "/usr/lib/python2.7/mimetools.py", line 25, in __init__
    rfc822.Message.__init__(self, fp, seekable)
  File "/usr/lib/python2.7/rfc822.py", line 108, in __init__
    self.readheaders()
  File "/usr/lib/python2.7/httplib.py", line 315, in readheaders
    line = self.fp.readline(_MAXLINE + 1)
  File "/usr/lib/python2.7/socket.py", line 476, in readline
    data = self._sock.recv(self._rbufsize)
  File "<https://builds.apache.org/job/beam_PostCommit_Python_ValidatesRunner_Dataflow/ws/src/sdks/python/.eggs/nose-1.3.7-py2.7.egg/nose/plugins/multiprocess.py",>
line 276, in signalhandler
    raise TimedOutException()
TimedOutException: 'test_multi_valued_singleton_side_input (apache_beam.transforms.sideinputs_test.SideInputsTest)'

======================================================================
ERROR: test_multiple_empty_outputs (apache_beam.transforms.ptransform_test.PTransformTest)
----------------------------------------------------------------------
Traceback (most recent call last):
  File "<https://builds.apache.org/job/beam_PostCommit_Python_ValidatesRunner_Dataflow/ws/src/sdks/python/.eggs/nose-1.3.7-py2.7.egg/nose/plugins/multiprocess.py",>
line 812, in run
    test(orig)
  File "<https://builds.apache.org/job/beam_PostCommit_Python_ValidatesRunner_Dataflow/ws/src/sdks/python/.eggs/nose-1.3.7-py2.7.egg/nose/case.py",>
line 45, in __call__
    return self.run(*arg, **kwarg)
  File "<https://builds.apache.org/job/beam_PostCommit_Python_ValidatesRunner_Dataflow/ws/src/sdks/python/.eggs/nose-1.3.7-py2.7.egg/nose/case.py",>
line 133, in run
    self.runTest(result)
  File "<https://builds.apache.org/job/beam_PostCommit_Python_ValidatesRunner_Dataflow/ws/src/sdks/python/.eggs/nose-1.3.7-py2.7.egg/nose/case.py",>
line 151, in runTest
    test(result)
  File "/usr/lib/python2.7/unittest/case.py", line 395, in __call__
    return self.run(*args, **kwds)
  File "/usr/lib/python2.7/unittest/case.py", line 331, in run
    testMethod()
  File "<https://builds.apache.org/job/beam_PostCommit_Python_ValidatesRunner_Dataflow/ws/src/sdks/python/apache_beam/transforms/ptransform_test.py",>
line 270, in test_multiple_empty_outputs
    pipeline.run()
  File "<https://builds.apache.org/job/beam_PostCommit_Python_ValidatesRunner_Dataflow/ws/src/sdks/python/apache_beam/testing/test_pipeline.py",>
line 104, in run
    state = result.wait_until_finish()
  File "<https://builds.apache.org/job/beam_PostCommit_Python_ValidatesRunner_Dataflow/ws/src/sdks/python/apache_beam/runners/dataflow/dataflow_runner.py",>
line 983, in wait_until_finish
    time.sleep(5.0)
  File "<https://builds.apache.org/job/beam_PostCommit_Python_ValidatesRunner_Dataflow/ws/src/sdks/python/.eggs/nose-1.3.7-py2.7.egg/nose/plugins/multiprocess.py",>
line 276, in signalhandler
    raise TimedOutException()
TimedOutException: 'test_multiple_empty_outputs (apache_beam.transforms.ptransform_test.PTransformTest)'

======================================================================
ERROR: test_par_do_with_multiple_outputs_and_using_return (apache_beam.transforms.ptransform_test.PTransformTest)
----------------------------------------------------------------------
Traceback (most recent call last):
  File "<https://builds.apache.org/job/beam_PostCommit_Python_ValidatesRunner_Dataflow/ws/src/sdks/python/.eggs/nose-1.3.7-py2.7.egg/nose/plugins/multiprocess.py",>
line 812, in run
    test(orig)
  File "<https://builds.apache.org/job/beam_PostCommit_Python_ValidatesRunner_Dataflow/ws/src/sdks/python/.eggs/nose-1.3.7-py2.7.egg/nose/case.py",>
line 45, in __call__
    return self.run(*arg, **kwarg)
  File "<https://builds.apache.org/job/beam_PostCommit_Python_ValidatesRunner_Dataflow/ws/src/sdks/python/.eggs/nose-1.3.7-py2.7.egg/nose/case.py",>
line 133, in run
    self.runTest(result)
  File "<https://builds.apache.org/job/beam_PostCommit_Python_ValidatesRunner_Dataflow/ws/src/sdks/python/.eggs/nose-1.3.7-py2.7.egg/nose/case.py",>
line 151, in runTest
    test(result)
  File "/usr/lib/python2.7/unittest/case.py", line 395, in __call__
    return self.run(*args, **kwds)
  File "/usr/lib/python2.7/unittest/case.py", line 331, in run
    testMethod()
  File "<https://builds.apache.org/job/beam_PostCommit_Python_ValidatesRunner_Dataflow/ws/src/sdks/python/apache_beam/transforms/ptransform_test.py",>
line 244, in test_par_do_with_multiple_outputs_and_using_return
    pipeline.run()
  File "<https://builds.apache.org/job/beam_PostCommit_Python_ValidatesRunner_Dataflow/ws/src/sdks/python/apache_beam/testing/test_pipeline.py",>
line 104, in run
    state = result.wait_until_finish()
  File "<https://builds.apache.org/job/beam_PostCommit_Python_ValidatesRunner_Dataflow/ws/src/sdks/python/apache_beam/runners/dataflow/dataflow_runner.py",>
line 983, in wait_until_finish
    time.sleep(5.0)
  File "<https://builds.apache.org/job/beam_PostCommit_Python_ValidatesRunner_Dataflow/ws/src/sdks/python/.eggs/nose-1.3.7-py2.7.egg/nose/plugins/multiprocess.py",>
line 276, in signalhandler
    raise TimedOutException()
TimedOutException: 'test_par_do_with_multiple_outputs_and_using_return (apache_beam.transforms.ptransform_test.PTransformTest)'

======================================================================
ERROR: test_par_do_with_multiple_outputs_and_using_yield (apache_beam.transforms.ptransform_test.PTransformTest)
----------------------------------------------------------------------
Traceback (most recent call last):
  File "<https://builds.apache.org/job/beam_PostCommit_Python_ValidatesRunner_Dataflow/ws/src/sdks/python/.eggs/nose-1.3.7-py2.7.egg/nose/plugins/multiprocess.py",>
line 812, in run
    test(orig)
  File "<https://builds.apache.org/job/beam_PostCommit_Python_ValidatesRunner_Dataflow/ws/src/sdks/python/.eggs/nose-1.3.7-py2.7.egg/nose/case.py",>
line 45, in __call__
    return self.run(*arg, **kwarg)
  File "<https://builds.apache.org/job/beam_PostCommit_Python_ValidatesRunner_Dataflow/ws/src/sdks/python/.eggs/nose-1.3.7-py2.7.egg/nose/case.py",>
line 133, in run
    self.runTest(result)
  File "<https://builds.apache.org/job/beam_PostCommit_Python_ValidatesRunner_Dataflow/ws/src/sdks/python/.eggs/nose-1.3.7-py2.7.egg/nose/case.py",>
line 151, in runTest
    test(result)
  File "/usr/lib/python2.7/unittest/case.py", line 395, in __call__
    return self.run(*args, **kwds)
  File "/usr/lib/python2.7/unittest/case.py", line 331, in run
    testMethod()
  File "<https://builds.apache.org/job/beam_PostCommit_Python_ValidatesRunner_Dataflow/ws/src/sdks/python/apache_beam/transforms/ptransform_test.py",>
line 228, in test_par_do_with_multiple_outputs_and_using_yield
    pipeline.run()
  File "<https://builds.apache.org/job/beam_PostCommit_Python_ValidatesRunner_Dataflow/ws/src/sdks/python/apache_beam/testing/test_pipeline.py",>
line 104, in run
    state = result.wait_until_finish()
  File "<https://builds.apache.org/job/beam_PostCommit_Python_ValidatesRunner_Dataflow/ws/src/sdks/python/apache_beam/runners/dataflow/dataflow_runner.py",>
line 983, in wait_until_finish
    time.sleep(5.0)
  File "<https://builds.apache.org/job/beam_PostCommit_Python_ValidatesRunner_Dataflow/ws/src/sdks/python/.eggs/nose-1.3.7-py2.7.egg/nose/plugins/multiprocess.py",>
line 276, in signalhandler
    raise TimedOutException()
TimedOutException: 'test_par_do_with_multiple_outputs_and_using_yield (apache_beam.transforms.ptransform_test.PTransformTest)'

----------------------------------------------------------------------
Ran 16 tests in 903.602s

FAILED (errors=16)
Build step 'Execute shell' marked build as failure
Not sending mail to unregistered user aljoscha.krettek@gmail.com
Not sending mail to unregistered user pawel.pk.kaczmarczyk@gmail.com
Not sending mail to unregistered user ankurgoenka@gmail.com

Mime
View raw message