beam-commits mailing list archives

Site index · List index
Message view « Date » · « Thread »
Top « Date » · « Thread »
From Apache Jenkins Server <jenk...@builds.apache.org>
Subject Build failed in Jenkins: beam_PostCommit_Python_Verify #4267
Date Tue, 20 Feb 2018 22:15:31 GMT
See <https://builds.apache.org/job/beam_PostCommit_Python_Verify/4267/display/redirect?page=changes>

Changes:

[kirpichov] Updates BigQuery dependency version

[kirpichov] Updates BigQuery documentation

------------------------------------------
[...truncated 1.40 MB...]
          spec {
            urn: "beam:coder:varint:v1"
          }
        }
      }
    }
    coders {
      key: "ref_Coder_WindowedValueCoder_1"
      value {
        spec {
          spec {
            urn: "beam:coder:windowed_value:v1"
          }
        }
        component_coder_ids: "ref_Coder_TupleCoder_2"
        component_coder_ids: "ref_Coder_GlobalWindowCoder_5"
      }
    }
    coders {
      key: "ref_Coder_WindowedValueCoder_11"
      value {
        spec {
          spec {
            urn: "beam:coder:windowed_value:v1"
          }
        }
        component_coder_ids: "ref_Coder_TupleCoder_12"
        component_coder_ids: "ref_Coder_GlobalWindowCoder_5"
      }
    }
    coders {
      key: "ref_Coder_WindowedValueCoder_13"
      value {
        spec {
          spec {
            urn: "beam:coder:windowed_value:v1"
          }
        }
        component_coder_ids: "ref_Coder_TupleCoder_14"
        component_coder_ids: "ref_Coder_GlobalWindowCoder_5"
      }
    }
    coders {
      key: "ref_Coder_WindowedValueCoder_15"
      value {
        spec {
          spec {
            urn: "beam:coder:windowed_value:v1"
          }
        }
        component_coder_ids: "ref_Coder_TupleCoder_16"
        component_coder_ids: "ref_Coder_GlobalWindowCoder_5"
      }
    }
    coders {
      key: "ref_Coder_WindowedValueCoder_1_bytes"
      value {
        spec {
          spec {
            urn: "beam:coder:windowed_value:v1"
          }
        }
        component_coder_ids: "ref_Coder_TupleCoder_2_bytes"
        component_coder_ids: "ref_Coder_GlobalWindowCoder_5"
      }
    }
    coders {
      key: "ref_Coder_WindowedValueCoder_1_len_prefix"
      value {
        spec {
          spec {
            urn: "beam:coder:windowed_value:v1"
          }
        }
        component_coder_ids: "ref_Coder_TupleCoder_2_len_prefix"
        component_coder_ids: "ref_Coder_GlobalWindowCoder_5"
      }
    }
    coders {
      key: "ref_Coder_WindowedValueCoder_6"
      value {
        spec {
          spec {
            urn: "beam:coder:windowed_value:v1"
          }
        }
        component_coder_ids: "ref_Coder_FastPrimitivesCoder_3"
        component_coder_ids: "ref_Coder_GlobalWindowCoder_5"
      }
    }
    coders {
      key: "ref_Coder_WindowedValueCoder_7"
      value {
        spec {
          spec {
            urn: "beam:coder:windowed_value:v1"
          }
        }
        component_coder_ids: "ref_Coder_VarIntCoder_8"
        component_coder_ids: "ref_Coder_GlobalWindowCoder_5"
      }
    }
    coders {
      key: "ref_Coder_WindowedValueCoder_9"
      value {
        spec {
          spec {
            urn: "beam:coder:windowed_value:v1"
          }
        }
        component_coder_ids: "ref_Coder_TupleCoder_10"
        component_coder_ids: "ref_Coder_GlobalWindowCoder_5"
      }
    }
    coders {
      key: "ref_Coder_WindowedValueCoder_9_bytes"
      value {
        spec {
          spec {
            urn: "beam:coder:windowed_value:v1"
          }
        }
        component_coder_ids: "ref_Coder_TupleCoder_10_bytes"
        component_coder_ids: "ref_Coder_GlobalWindowCoder_5"
      }
    }
    coders {
      key: "ref_Coder_WindowedValueCoder_9_len_prefix"
      value {
        spec {
          spec {
            urn: "beam:coder:windowed_value:v1"
          }
        }
        component_coder_ids: "ref_Coder_TupleCoder_10_len_prefix"
        component_coder_ids: "ref_Coder_GlobalWindowCoder_5"
      }
    }
  }
}

root: DEBUG: CONTROL RESPONSE instruction_id: "control_4"
register {
}

root: DEBUG: CONTROL REQUEST instruction_id: "bundle_1212"
process_bundle {
  process_bundle_descriptor_reference: "3"
}

root: INFO: start <DoOperation assert_that/Match output_tags=['out']>
root: INFO: start <DoOperation assert_that/Unkey output_tags=['out']>
root: INFO: start <DoOperation assert_that/Group/Map(_merge_tagged_vals_under_key) output_tags=['out']>
root: INFO: start <DataInputOperation assert_that/Group/GroupByKey/Read receivers=[ConsumerSet[assert_that/Group/GroupByKey/Read.out0,
coder=WindowedValueCoder[TupleCoder[LengthPrefixCoder[FastPrimitivesCoder], IterableCoder[LengthPrefixCoder[FastPrimitivesCoder]]]],
len(consumers)=1]]>
root: INFO: finish <DataInputOperation assert_that/Group/GroupByKey/Read receivers=[ConsumerSet[assert_that/Group/GroupByKey/Read.out0,
coder=WindowedValueCoder[TupleCoder[LengthPrefixCoder[FastPrimitivesCoder], IterableCoder[LengthPrefixCoder[FastPrimitivesCoder]]]],
len(consumers)=1]]>
root: INFO: finish <DoOperation assert_that/Group/Map(_merge_tagged_vals_under_key) output_tags=['out'],
receivers=[ConsumerSet[assert_that/Group/Map(_merge_tagged_vals_under_key).out0, coder=WindowedValueCoder[FastPrimitivesCoder],
len(consumers)=1]]>
root: INFO: finish <DoOperation assert_that/Unkey output_tags=['out'], receivers=[ConsumerSet[assert_that/Unkey.out0,
coder=WindowedValueCoder[FastPrimitivesCoder], len(consumers)=1]]>
root: INFO: finish <DoOperation assert_that/Match output_tags=['out'], receivers=[ConsumerSet[assert_that/Match.out0,
coder=WindowedValueCoder[FastPrimitivesCoder], len(consumers)=0]]>
root: DEBUG: CONTROL RESPONSE instruction_id: "bundle_1212"
process_bundle {
  metrics {
    ptransforms {
      key: "assert_that/Group/GroupByKey/Read"
      value {
        processed_elements {
          measured {
            output_element_counts {
              key: "None"
              value: 1
            }
          }
        }
      }
    }
    ptransforms {
      key: "assert_that/Group/Map(_merge_tagged_vals_under_key)"
      value {
        processed_elements {
          measured {
            output_element_counts {
              key: "None"
              value: 1
            }
          }
        }
      }
    }
    ptransforms {
      key: "assert_that/Match"
      value {
        processed_elements {
          measured {
            output_element_counts {
              key: "None"
              value: 1
            }
          }
        }
      }
    }
    ptransforms {
      key: "assert_that/Unkey"
      value {
        processed_elements {
          measured {
            output_element_counts {
              key: "None"
              value: 1
            }
          }
        }
      }
    }
  }
}

root: DEBUG: Gather all output data from [].
root: DEBUG: Wait for the bundle to finish.
--------------------- >> end captured logging << ---------------------

======================================================================
FAIL: test_using_slow_impl (apache_beam.coders.slow_coders_test.SlowCoders)
----------------------------------------------------------------------
Traceback (most recent call last):
  File "<https://builds.apache.org/job/beam_PostCommit_Python_Verify/ws/src/sdks/python/apache_beam/coders/slow_coders_test.py",>
line 41, in test_using_slow_impl
    import apache_beam.coders.stream
AssertionError: ImportError not raised

----------------------------------------------------------------------
Ran 1551 tests in 653.123s

FAILED (failures=1, errors=1, skipped=42)
Test failed: <unittest.runner.TextTestResult run=1551 errors=1 failures=1>
error: Test failed: <unittest.runner.TextTestResult run=1551 errors=1 failures=1>
ERROR: InvocationError: '<https://builds.apache.org/job/beam_PostCommit_Python_Verify/ws/src/sdks/python/target/.tox/py27gcp/bin/python>
setup.py test'
___________________________________ summary ____________________________________
ERROR:   cover: commands failed
  docs: commands succeeded
  lint: commands succeeded
ERROR:   py27: commands failed
ERROR:   py27cython: commands failed
ERROR:   py27gcp: commands failed
Build step 'Execute shell' marked build as failure
Not sending mail to unregistered user kirpichov@google.com
Not sending mail to unregistered user cclauss@bluewin.ch
Not sending mail to unregistered user github@alasdairhodge.co.uk
Not sending mail to unregistered user apilloud@google.com
Not sending mail to unregistered user ccy@google.com
Not sending mail to unregistered user dcavazos@google.com

Mime
View raw message