beam-commits mailing list archives

Site index · List index
Message view « Date » · « Thread »
Top « Date » · « Thread »
From Ismaël Mejía (JIRA) <j...@apache.org>
Subject [jira] [Resolved] (BEAM-3531) nexmark failed with NPE with DEFAULT suite
Date Wed, 31 Jan 2018 21:39:00 GMT

     [ https://issues.apache.org/jira/browse/BEAM-3531?page=com.atlassian.jira.plugin.system.issuetabpanels:all-tabpanel
]

Ismaël Mejía resolved BEAM-3531.
--------------------------------
       Resolution: Fixed
    Fix Version/s: 2.4.0

Thanks [~jackyq2015] for this quick workaround.

> nexmark failed with NPE with DEFAULT suite
> ------------------------------------------
>
>                 Key: BEAM-3531
>                 URL: https://issues.apache.org/jira/browse/BEAM-3531
>             Project: Beam
>          Issue Type: Bug
>          Components: sdk-java-core
>    Affects Versions: 2.2.0
>            Reporter: Qi Cui
>            Assignee: Qi Cui
>            Priority: Major
>             Fix For: 2.4.0
>
>
> @:~/src/beam/sdks/java/nexmark$ mvn exec:java -Dexec.mainClass=org.apache.beam.sdk.nexmark.Main
-Pdirect-runner -Dexec.args="--runner=DirectRunner \
> > --suite=DEFAULT --streaming=false --manageResources=false --monitorJobs=true --enforceEncodability=true
--enforceImmutability=true"
> [INFO] Scanning for projects...
> [WARNING] 
> [WARNING] Some problems were encountered while building the effective model for org.apache.beam:beam-sdks-java-nexmark:jar:2.3.0-SNAPSHOT
> [WARNING] The expression ${parent.version} is deprecated. Please use ${project.parent.version}
instead.
> [WARNING] 
> [WARNING] It is highly recommended to fix these problems because they threaten the stability
of your build.
> [WARNING] 
> [WARNING] For this reason, future Maven versions might no longer support building such
malformed projects.
> [WARNING] 
> [INFO] ------------------------------------------------------------------------
> [INFO] Detecting the operating system and CPU architecture
> [INFO] ------------------------------------------------------------------------
> [INFO] os.detected.name: linux
> [INFO] os.detected.arch: x86_64
> [INFO] os.detected.version: 4.13
> [INFO] os.detected.version.major: 4
> [INFO] os.detected.version.minor: 13
> [INFO] os.detected.release: ubuntu
> [INFO] os.detected.release.version: 17.10
> [INFO] os.detected.release.like.ubuntu: true
> [INFO] os.detected.release.like.debian: true
> [INFO] os.detected.classifier: linux-x86_64
> [WARNING] The POM for org.eclipse.m2e:lifecycle-mapping:jar:1.0.0 is missing, no dependency
information available
> [WARNING] Failed to retrieve plugin descriptor for org.eclipse.m2e:lifecycle-mapping:1.0.0:
Plugin org.eclipse.m2e:lifecycle-mapping:1.0.0 or one of its dependencies could not be resolved:
Failure to find org.eclipse.m2e:lifecycle-mapping:jar:1.0.0 in https://repo.maven.apache.org/maven2
was cached in the local repository, resolution will not be reattempted until the update interval
of central has elapsed or updates are forced
> [INFO] 
> [INFO] ------------------------------------------------------------------------
> [INFO] Building Apache Beam :: SDKs :: Java :: Nexmark 2.3.0-SNAPSHOT
> [INFO] ------------------------------------------------------------------------
> [WARNING] The POM for org.eclipse.m2e:lifecycle-mapping:jar:1.0.0 is missing, no dependency
information available
> [WARNING] Failed to retrieve plugin descriptor for org.eclipse.m2e:lifecycle-mapping:1.0.0:
Plugin org.eclipse.m2e:lifecycle-mapping:1.0.0 or one of its dependencies could not be resolved:
Failure to find org.eclipse.m2e:lifecycle-mapping:jar:1.0.0 in https://repo.maven.apache.org/maven2
was cached in the local repository, resolution will not be reattempted until the update interval
of central has elapsed or updates are forced
> [INFO] 
> [INFO] --- exec-maven-plugin:1.5.0:java (default-cli) @ beam-sdks-java-nexmark ---
> 2018-01-25T02:08:13.056Z Running query:0
> ==========================================================================================
> Run started 2018-01-25T02:08:12.987Z and ran for PT0.249S
> Default configuration:
> {"debug":true,"query":0,"sourceType":"DIRECT","sinkType":"DEVNULL","pubSubMode":"COMBINED","numEvents":100000,"numEventGenerators":100,"rateShape":"SINE","firstEventRate":10000,"nextEventRate":10000,"rateUnit":"PER_SECOND","ratePeriodSec":600,"preloadSeconds":0,"streamTimeout":240,"isRateLimited":false,"useWallclockEventTime":false,"avgPersonByteSize":200,"avgAuctionByteSize":500,"avgBidByteSize":100,"hotAuctionRatio":2,"hotSellersRatio":4,"hotBiddersRatio":4,"windowSizeSec":10,"windowPeriodSec":5,"watermarkHoldbackSec":0,"numInFlightAuctions":100,"numActivePeople":1000,"coderStrategy":"HAND","cpuDelayMs":0,"diskBusyBytes":0,"auctionSkip":123,"fanout":5,"maxAuctionsWaitingTime":600,"occasionalDelaySec":3,"probDelayedEvent":0.1,"maxLogEvents":100000,"usePubsubPublishTime":false,"outOfOrderGroupSize":1}
> Configurations:
>  Conf Description
>  0000 query:0
> Performance:
>  Conf Runtime(sec) (Baseline) Events(/sec) (Baseline) Results (Baseline)
>  0000 *** not run ***
> ==========================================================================================
> [WARNING] 
> java.lang.reflect.InvocationTargetException
>  at sun.reflect.NativeMethodAccessorImpl.invoke0 (Native Method)
>  at sun.reflect.NativeMethodAccessorImpl.invoke (NativeMethodAccessorImpl.java:62)
>  at sun.reflect.DelegatingMethodAccessorImpl.invoke (DelegatingMethodAccessorImpl.java:43)
>  at java.lang.reflect.Method.invoke (Method.java:498)
>  at org.codehaus.mojo.exec.ExecJavaMojo$1.run (ExecJavaMojo.java:294)
>  at java.lang.Thread.run (Thread.java:748)
> Caused by: java.lang.NullPointerException
>  at org.apache.beam.sdk.nexmark.NexmarkLauncher.getNexmarkQuery (NexmarkLauncher.java:1160)
>  at org.apache.beam.sdk.nexmark.NexmarkLauncher.run (NexmarkLauncher.java:1077)
>  at org.apache.beam.sdk.nexmark.Main.runAll (Main.java:69)
>  at org.apache.beam.sdk.nexmark.Main.main (Main.java:301)
>  at sun.reflect.NativeMethodAccessorImpl.invoke0 (Native Method)
>  at sun.reflect.NativeMethodAccessorImpl.invoke (NativeMethodAccessorImpl.java:62)
>  at sun.reflect.DelegatingMethodAccessorImpl.invoke (DelegatingMethodAccessorImpl.java:43)
>  at java.lang.reflect.Method.invoke (Method.java:498)
>  at org.codehaus.mojo.exec.ExecJavaMojo$1.run (ExecJavaMojo.java:294)
>  at java.lang.Thread.run (Thread.java:748)
> [INFO] ------------------------------------------------------------------------
> [INFO] BUILD FAILURE
> [INFO] ------------------------------------------------------------------------
> [INFO] Total time: 3.426 s
> [INFO] Finished at: 2018-01-24T21:08:13-05:00
> [INFO] Final Memory: 29M/318M
> [INFO] ------------------------------------------------------------------------
> [ERROR] Failed to execute goal org.codehaus.mojo:exec-maven-plugin:1.5.0:java (default-cli)
on project beam-sdks-java-nexmark: An exception occured while executing the Java class. null:
InvocationTargetException: NullPointerException -> [Help 1]
> [ERROR] 
> [ERROR] To see the full stack trace of the errors, re-run Maven with the -e switch.
> [ERROR] Re-run Maven using the -X switch to enable full debug logging.
> [ERROR] 
> [ERROR] For more information about the errors and possible solutions, please read the
following articles:
> [ERROR] [Help 1] http://cwiki.apache.org/confluence/display/MAVEN/MojoExecutionException
> @:~/src/beam/sdks/java/nexmark$ git describe 
> apache-dataflow-ancestor-9447-gf7dd0505e
>  



--
This message was sent by Atlassian JIRA
(v7.6.3#76005)

Mime
View raw message