beam-commits mailing list archives

Site index · List index
Message view « Date » · « Thread »
Top « Date » · « Thread »
From Apache Jenkins Server <jenk...@builds.apache.org>
Subject Build failed in Jenkins: beam_PostCommit_Java_ValidatesRunner_Flink #4684
Date Sat, 13 Jan 2018 05:20:02 GMT
See <https://builds.apache.org/job/beam_PostCommit_Java_ValidatesRunner_Flink/4684/display/redirect?page=changes>

Changes:

[github] [BEAM-3436] Fix RetryHttpRequestInitializerTest to use fake

------------------------------------------
[...truncated 143.24 KB...]
2018-01-13T05:19:08.949 [INFO] Running org.apache.beam.runners.core.StateTagTest
2018-01-13T05:19:08.960 [INFO] Tests run: 7, Failures: 0, Errors: 0, Skipped: 0, Time elapsed:
0.009 s - in org.apache.beam.runners.core.StateTagTest
2018-01-13T05:19:08.960 [INFO] Running org.apache.beam.runners.core.SplittableParDoProcessFnTest
2018-01-13T05:19:11.712 [INFO] Tests run: 6, Failures: 0, Errors: 0, Skipped: 0, Time elapsed:
2.75 s - in org.apache.beam.runners.core.SplittableParDoProcessFnTest
2018-01-13T05:19:11.712 [INFO] Running org.apache.beam.runners.core.WindowMatchersTest
2018-01-13T05:19:11.716 [INFO] Tests run: 2, Failures: 0, Errors: 0, Skipped: 0, Time elapsed:
0.002 s - in org.apache.beam.runners.core.WindowMatchersTest
2018-01-13T05:19:11.717 [INFO] Running org.apache.beam.runners.core.InMemoryTimerInternalsTest
2018-01-13T05:19:11.730 [INFO] Tests run: 7, Failures: 0, Errors: 0, Skipped: 0, Time elapsed:
0.009 s - in org.apache.beam.runners.core.InMemoryTimerInternalsTest
2018-01-13T05:19:11.733 [INFO] Running org.apache.beam.runners.core.LateDataDroppingDoFnRunnerTest
2018-01-13T05:19:11.736 [INFO] Tests run: 1, Failures: 0, Errors: 0, Skipped: 0, Time elapsed:
0.001 s - in org.apache.beam.runners.core.LateDataDroppingDoFnRunnerTest
2018-01-13T05:19:11.736 [INFO] Running org.apache.beam.runners.core.SimpleDoFnRunnerTest
2018-01-13T05:19:11.913 [INFO] Tests run: 9, Failures: 0, Errors: 0, Skipped: 0, Time elapsed:
0.175 s - in org.apache.beam.runners.core.SimpleDoFnRunnerTest
2018-01-13T05:19:11.913 [INFO] Running org.apache.beam.runners.core.TimerInternalsTest
2018-01-13T05:19:11.922 [INFO] Tests run: 3, Failures: 0, Errors: 0, Skipped: 0, Time elapsed:
0.007 s - in org.apache.beam.runners.core.TimerInternalsTest
2018-01-13T05:19:11.923 [INFO] Running org.apache.beam.runners.core.InMemoryStateInternalsTest$StandardStateInternalsTests
2018-01-13T05:19:11.948 [INFO] Tests run: 23, Failures: 0, Errors: 0, Skipped: 0, Time elapsed:
0.022 s - in org.apache.beam.runners.core.InMemoryStateInternalsTest$StandardStateInternalsTests
2018-01-13T05:19:11.948 [INFO] Running org.apache.beam.runners.core.InMemoryStateInternalsTest$OtherTests
2018-01-13T05:19:11.950 [INFO] Tests run: 1, Failures: 0, Errors: 0, Skipped: 0, Time elapsed:
0 s - in org.apache.beam.runners.core.InMemoryStateInternalsTest$OtherTests
2018-01-13T05:19:11.950 [INFO] Running org.apache.beam.runners.core.InMemoryMultimapSideInputViewTest
2018-01-13T05:19:11.953 [INFO] Tests run: 2, Failures: 0, Errors: 0, Skipped: 0, Time elapsed:
0.001 s - in org.apache.beam.runners.core.InMemoryMultimapSideInputViewTest
2018-01-13T05:19:11.953 [INFO] Running org.apache.beam.runners.core.triggers.FinishedTriggersSetTest
2018-01-13T05:19:11.956 [INFO] Tests run: 3, Failures: 0, Errors: 0, Skipped: 0, Time elapsed:
0.001 s - in org.apache.beam.runners.core.triggers.FinishedTriggersSetTest
2018-01-13T05:19:11.957 [INFO] Running org.apache.beam.runners.core.triggers.OrFinallyStateMachineTest
2018-01-13T05:19:11.973 [INFO] Tests run: 5, Failures: 0, Errors: 0, Skipped: 0, Time elapsed:
0.014 s - in org.apache.beam.runners.core.triggers.OrFinallyStateMachineTest
2018-01-13T05:19:11.973 [INFO] Running org.apache.beam.runners.core.triggers.TriggerStateMachinesTest
2018-01-13T05:19:11.990 [INFO] Tests run: 12, Failures: 0, Errors: 0, Skipped: 0, Time elapsed:
0.014 s - in org.apache.beam.runners.core.triggers.TriggerStateMachinesTest
2018-01-13T05:19:11.990 [INFO] Running org.apache.beam.runners.core.triggers.NeverStateMachineTest
2018-01-13T05:19:11.993 [INFO] Tests run: 1, Failures: 0, Errors: 0, Skipped: 0, Time elapsed:
0.001 s - in org.apache.beam.runners.core.triggers.NeverStateMachineTest
2018-01-13T05:19:11.993 [INFO] Running org.apache.beam.runners.core.triggers.TriggerStateMachineTest
2018-01-13T05:19:11.996 [INFO] Tests run: 2, Failures: 0, Errors: 0, Skipped: 0, Time elapsed:
0.001 s - in org.apache.beam.runners.core.triggers.TriggerStateMachineTest
2018-01-13T05:19:11.996 [INFO] Running org.apache.beam.runners.core.triggers.AfterFirstStateMachineTest
2018-01-13T05:19:12.018 [INFO] Tests run: 5, Failures: 0, Errors: 0, Skipped: 0, Time elapsed:
0.019 s - in org.apache.beam.runners.core.triggers.AfterFirstStateMachineTest
2018-01-13T05:19:12.018 [INFO] Running org.apache.beam.runners.core.triggers.RepeatedlyStateMachineTest
2018-01-13T05:19:12.027 [INFO] Tests run: 8, Failures: 0, Errors: 0, Skipped: 0, Time elapsed:
0.007 s - in org.apache.beam.runners.core.triggers.RepeatedlyStateMachineTest
2018-01-13T05:19:12.027 [INFO] Running org.apache.beam.runners.core.triggers.AfterWatermarkStateMachineTest
2018-01-13T05:19:12.048 [INFO] Tests run: 15, Failures: 0, Errors: 0, Skipped: 0, Time elapsed:
0.019 s - in org.apache.beam.runners.core.triggers.AfterWatermarkStateMachineTest
2018-01-13T05:19:12.048 [INFO] Running org.apache.beam.runners.core.triggers.AfterEachStateMachineTest
2018-01-13T05:19:12.050 [INFO] Tests run: 2, Failures: 0, Errors: 0, Skipped: 0, Time elapsed:
0 s - in org.apache.beam.runners.core.triggers.AfterEachStateMachineTest
2018-01-13T05:19:12.050 [INFO] Running org.apache.beam.runners.core.triggers.FinishedTriggersBitSetTest
2018-01-13T05:19:12.053 [INFO] Tests run: 3, Failures: 0, Errors: 0, Skipped: 0, Time elapsed:
0 s - in org.apache.beam.runners.core.triggers.FinishedTriggersBitSetTest
2018-01-13T05:19:12.053 [INFO] Running org.apache.beam.runners.core.triggers.ExecutableTriggerStateMachineTest
2018-01-13T05:19:12.055 [INFO] Tests run: 3, Failures: 0, Errors: 0, Skipped: 0, Time elapsed:
0 s - in org.apache.beam.runners.core.triggers.ExecutableTriggerStateMachineTest
2018-01-13T05:19:12.055 [INFO] Running org.apache.beam.runners.core.triggers.DefaultTriggerStateMachineTest
2018-01-13T05:19:12.057 [INFO] Tests run: 3, Failures: 0, Errors: 0, Skipped: 0, Time elapsed:
0.001 s - in org.apache.beam.runners.core.triggers.DefaultTriggerStateMachineTest
2018-01-13T05:19:12.059 [INFO] Running org.apache.beam.runners.core.triggers.AfterAllStateMachineTest
2018-01-13T05:19:12.062 [INFO] Tests run: 4, Failures: 0, Errors: 0, Skipped: 0, Time elapsed:
0.001 s - in org.apache.beam.runners.core.triggers.AfterAllStateMachineTest
2018-01-13T05:19:12.069 [INFO] Running org.apache.beam.runners.core.triggers.ReshuffleTriggerStateMachineTest
2018-01-13T05:19:12.070 [INFO] Tests run: 3, Failures: 0, Errors: 0, Skipped: 0, Time elapsed:
0 s - in org.apache.beam.runners.core.triggers.ReshuffleTriggerStateMachineTest
2018-01-13T05:19:12.070 [INFO] Running org.apache.beam.runners.core.triggers.AfterProcessingTimeStateMachineTest
2018-01-13T05:19:12.071 [INFO] Tests run: 7, Failures: 0, Errors: 0, Skipped: 0, Time elapsed:
0 s - in org.apache.beam.runners.core.triggers.AfterProcessingTimeStateMachineTest
2018-01-13T05:19:12.071 [INFO] Running org.apache.beam.runners.core.triggers.AfterPaneStateMachineTest
2018-01-13T05:19:12.072 [INFO] Tests run: 4, Failures: 0, Errors: 0, Skipped: 0, Time elapsed:
0 s - in org.apache.beam.runners.core.triggers.AfterPaneStateMachineTest
2018-01-13T05:19:12.072 [INFO] Running org.apache.beam.runners.core.triggers.AfterSynchronizedProcessingTimeStateMachineTest
2018-01-13T05:19:12.073 [INFO] Tests run: 2, Failures: 0, Errors: 0, Skipped: 0, Time elapsed:
0 s - in org.apache.beam.runners.core.triggers.AfterSynchronizedProcessingTimeStateMachineTest
2018-01-13T05:19:12.481 [INFO] 
2018-01-13T05:19:12.481 [INFO] Results:
2018-01-13T05:19:12.481 [INFO] 
2018-01-13T05:19:12.482 [INFO] Tests run: 236, Failures: 0, Errors: 0, Skipped: 0
2018-01-13T05:19:12.482 [INFO] 
[JENKINS] Recording test results
2018-01-13T05:19:12.914 [INFO] 
2018-01-13T05:19:12.914 [INFO] --- build-helper-maven-plugin:3.0.0:regex-properties (render-artifact-id)
@ beam-runners-core-java ---
2018-01-13T05:19:13.021 [INFO] 
2018-01-13T05:19:13.021 [INFO] --- jacoco-maven-plugin:0.7.8:report (report) @ beam-runners-core-java
---
2018-01-13T05:19:13.023 [INFO] Loading execution data file <https://builds.apache.org/job/beam_PostCommit_Java_ValidatesRunner_Flink/ws/src/runners/core-java/target/jacoco.exec>
2018-01-13T05:19:13.060 [INFO] Analyzed bundle 'Apache Beam :: Runners :: Core Java' with
196 classes
2018-01-13T05:19:13.647 [INFO] 
2018-01-13T05:19:13.647 [INFO] --- maven-jar-plugin:3.0.2:jar (default-jar) @ beam-runners-core-java
---
2018-01-13T05:19:13.685 [INFO] Building jar: <https://builds.apache.org/job/beam_PostCommit_Java_ValidatesRunner_Flink/ws/src/runners/core-java/target/beam-runners-core-java-2.3.0-SNAPSHOT.jar>
2018-01-13T05:19:13.820 [INFO] 
2018-01-13T05:19:13.820 [INFO] --- maven-site-plugin:3.5.1:attach-descriptor (attach-descriptor)
@ beam-runners-core-java ---
2018-01-13T05:19:14.033 [INFO] 
2018-01-13T05:19:14.033 [INFO] --- maven-jar-plugin:3.0.2:test-jar (default-test-jar) @ beam-runners-core-java
---
2018-01-13T05:19:14.045 [INFO] Building jar: <https://builds.apache.org/job/beam_PostCommit_Java_ValidatesRunner_Flink/ws/src/runners/core-java/target/beam-runners-core-java-2.3.0-SNAPSHOT-tests.jar>
2018-01-13T05:19:14.428 [INFO] 
2018-01-13T05:19:14.428 [INFO] --- maven-shade-plugin:3.0.0:shade (bundle-and-repackage) @
beam-runners-core-java ---
2018-01-13T05:19:14.431 [INFO] Excluding org.apache.beam:beam-model-pipeline:jar:2.3.0-SNAPSHOT
from the shaded jar.
2018-01-13T05:19:14.431 [INFO] Excluding com.google.protobuf:protobuf-java:jar:3.2.0 from
the shaded jar.
2018-01-13T05:19:14.431 [INFO] Excluding org.apache.beam:beam-sdks-java-core:jar:2.3.0-SNAPSHOT
from the shaded jar.
2018-01-13T05:19:14.431 [INFO] Excluding com.fasterxml.jackson.core:jackson-core:jar:2.8.9
from the shaded jar.
2018-01-13T05:19:14.431 [INFO] Excluding com.fasterxml.jackson.core:jackson-annotations:jar:2.8.9
from the shaded jar.
2018-01-13T05:19:14.431 [INFO] Excluding com.fasterxml.jackson.core:jackson-databind:jar:2.8.9
from the shaded jar.
2018-01-13T05:19:14.431 [INFO] Excluding org.slf4j:slf4j-api:jar:1.7.25 from the shaded jar.
2018-01-13T05:19:14.431 [INFO] Excluding net.bytebuddy:byte-buddy:jar:1.6.8 from the shaded
jar.
2018-01-13T05:19:14.431 [INFO] Excluding org.apache.avro:avro:jar:1.8.2 from the shaded jar.
2018-01-13T05:19:14.431 [INFO] Excluding org.codehaus.jackson:jackson-core-asl:jar:1.9.13
from the shaded jar.
2018-01-13T05:19:14.431 [INFO] Excluding org.codehaus.jackson:jackson-mapper-asl:jar:1.9.13
from the shaded jar.
2018-01-13T05:19:14.431 [INFO] Excluding com.thoughtworks.paranamer:paranamer:jar:2.7 from
the shaded jar.
2018-01-13T05:19:14.431 [INFO] Excluding org.tukaani:xz:jar:1.5 from the shaded jar.
2018-01-13T05:19:14.431 [INFO] Excluding org.xerial.snappy:snappy-java:jar:1.1.4 from the
shaded jar.
2018-01-13T05:19:14.431 [INFO] Excluding org.apache.commons:commons-compress:jar:1.14 from
the shaded jar.
2018-01-13T05:19:14.431 [INFO] Excluding org.apache.commons:commons-lang3:jar:3.6 from the
shaded jar.
2018-01-13T05:19:14.431 [INFO] Excluding org.apache.beam:beam-runners-core-construction-java:jar:2.3.0-SNAPSHOT
from the shaded jar.
2018-01-13T05:19:14.431 [INFO] Excluding org.apache.beam:beam-model-job-management:jar:2.3.0-SNAPSHOT
from the shaded jar.
2018-01-13T05:19:14.431 [INFO] Excluding io.grpc:grpc-protobuf:jar:1.2.0 from the shaded jar.
2018-01-13T05:19:14.431 [INFO] Excluding io.grpc:grpc-protobuf-lite:jar:1.2.0 from the shaded
jar.
2018-01-13T05:19:14.431 [INFO] Excluding com.google.protobuf:protobuf-java-util:jar:3.2.0
from the shaded jar.
2018-01-13T05:19:14.431 [INFO] Excluding com.google.code.gson:gson:jar:2.7 from the shaded
jar.
2018-01-13T05:19:14.431 [INFO] Excluding io.grpc:grpc-core:jar:1.2.0 from the shaded jar.
2018-01-13T05:19:14.431 [INFO] Excluding com.google.errorprone:error_prone_annotations:jar:2.0.15
from the shaded jar.
2018-01-13T05:19:14.431 [INFO] Excluding io.grpc:grpc-context:jar:1.2.0 from the shaded jar.
2018-01-13T05:19:14.431 [INFO] Excluding com.google.instrumentation:instrumentation-api:jar:0.3.0
from the shaded jar.
2018-01-13T05:19:14.431 [INFO] Excluding io.grpc:grpc-stub:jar:1.2.0 from the shaded jar.
2018-01-13T05:19:14.432 [INFO] Excluding com.github.stephenc.findbugs:findbugs-annotations:jar:1.3.9-1
from the shaded jar.
2018-01-13T05:19:14.432 [INFO] Excluding com.google.code.findbugs:jsr305:jar:3.0.1 from the
shaded jar.
2018-01-13T05:19:14.432 [INFO] Including com.google.guava:guava:jar:20.0 in the shaded jar.
2018-01-13T05:19:14.432 [INFO] Excluding joda-time:joda-time:jar:2.4 from the shaded jar.
2018-01-13T05:19:16.501 [INFO] Replacing original artifact with shaded artifact.
2018-01-13T05:19:16.501 [INFO] Replacing <https://builds.apache.org/job/beam_PostCommit_Java_ValidatesRunner_Flink/ws/src/runners/core-java/target/beam-runners-core-java-2.3.0-SNAPSHOT.jar>
with <https://builds.apache.org/job/beam_PostCommit_Java_ValidatesRunner_Flink/ws/src/runners/core-java/target/beam-runners-core-java-2.3.0-SNAPSHOT-shaded.jar>
2018-01-13T05:19:16.502 [INFO] Replacing original test artifact with shaded test artifact.
2018-01-13T05:19:16.502 [INFO] Replacing <https://builds.apache.org/job/beam_PostCommit_Java_ValidatesRunner_Flink/ws/src/runners/core-java/target/beam-runners-core-java-2.3.0-SNAPSHOT-tests.jar>
with <https://builds.apache.org/job/beam_PostCommit_Java_ValidatesRunner_Flink/ws/src/runners/core-java/target/beam-runners-core-java-2.3.0-SNAPSHOT-shaded-tests.jar>
2018-01-13T05:19:16.502 [INFO] Dependency-reduced POM written at: <https://builds.apache.org/job/beam_PostCommit_Java_ValidatesRunner_Flink/ws/src/runners/core-java/dependency-reduced-pom.xml>
2018-01-13T05:19:16.708 [INFO] 
2018-01-13T05:19:16.708 [INFO] --- maven-dependency-plugin:3.0.1:analyze-only (default) @
beam-runners-core-java ---
2018-01-13T05:19:16.805 [INFO] No dependency problems found
[JENKINS] Archiving disabled
2018-01-13T05:19:18.430 [INFO]                                                           
             
2018-01-13T05:19:18.430 [INFO] ------------------------------------------------------------------------
2018-01-13T05:19:18.430 [INFO] Building Apache Beam :: Runners :: Flink 2.3.0-SNAPSHOT
2018-01-13T05:19:18.430 [INFO] ------------------------------------------------------------------------
2018-01-13T05:19:19.101 [INFO] 
2018-01-13T05:19:19.101 [INFO] --- maven-clean-plugin:3.0.0:clean (default-clean) @ beam-runners-flink_2.11
---
2018-01-13T05:19:19.115 [INFO] Deleting <https://builds.apache.org/job/beam_PostCommit_Java_ValidatesRunner_Flink/ws/src/runners/flink>
(includes = [**/*.pyc, **/*.egg-info/, **/sdks/python/LICENSE, **/sdks/python/NOTICE, **/sdks/python/README.md,
**/sdks/python/apache_beam/portability/api/*pb2*.*, **/sdks/python/**/*.c, **/sdks/python/**/*.so,
**/sdks/python/**/*.egg], excludes = [])
2018-01-13T05:19:19.229 [INFO] 
2018-01-13T05:19:19.229 [INFO] --- maven-enforcer-plugin:3.0.0-M1:enforce (enforce) @ beam-runners-flink_2.11
---
2018-01-13T05:19:24.555 [INFO] 
2018-01-13T05:19:24.556 [INFO] --- maven-enforcer-plugin:3.0.0-M1:enforce (enforce-banned-dependencies)
@ beam-runners-flink_2.11 ---
2018-01-13T05:19:24.764 [INFO] 
2018-01-13T05:19:24.765 [INFO] --- maven-remote-resources-plugin:1.5:process (process-resource-bundles)
@ beam-runners-flink_2.11 ---
2018-01-13T05:19:25.844 [INFO] 
2018-01-13T05:19:25.845 [INFO] --- maven-resources-plugin:3.0.2:resources (default-resources)
@ beam-runners-flink_2.11 ---
2018-01-13T05:19:25.848 [INFO] Using 'UTF-8' encoding to copy filtered resources.
2018-01-13T05:19:25.848 [INFO] Copying 1 resource
2018-01-13T05:19:25.867 [INFO] Copying 3 resources
2018-01-13T05:19:25.975 [INFO] 
2018-01-13T05:19:25.975 [INFO] --- maven-compiler-plugin:3.6.2:compile (default-compile) @
beam-runners-flink_2.11 ---
2018-01-13T05:19:26.010 [INFO] Changes detected - recompiling the module!
2018-01-13T05:19:26.019 [INFO] Compiling 75 source files to <https://builds.apache.org/job/beam_PostCommit_Java_ValidatesRunner_Flink/ws/src/runners/flink/target/classes>
2018-01-13T05:19:28.497 [WARNING] bootstrap class path not set in conjunction with -source
1.7
2018-01-13T05:19:28.498 [INFO] <https://builds.apache.org/job/beam_PostCommit_Java_ValidatesRunner_Flink/ws/src/runners/flink/src/main/java/org/apache/beam/runners/flink/translation/wrappers/streaming/io/DedupingOperator.java>:
Some input files use or override a deprecated API.
2018-01-13T05:19:28.498 [INFO] <https://builds.apache.org/job/beam_PostCommit_Java_ValidatesRunner_Flink/ws/src/runners/flink/src/main/java/org/apache/beam/runners/flink/translation/wrappers/streaming/io/DedupingOperator.java>:
Recompile with -Xlint:deprecation for details.
2018-01-13T05:19:28.498 [INFO] <https://builds.apache.org/job/beam_PostCommit_Java_ValidatesRunner_Flink/ws/src/runners/flink/src/main/java/org/apache/beam/runners/flink/FlinkStreamingPipelineTranslator.java>:
Some input files use unchecked or unsafe operations.
2018-01-13T05:19:28.498 [INFO] <https://builds.apache.org/job/beam_PostCommit_Java_ValidatesRunner_Flink/ws/src/runners/flink/src/main/java/org/apache/beam/runners/flink/FlinkStreamingPipelineTranslator.java>:
Recompile with -Xlint:unchecked for details.
2018-01-13T05:19:29.164 [INFO] 
2018-01-13T05:19:29.164 [INFO] --- maven-resources-plugin:3.0.2:testResources (default-testResources)
@ beam-runners-flink_2.11 ---
2018-01-13T05:19:29.166 [INFO] Using 'UTF-8' encoding to copy filtered resources.
2018-01-13T05:19:29.166 [INFO] Copying 1 resource
2018-01-13T05:19:29.223 [INFO] Copying 3 resources
2018-01-13T05:19:29.369 [INFO] 
2018-01-13T05:19:29.369 [INFO] --- maven-compiler-plugin:3.6.2:testCompile (default-testCompile)
@ beam-runners-flink_2.11 ---
2018-01-13T05:19:29.393 [INFO] Changes detected - recompiling the module!
2018-01-13T05:19:29.394 [INFO] Compiling 18 source files to <https://builds.apache.org/job/beam_PostCommit_Java_ValidatesRunner_Flink/ws/src/runners/flink/target/test-classes>
2018-01-13T05:19:30.402 [INFO] <https://builds.apache.org/job/beam_PostCommit_Java_ValidatesRunner_Flink/ws/src/runners/flink/src/test/java/org/apache/beam/runners/flink/streaming/DoFnOperatorTest.java>:
Some input files use unchecked or unsafe operations.
2018-01-13T05:19:30.402 [INFO] <https://builds.apache.org/job/beam_PostCommit_Java_ValidatesRunner_Flink/ws/src/runners/flink/src/test/java/org/apache/beam/runners/flink/streaming/DoFnOperatorTest.java>:
Recompile with -Xlint:unchecked for details.
2018-01-13T05:19:30.610 [INFO] 
2018-01-13T05:19:30.610 [INFO] --- maven-checkstyle-plugin:2.17:check (default) @ beam-runners-flink_2.11
---
2018-01-13T05:19:33.692 [INFO] Starting audit...
[ERROR] <https://builds.apache.org/job/beam_PostCommit_Java_ValidatesRunner_Flink/ws/src/runners/flink/src/main/java/org/apache/beam/runners/flink/FlinkPipelineExecutionEnvironment.java>:23:8:
Unused import: org.apache.beam.runners.core.construction.PipelineTranslation. [UnusedImports]
Audit done.
2018-01-13T05:19:33.692 [INFO] There is 1 error reported by Checkstyle 6.19 with beam/checkstyle.xml
ruleset.
2018-01-13T05:19:33.696 [ERROR] src/main/java/org/apache/beam/runners/flink/FlinkPipelineExecutionEnvironment.java:[23,8]
(imports) UnusedImports: Unused import: org.apache.beam.runners.core.construction.PipelineTranslation.
[JENKINS] Archiving disabled
[JENKINS] Archiving disabled
[JENKINS] Archiving disabled
[JENKINS] Archiving disabled
[JENKINS] Archiving disabled
[JENKINS] Archiving disabled
[JENKINS] Archiving disabled
[JENKINS] Archiving disabled
[JENKINS] Archiving disabled
[JENKINS] Archiving disabled
[JENKINS] Archiving disabled
[JENKINS] Archiving disabled
[JENKINS] Archiving disabled
[JENKINS] Archiving disabled
2018-01-13T05:19:42.812 [INFO] ------------------------------------------------------------------------
2018-01-13T05:19:42.812 [INFO] Reactor Summary:
2018-01-13T05:19:42.812 [INFO] 
2018-01-13T05:19:42.812 [INFO] Apache Beam :: Parent .............................. SUCCESS
[  8.048 s]
2018-01-13T05:19:42.812 [INFO] Apache Beam :: SDKs :: Java :: Build Tools ......... SUCCESS
[  8.383 s]
2018-01-13T05:19:42.812 [INFO] Apache Beam :: Model ............................... SUCCESS
[  2.872 s]
2018-01-13T05:19:42.812 [INFO] Apache Beam :: Model :: Pipeline ................... SUCCESS
[  9.192 s]
2018-01-13T05:19:42.812 [INFO] Apache Beam :: Model :: Job Management ............. SUCCESS
[  7.184 s]
2018-01-13T05:19:42.812 [INFO] Apache Beam :: Model :: Fn Execution ............... SUCCESS
[  7.549 s]
2018-01-13T05:19:42.812 [INFO] Apache Beam :: SDKs ................................ SUCCESS
[  2.298 s]
2018-01-13T05:19:42.812 [INFO] Apache Beam :: SDKs :: Java ........................ SUCCESS
[  2.396 s]
2018-01-13T05:19:42.812 [INFO] Apache Beam :: SDKs :: Java :: Core ................ SUCCESS
[02:21 min]
2018-01-13T05:19:42.812 [INFO] Apache Beam :: Runners ............................. SUCCESS
[  2.282 s]
2018-01-13T05:19:42.812 [INFO] Apache Beam :: Runners :: Core Construction Java ... SUCCESS
[ 19.465 s]
2018-01-13T05:19:42.813 [INFO] Apache Beam :: Runners :: Core Java ................ SUCCESS
[ 30.115 s]
2018-01-13T05:19:42.813 [INFO] Apache Beam :: Runners :: Flink .................... FAILURE
[ 15.752 s]
2018-01-13T05:19:42.813 [INFO] ------------------------------------------------------------------------
2018-01-13T05:19:42.813 [INFO] BUILD FAILURE
2018-01-13T05:19:42.813 [INFO] ------------------------------------------------------------------------
2018-01-13T05:19:42.813 [INFO] Total time: 05:31 min
2018-01-13T05:19:42.813 [INFO] Finished at: 2018-01-13T05:19:42+00:00
2018-01-13T05:19:43.567 [INFO] Final Memory: 139M/1721M
2018-01-13T05:19:43.567 [INFO] ------------------------------------------------------------------------
2018-01-13T05:19:43.567 [WARNING] The requested profile "validates-runner-tests" could not
be activated because it does not exist.
2018-01-13T05:19:43.571 [ERROR] Failed to execute goal org.apache.maven.plugins:maven-checkstyle-plugin:2.17:check
(default) on project beam-runners-flink_2.11: You have 1 Checkstyle violation. -> [Help
1]
org.apache.maven.lifecycle.LifecycleExecutionException: Failed to execute goal org.apache.maven.plugins:maven-checkstyle-plugin:2.17:check
(default) on project beam-runners-flink_2.11: You have 1 Checkstyle violation.
	at org.apache.maven.lifecycle.internal.MojoExecutor.execute(MojoExecutor.java:212)
	at org.apache.maven.lifecycle.internal.MojoExecutor.execute(MojoExecutor.java:153)
	at org.apache.maven.lifecycle.internal.MojoExecutor.execute(MojoExecutor.java:145)
	at org.apache.maven.lifecycle.internal.LifecycleModuleBuilder.buildProject(LifecycleModuleBuilder.java:116)
	at org.apache.maven.lifecycle.internal.LifecycleModuleBuilder.buildProject(LifecycleModuleBuilder.java:80)
	at org.apache.maven.lifecycle.internal.builder.singlethreaded.SingleThreadedBuilder.build(SingleThreadedBuilder.java:51)
	at org.apache.maven.lifecycle.internal.LifecycleStarter.execute(LifecycleStarter.java:128)
	at org.apache.maven.DefaultMaven.doExecute(DefaultMaven.java:307)
	at org.apache.maven.DefaultMaven.doExecute(DefaultMaven.java:193)
	at org.apache.maven.DefaultMaven.execute(DefaultMaven.java:106)
	at org.jvnet.hudson.maven3.launcher.Maven33Launcher.main(Maven33Launcher.java:129)
	at sun.reflect.NativeMethodAccessorImpl.invoke0(Native Method)
	at sun.reflect.NativeMethodAccessorImpl.invoke(NativeMethodAccessorImpl.java:62)
	at sun.reflect.DelegatingMethodAccessorImpl.invoke(DelegatingMethodAccessorImpl.java:43)
	at java.lang.reflect.Method.invoke(Method.java:498)
	at org.codehaus.plexus.classworlds.launcher.Launcher.launchStandard(Launcher.java:330)
	at org.codehaus.plexus.classworlds.launcher.Launcher.launch(Launcher.java:238)
	at jenkins.maven3.agent.Maven33Main.launch(Maven33Main.java:176)
	at sun.reflect.NativeMethodAccessorImpl.invoke0(Native Method)
	at sun.reflect.NativeMethodAccessorImpl.invoke(NativeMethodAccessorImpl.java:62)
	at sun.reflect.DelegatingMethodAccessorImpl.invoke(DelegatingMethodAccessorImpl.java:43)
	at java.lang.reflect.Method.invoke(Method.java:498)
	at hudson.maven.Maven3Builder.call(Maven3Builder.java:139)
	at hudson.maven.Maven3Builder.call(Maven3Builder.java:70)
	at hudson.remoting.UserRequest.perform(UserRequest.java:207)
	at hudson.remoting.UserRequest.perform(UserRequest.java:53)
	at hudson.remoting.Request$2.run(Request.java:358)
	at hudson.remoting.InterceptingExecutorService$1.call(InterceptingExecutorService.java:72)
	at java.util.concurrent.FutureTask.run(FutureTask.java:266)
	at java.util.concurrent.ThreadPoolExecutor.runWorker(ThreadPoolExecutor.java:1149)
	at java.util.concurrent.ThreadPoolExecutor$Worker.run(ThreadPoolExecutor.java:624)
	at java.lang.Thread.run(Thread.java:748)
Caused by: org.apache.maven.plugin.MojoFailureException: You have 1 Checkstyle violation.
	at org.apache.maven.plugin.checkstyle.CheckstyleViolationCheckMojo.execute(CheckstyleViolationCheckMojo.java:588)
	at org.apache.maven.plugin.DefaultBuildPluginManager.executeMojo(DefaultBuildPluginManager.java:134)
	at org.apache.maven.lifecycle.internal.MojoExecutor.execute(MojoExecutor.java:208)
	... 31 more
2018-01-13T05:19:43.572 [ERROR] 
2018-01-13T05:19:43.572 [ERROR] Re-run Maven using the -X switch to enable full debug logging.
2018-01-13T05:19:43.572 [ERROR] 
2018-01-13T05:19:43.572 [ERROR] For more information about the errors and possible solutions,
please read the following articles:
2018-01-13T05:19:43.572 [ERROR] [Help 1] http://cwiki.apache.org/confluence/display/MAVEN/MojoFailureException
2018-01-13T05:19:43.572 [ERROR] 
2018-01-13T05:19:43.572 [ERROR] After correcting the problems, you can resume the build with
the command
2018-01-13T05:19:43.572 [ERROR]   mvn <goals> -rf :beam-runners-flink_2.11
channel stopped
Not sending mail to unregistered user sidhom@google.com
Not sending mail to unregistered user github@alasdairhodge.co.uk

Mime
View raw message